jeu d'échecs
created: 2013-11-29T00:00:00+01:00
modified: 2014-12-30T13:10:07+01:00
status: 1
type: Concept
alternative label: échiquier
broader: T69-6376
definition: Éléments nécessaires à la pratique du jeu d'échecs : un plateau ou échiquier, formé de soixante-quatre cases de deux couleurs alternées (claire et sombre) et de trente-deux pièces de l'une ou l'autre couleur (deux rois, deux dames, quatre tours, quatre fous, quatre cavaliers et seize pions), que se répartissent les deux joueurs.
in scheme: T69
preferred label: chess sets @en-us