jouet miniature
created: 2013-11-29T00:00:00+01:00
modified: 2014-12-30T13:17:23+01:00
status: 1
type: Concept
alternative label: berceau de poupée
alternative label: dînette
alternative label: meuble de poupée
alternative label: soldat de plomb
broad match: Jouet
broader: T69-6378
definition: Objet ou personnage reproduit plus ou moins fidèlement à échelle réduite pour servir de jouet afin de permettre à son destinataire d'imiter une situation réelle.
in scheme: T69
narrower: T69-6382
preferred label: miniatures (toys) @en-us