porte-couronne mortuaire
terme associe: T69-1535
terme associe: T69-1542
created: 2012-05-16T00:00:00+02:00
modified: 2014-12-02T11:52:33+01:00
status: 1
type: Concept
broad match: cb11931491z
broad match: Couronne mortuaire
broader: T69-926
definition: Support, généralement en métal, servant à porter une ou plusieurs couronnes mortuaires au-dessus d'un cercueil pendant une cérémonie funèbre, ou sur un tombeau.
in scheme: T69
preferred label: funeral crown stands @en-us
preferred label: portacorona funebre @it
preferred label: suporte para coroa funerária @pt
related: T69-1535
related: T69-1542