objet lié aux aliments ou aux boissons
created: 2013-12-05T00:00:00+01:00
modified: 2014-10-16T15:00:08+02:00
status: 1
type: Concept
broader: T69-3577
definition: Récipient ou ustensile destiné à la préparation, à la cuisson, à la conservation, à la consommation ou au service des aliments et des boissons.
in scheme: T69
narrower: T69-3582
narrower: T69-3653
narrower: T69-3800
narrower: T69-3889
narrower: T69-3957
narrower: T69-4097
narrower: T69-4155
preferred label: culinary equipment @en-us