brancard de procession
terme associe: T69-2376
created: 2012-05-16T00:00:00+02:00
modified: 2014-12-02T10:09:34+01:00
status: 1
type: Concept
broader: T69-949
definition: Brancard utilisé lors des processions pour porter le saint sacrement, des reliques, des statues ou, le Jeudi saint, les saintes huiles. Le brancard de procession peut être surmonté d'un dais, d'un socle ou parfois des deux. Une statue de procession, un reliquaire ou son support spécifique peuvent être fixés au brancard.
in scheme: T69
preferred label: processional stretchers @en-us
preferred label: base processionale @it
preferred label: andor @pt
related: T69-2376