porte-reliquaire de procession
created: 2012-05-16T00:00:00+02:00
modified: 2014-12-02T10:20:40+01:00
status: 1
type: Concept
broad match: Reliquaire
broader: T69-949
definition: Support spécifique permettant de porter en procession un reliquaire sur un brancard de procession et parfois de l'exposer à demeure dans une église.
in scheme: T69
preferred label: processional reliquary stands @en-us
preferred label: espositorio processionale @it
preferred label: porta-relicário processional @pt