mesure de référence
terme associe: T69-9658
terme associe: T69-9669
created: 2013-12-18T00:00:00+01:00
modified: 2014-09-09T16:10:39+02:00
status: 1
type: Concept
broad match: http://vocab.getty.edu/aat/300207870
broader: T69-5193
definition: Objet, pris comme référence, permettant de déterminer par comparaison la grandeur de ce que l’on cherche à mesurer.
in scheme: T69
narrower: T69-9677
narrower: T69-9741
related: T69-9658
related: T69-9669