meuble du culte protestant
created: 2012-05-16T00:00:00+02:00
modified: 2014-01-10T00:00:00+01:00
status: 1
type: Concept
broader: T69-576
definition: Mobilier lié à l'exercie de la liturgie protestante.
in scheme: T69
narrower: T69-987
narrower: T69-990
narrower: T69-992
narrower: T69-994
narrower: T69-995
narrower: T69-997
narrower: T69-999