autel protestant
created: 2012-05-16T00:00:00+02:00
modified: 2014-01-10T00:00:00+01:00
status: 1
type: Concept
alternative label: table de communion
alternative label: table sainte
broader: T69-986
definition: Dans l'église réformée calviniste, on désigne, sous le terme table sainte ou table de communion, la table où a lieu la sainte Cène. Elle ne comporte pas de signe de consécration à l'inverse des autels catholiques. Dans l'église réformée luthérienne, la table sainte est appelée autel comme dans le culte catholique.
in scheme: T69