aérophone à anche
created: 2013-12-19T00:00:00+01:00
modified: 2014-10-10T11:28:31+02:00
status: 1
type: Concept
broader: T69-5089
definition: Instrument dont le son est produit par la mise en vibration d'une ou plusieurs anches libres ou battantes.
in scheme: T69
narrower: T69-5093
narrower: T69-5116
narrower: T69-5128
narrower: T69-9891
preferred label: reeds (aerophones) @en-us