aérophone à anches battantes
created: 2013-12-19T00:00:00+01:00
modified: 2014-10-10T11:35:17+02:00
status: 1
type: Concept
broad match: Instrument à anche
broad match: http://vocab.getty.edu/aat/300193013
broader: T69-9890
definition: Instrument dont le son est produit par le mise en vibration d'une anche fixée à l'une de ses extrémités et battant de l'autre contre un bec ou une gouttière.
in scheme: T69
narrower: T69-8641