idiophone à émission par raclement
created: 2013-12-19T00:00:00+01:00
modified: 2014-10-10T14:33:12+02:00
status: 1
type: Concept
broad match: Idiophone
broader: T69-4938
definition: Idiophone produisant un son lorsqu’il est gratté avec un objet dur.
in scheme: T69
narrow match: http://vocab.getty.edu/aat/300041650
narrower: T69-4988
narrower: T69-4990
preferred label: scraped idiophones @en-us