chaire pastorale
created: 2012-05-16T00:00:00+02:00
modified: 2014-01-10T00:00:00+01:00
status: 1
type: Concept
broader: T69-986
definition: Meuble de fonction équivalente à la chaire à prêcher catholique. Elle peut être placée dans le fond de la nef, face aux bancs des fidèles mais aussi sur le côté, comme dans les églises catholiques. La chaire peut être dépourvue d'abat-voix. La chaire du désert, destinée au prêche en plein-air ou dans des lieux secrets, est démontable.
in scheme: T69
scope note: Indiquer chaire du désert en PDEN.