signal
created: 2014-01-10T00:00:00+01:00
modified: 2015-02-24T11:41:10+01:00
status: 1
type: Concept
alternative label: feu tricolore
alternative label: lampe de phare
alternative label: lentille de Fresnel
alternative label: panneau de signalisation
alternative label: signal lumineux
alternative label: signal mécanique
alternative label: signal sonore
alternative label: signal à main
broader: T69-464
definition: Appareil, panneau, avertisseur sonore ou visuel donnant au conducteur des instructions ou des renseignements.
in scheme: T69
preferred label: signaling equipment @en-us