Thésaurus de la désignation des objets mobiliers
type: ConceptScheme
contributor: Philippe Vergain (sous la direction de)
contributor: Luc Fournier (contribution pour le patrimoine des transports)
contributor: Isabelle Duhau
contributor: Catherine Chaplain (contribution pour le patrimoine industriel)
contributor: Jean Davoigneau (contribution pour le patrimoine scientifique et technique)
contributor: Clémence Préault (avec la participation de)
publisher: Ministère de la culture et de la communication
description: Le Thésaurus de la désignation des objets mobiliers a été mis en ligne au premier trimestre 2014. Il constitue la réédition, revue et complétée, de l'outil élaboré par l’Inventaire général des monuments et richesses artistiques de la France et édité en 2001 par les éditions du patrimoine, dans la collection Documents & méthodes. Treize ans plus tard, il a paru nécessaire de reprendre l'ouvrage pour, d'une part, introduire les concepts que les nouveaux domaines de recherche ont fait émerger, et d'autre part, en faire un véritable outil documentaire numérique.
modified: 2015-10-28T15:24:30+01:00
type: Thésaurus
rights: Licence Ouverte / Open Licence version 2.0
subject: instrument ou objet scientifique ou pédagogique
subject: instrument de musique
subject: objet religieux
subject: objet civil domestique
subject: meuble religieux
subject: bijouterie ou orfèvrerie civile
subject: matériel médical
subject: peinture ou art graphique
subject: mobilier civil domestique
subject: moyen de transport
subject: machine liée à la production industrielle
subject: éléments d'architecture
subject: objets mobiliers
subject: matériel professionnel ou artisanal
subject: textile ou vêtement civil
subject: machine énergétique
subject: matériel agricole
subject: armement
subject: sculpture
subject: textile religieux
subject: mobilier monumental
language: fr-FR
language: en-US
language: it
language: pt
has top concept: objet religieux
has top concept: textile religieux
has top concept: meuble religieux
has top concept: textile, garniture ou vêtement laïcs
has top concept: instrument de musique
has top concept: moyen de transport
has top concept: mobilier monumental ou de l'espace extérieur
has top concept: meuble domestique
has top concept: objet civil domestique
has top concept: machine énergétique
has top concept: instrument ou objet pédagogique ou scientifique
has top concept: élément d'architecture
has top concept: armement
has top concept: sculpture
has top concept: peinture, arts graphiques et des média
has top concept: dénomination provisoire
has top concept: machine liée à la production industrielle
created: 2014-01-15T14:54:24+01:00
relation: http://www.inventaire.culture.gouv.fr/telechar/thesaurus_objets_mobiliers_2014.pdf
issued: Version 2015
date submitted: 2015-12-08T14:56:34.775+01:00
date submitted: 2022-02-10T13:32:02.197+01:00

objet lié au Shabbat
type: Concept
modified: 2014-01-10T00:00:00+01:00
in scheme: Thésaurus de la désignation des objets mobiliers
narrower: coupe de sanctification
narrower: luminaire de Shabbat
narrower: couteau pour le Shabbat
narrower: bougeoir pour la clôture du Shabbat
narrower: boîte à aromates
broader: objet lié au culte domestique
created: 2012-05-16T00:00:00+02:00
status: 1

coupe de sanctification
type: Concept
modified: 2014-01-10T00:00:00+01:00
in scheme: Thésaurus de la désignation des objets mobiliers
broader: objet lié au Shabbat
alternative label: gobelet de sanctification
alternative label: coupe de qiddoush
alternative label: gobelet de qiddoush
created: 2012-05-16T00:00:00+02:00
definition: Coupe destinée à contenir le vin au-dessus duquel, au cours des trois repas pris obligatoirement pendant le Shabbat, le maître de maison prononce les paroles de sanctification ; elle porte souvent des inscriptions hébraïques (rappel du 4e commandement, le mot Qiddoush ou des représentations traditionnelles de Jérusalem, et des grappes de raisin portées par Caleb et Josué, etc.). Ces coupes sont conservées à la synagogue et dans les maisons.
status: 1

luminaire de Shabbat
type: Concept
modified: 2014-01-10T00:00:00+01:00
in scheme: Thésaurus de la désignation des objets mobiliers
broader: objet lié au Shabbat
alternative label: lampe de Shabbat
alternative label: chandelier de Shabbat
created: 2012-05-16T00:00:00+02:00
scope note: Connus sous le nom d'étoiles de David, ces lustres ou lampes à suspension avaient une base en étoile pour recevoir l'huile et des mèches suspendues à une tige à balustres.
definition: Luminaire se présentant sous la forme soit d'un lustre, soit de plusieurs chandeliers ou bougeoirs allumés la veille du Shabbat au-dessus de la table par la maîtresse de maison pour l'inauguration du Shabbat. Les chandeliers et bougeoirs qui vont par paire comportent un nombre variable de bougies ; le lustre est généralement à huile, en forme d'étoile à nombre variable de branches, l'huile étant recueillie dans un petit récipient situé au-dessous.
status: 1

boîte à phylactères
type: Concept
modified: 2014-01-10T00:00:00+01:00
in scheme: Thésaurus de la désignation des objets mobiliers
broader: objet lié à la prière
alternative label: boîte à phylactère
alternative label: tefillin
created: 2012-05-16T00:00:00+02:00
scope note: Les phylactères anciens sont plus petits que les phylactères récents.
definition: Les phylactères sont des petites bandelettes de parchemin sur lesquelles sont calligraphiés des extraits de l'Ancien Testament ; ils sont enfermés dans de petits cubes de cuir de cinq centimètres de côté environ, placés au bout de lanières longues et fines que l'on fixe au bras gauche et au front pendant la prière du matin.
status: 1

calotte de prière
type: Concept
modified: 2014-01-10T00:00:00+01:00
in scheme: Thésaurus de la désignation des objets mobiliers
broader: garniture et vêtement liés à la prière
alternative label: kippah
created: 2012-05-16T00:00:00+02:00
definition: Petit bonnet de tissu, plus ou moins orné, porté par les hommes à la synagogue lors des prières en même temps que le châle de prière, voire toute la journée en signe de piété.
status: 1

étui pour versets de la Torah
type: Concept
modified: 2014-01-10T00:00:00+01:00
in scheme: Thésaurus de la désignation des objets mobiliers
broader: objet lié à la prière
alternative label: mezouzah
alternative label: étui à mezouzah
created: 2012-05-16T00:00:00+02:00
definition: Cylindre ou boîte oblongue en bois, cuir ou métal dans lequel on enferme le rouleau de parchemin sur lequel ont été calligraphiés les passages du Deutéronome ou Shem'a ; on le fixe au montant droit de la porte d'entrée de la maison et aussi aux portes des pièces d'habitation et de la synagogue.
status: 1

tableau de prières
type: Concept
modified: 2014-01-10T00:00:00+01:00
in scheme: Thésaurus de la désignation des objets mobiliers
broader: objet lié à la prière
alternative label: plaque de prières
created: 2012-05-16T00:00:00+02:00
definition: Tableau ou plaque comportant des prières inscrites, en particulier des passages des Cantiques ou Barouch Schéamar.
status: 1

générateur électrochimique
type: Concept
modified: 2015-08-05T12:04:40+02:00
in scheme: Thésaurus de la désignation des objets mobiliers
broader: générateur électrique continu
alternative label: pile à combustible
alternative label: accumulateur
alternative label: pile électrique
created: 2012-05-16T00:00:00+02:00
definition: Générateur produisant à partir d’une réaction chimique un courant électrique continu.
status: 1
narrow match: http://vocab.getty.edu/aat/300104620
narrow match: Pile électrique
narrow match: cb11933136g

armoire à fromage
type: Concept
modified: 2014-12-04T15:22:18+01:00
in scheme: Thésaurus de la désignation des objets mobiliers
broader: armoire
alternative label: cage à fromage
created: 2012-05-16T00:00:00+02:00
definition: Armoire servant à faire sécher les fromages. Elle peut prendre la forme d'une cage à fromage, suspendue, et aérée par un treillage ou par des barreaux.
status: 1

causeEffet
type: ObjectProperty
sub property of: related

actionProduction
type: ObjectProperty
sub property of: related

broaderGeneric
type: ObjectProperty
sub property of: broader
inverse of: narrowerGeneric

narrowerGeneric
type: ObjectProperty
sub property of: narrower
inverse of: broaderGeneric

broaderPartitive
type: ObjectProperty
sub property of: broader
inverse of: narrowerPartitive

narrowerPartitive
type: ObjectProperty
sub property of: narrower
inverse of: broaderPartitive

narrowerInstantive
type: ObjectProperty
sub property of: narrower
inverse of: broaderInstantive

broaderInstantive
type: ObjectProperty
sub property of: broader
inverse of: narrowerInstantive

TermeAssocie
type: ObjectProperty
sub property of: related

CustomConceptAttribute
type: DatatypeProperty

status
type: DatatypeProperty

pot trompeur
type: Concept
modified: 2014-10-17T10:50:36+02:00
in scheme: Thésaurus de la désignation des objets mobiliers
preferred label: puzzle jugs @en-us
broader: récipient pour le service et la consommation des boissons
alternative label: aiguière trompeuse
alternative label: pichet surprise
alternative label: pot à illusion
created: 2012-05-16T00:00:00+02:00
definition: Récipient en céramique ou en verre, dont le col entièrement ajouré ne permet de boire qu'en aspirant le contenu par le petit goulot horizontal situé sur le bourrelet creux qui forme le rebord de l'ouverture supérieure et communique par l'anse, également creuse, avec le corps du récipient. Le remplissage se fait par un orifice fermé par un bouchon au fond du corps.
status: 1
broad match: cb12330782p

pot à illusion
type: SimpleNonPreferredTerm
modified: 2014-10-17T10:50:36+02:00
created: 2014-01-15T14:54:24+01:00
status: 1

récipient pour le service et la consommation des boissons
type: Concept
modified: 2014-10-16T17:06:44+02:00
in scheme: Thésaurus de la désignation des objets mobiliers
preferred label: vessels for serving drinks & drinking vessels @en-us
narrower: pot trompeur
narrower: bouilloire de table
narrower: fontaine à eau chaude
narrower: cafetière
narrower: chocolatière
narrower: carafe
narrower: pot à lait
narrower: bouteille
narrower: verre d'eau
narrower: tasse
narrower: jatte à punch
narrower: aiguière
narrower: broc
narrower: chopine
narrower: verre
narrower: gobelet
narrower: théière
narrower: pot à eau
narrower: T69-3892
narrower: T69-3922
narrower: T69-3898
narrower: T69-3924
narrower: T69-3894
narrower: T69-3928
narrower: T69-3934
narrower: T69-3930
narrower: T69-3936
broader: objet lié aux aliments ou aux boissons
alternative label: outre
alternative label: corne à boire
alternative label: cratère
created: 2012-05-16T00:00:00+02:00
definition: Contenant, éventuellement fermé par un bouchon, destiné à présenter, servir ou consommer tout type de boisson. On appelle « déjeuner » un ensemble de récipients assortis, disposés sur un plateau, destiné à une collation pour un nombre réduit de convives et composée essentiellement de boissons chaudes.
status: 1

pot trompeur
type: PreferredTerm
modified: 2014-10-17T10:50:36+02:00
created: 2014-01-15T14:54:24+01:00
status: 1

pichet surprise
type: SimpleNonPreferredTerm
modified: 2014-10-17T10:50:36+02:00
created: 2014-01-15T14:54:24+01:00
status: 1

aiguière trompeuse
type: SimpleNonPreferredTerm
modified: 2014-10-17T10:50:36+02:00
created: 2014-01-15T14:54:24+01:00
status: 1

marteau
type: Concept
modified: 2014-01-10T00:00:00+01:00
in scheme: Thésaurus de la désignation des objets mobiliers
broader: outil servant à percuter
alternative label: massette
alternative label: maillet
alternative label: chasse à parer
alternative label: marteline
alternative label: masse de carrier
alternative label: chasse carrée
alternative label: boucharde
alternative label: têtu
created: 2013-12-16T00:00:00+01:00
status: 1

outil servant à percuter
type: Concept
modified: 2013-12-16T00:00:00+01:00
in scheme: Thésaurus de la désignation des objets mobiliers
narrower: marteau
narrower: pic
broader: outil
created: 2013-12-16T00:00:00+01:00
status: 1

maillet
type: SimpleNonPreferredTerm
modified: 2014-01-10T00:00:00+01:00
created: 2014-01-15T14:54:24+01:00
status: 1

massette
type: SimpleNonPreferredTerm
modified: 2014-01-10T00:00:00+01:00
created: 2014-01-15T14:54:24+01:00
status: 1

têtu
type: SimpleNonPreferredTerm
modified: 2014-01-10T00:00:00+01:00
created: 2014-01-15T14:54:24+01:00
status: 1

marteline
type: SimpleNonPreferredTerm
modified: 2014-01-10T00:00:00+01:00
created: 2014-01-15T14:54:24+01:00
status: 1

masse de carrier
type: SimpleNonPreferredTerm
modified: 2014-01-10T00:00:00+01:00
created: 2014-01-15T14:54:24+01:00
status: 1

chasse à parer
type: SimpleNonPreferredTerm
modified: 2014-01-10T00:00:00+01:00
created: 2014-01-15T14:54:24+01:00
status: 1

chasse carrée
type: SimpleNonPreferredTerm
modified: 2014-01-10T00:00:00+01:00
created: 2014-01-15T14:54:24+01:00
status: 1

marteau
type: PreferredTerm
modified: 2014-01-10T00:00:00+01:00
created: 2014-01-15T14:54:24+01:00
status: 1

boucharde
type: SimpleNonPreferredTerm
modified: 2014-01-10T00:00:00+01:00
created: 2014-01-15T14:54:24+01:00
status: 1

réchaud de table
type: Concept
modified: 2014-12-05T15:56:31+01:00
in scheme: Thésaurus de la désignation des objets mobiliers
preferred label: dish warmers @en-us
broader: accessoire du service
alternative label: réchaud de table à esprit-de-vin
alternative label: chauffe-plat à eau chaude
alternative label: réchaud à alcool
alternative label: réchaud de table à braises
alternative label: boule à eau chaude
alternative label: chauffe-plat
created: 2012-05-16T00:00:00+02:00
related: plat
related: bouilloire de table
related: couvre-plat
related: surtout de table
related: fontaine à eau chaude
related: poêlon de table
related: cafetière
related: chocolatière
related: réchaud
definition: Support sur pieds, en métal ou céramique, contenant un réceptacle pour une bougie ou un combustible sur lequel on met à chauffer un récipient. Il peut être complété par un couvre-plat.
TermeAssocie: plat
TermeAssocie: bouilloire de table
TermeAssocie: couvre-plat
TermeAssocie: surtout de table
TermeAssocie: fontaine à eau chaude
TermeAssocie: poêlon de table
TermeAssocie: cafetière
TermeAssocie: chocolatière
TermeAssocie: réchaud
status: 1

réchaud de table à esprit-de-vin
type: SimpleNonPreferredTerm
modified: 2014-12-05T15:56:31+01:00
created: 2014-01-15T14:54:24+01:00
status: 1

plat
type: Concept
modified: 2014-12-08T16:54:02+01:00
in scheme: Thésaurus de la désignation des objets mobiliers
preferred label: dishes (vessels) @en-us
broader: récipient pour le service ou la consommation des aliments
alternative label: plat à rôti
alternative label: plat à asperges
alternative label: plat à ragoût
alternative label: plat à l'italienne
alternative label: plat-réchaud
alternative label: plat composé
alternative label: plat à venaison
alternative label: plat-égouttoir
alternative label: plat à poisson
alternative label: plat à gâteau
created: 2012-05-16T00:00:00+02:00
related: réchaud de table
related: couvre-plat
definition: Récipient servant à présenter les aliments, de structure identique à celle de l'assiette mais de dimensions supérieures à celle-ci. Le plat peut comporter deux anses latérales symétriques et faire partie de séries de grandeurs décroissantes. Il peut être accompagné d'un couvre-plat.
TermeAssocie: réchaud de table
TermeAssocie: couvre-plat
status: 1

bouilloire de table
type: Concept
modified: 2014-12-08T13:08:21+01:00
in scheme: Thésaurus de la désignation des objets mobiliers
broader: récipient pour le service et la consommation des boissons
alternative label: bouilloire à punch
created: 2012-05-16T00:00:00+02:00
related: réchaud de table
related: bouilloire
definition: Grand récipient verseur sphérique couvert, en faïence, porcelaine ou métal, servant à faire bouillir de l'eau sur la table pour la préparation du thé, du café, du chocolat ou du punch, au-dessus d'un petit réchaud. La bouilloire est munie d'un long goulot latéral coudé et d'une anse articulée sur le dessus. Elle peut être placée sur un support au-dessus du réchaud. Elle peut faire partie du service à thé ou du service à café.
TermeAssocie: réchaud de table
TermeAssocie: bouilloire
status: 1
broad match: cb13338740t

réchaud à alcool
type: SimpleNonPreferredTerm
modified: 2014-12-05T15:56:31+01:00
created: 2014-01-15T14:54:24+01:00
status: 1

couvre-plat
type: Concept
modified: 2014-12-08T16:36:26+01:00
in scheme: Thésaurus de la désignation des objets mobiliers
preferred label: dish covers @en-us
broader: récipient pour le service ou la consommation des aliments
alternative label: cloche à plat
created: 2012-05-16T00:00:00+02:00
related: réchaud de table
related: plat
related: surtout de table
definition: Haut couvercle bombé que l'on pose sur un plat ou un chauffe-plat auquel il peut être assorti, et qui sert à garder la chaleur des aliments.
TermeAssocie: réchaud de table
TermeAssocie: plat
TermeAssocie: surtout de table
status: 1
broad match: http://data.bnf.fr/ark:/12148/cb11978277c

réchaud de table
type: PreferredTerm
modified: 2014-12-05T15:56:31+01:00
created: 2014-01-15T14:54:24+01:00
status: 1

surtout de table
type: Concept
modified: 2014-12-05T15:58:58+01:00
in scheme: Thésaurus de la désignation des objets mobiliers
preferred label: epergnes @en-us
broader: accessoire du service
alternative label: milieu de table
created: 2012-05-16T00:00:00+02:00
related: réchaud de table
related: couvre-plat
related: salière
related: assiette montée
related: boîte à épices
related: soupière
related: huilier-vinaigrier
related: huilier
related: jatte
definition: Objet ou ensemble d'objets disposés au centre d'une table dressée pour l'orner. Le surtout peut se composer d'un élément de grandes dimensions (plateau, vase, jardinière, etc.), seul ou accompagné de récipients ou d'accessoires (salière, boîte à épices, etc.). Il peut également comporter des éléments décoratifs (miroirs, personnages, animaux, éléments naturels ou architecturaux).
TermeAssocie: réchaud de table
TermeAssocie: couvre-plat
TermeAssocie: salière
TermeAssocie: assiette montée
TermeAssocie: boîte à épices
TermeAssocie: soupière
TermeAssocie: huilier-vinaigrier
TermeAssocie: huilier
TermeAssocie: jatte
status: 1

fontaine à eau chaude
type: Concept
modified: 2014-12-08T15:57:23+01:00
in scheme: Thésaurus de la désignation des objets mobiliers
preferred label: hot water urns @en-us
broader: récipient pour le service et la consommation des boissons
alternative label: samovar
created: 2012-05-16T00:00:00+02:00
related: réchaud de table
related: T69-3898
definition: Fontaine sur des pieds hauts ou un support, sous laquelle un réchaud de table chauffe l'eau nécessaire à la préparation du thé ou du café. La fontaine est souvent complétée par le bol à thé. Comme la bouilloire de table, elle fait partie du service à thé ou à café.
TermeAssocie: réchaud de table
TermeAssocie: T69-3898
status: 1
narrow match: Samovar

chauffe-plat à eau chaude
type: SimpleNonPreferredTerm
modified: 2014-12-05T15:56:31+01:00
created: 2014-01-15T14:54:24+01:00
status: 1

poêlon de table
type: Concept
modified: 2014-10-17T11:22:48+02:00
in scheme: Thésaurus de la désignation des objets mobiliers
broader: récipient pour le service ou la consommation des aliments
alternative label: pot à bouchée
alternative label: poêlon à truffes
alternative label: poêlon à ris de veau
alternative label: poêlon à œuf
created: 2012-05-16T00:00:00+02:00
related: réchaud de table
related: casserole
definition: Récipient, généralement en forme de casserole basse, couvert ou non, en argent, métal argenté, faïence ou porcelaine, que l'on utilise sur la table, posé ou non sur un réchaud.
TermeAssocie: réchaud de table
TermeAssocie: casserole
status: 1
broad match: cb13184671j

cafetière
type: Concept
modified: 2014-12-08T15:48:26+01:00
in scheme: Thésaurus de la désignation des objets mobiliers
preferred label: coffeepots @en-us
broader: récipient pour le service et la consommation des boissons
alternative label: cafetière égoïste
alternative label: cafetière marabout
alternative label: pot à café
alternative label: cafetière bain-marie
alternative label: cafetière-filtre
created: 2012-05-16T00:00:00+02:00
related: réchaud de table
definition: Récipient verseur couvert, en métal ou en céramique, utilisé pour préparer et servir une infusion de café. La cafetière, circulaire ou à pans, à fond plat ou munie de pieds, comporte un bec ou un goulot coudé, une anse verticale ou un manche horizontal latéral. La cafetière peut être posée sur un réchaud de table assorti.
TermeAssocie: réchaud de table
status: 1

chauffe-plat
type: SimpleNonPreferredTerm
modified: 2014-12-05T15:56:31+01:00
created: 2014-01-15T14:54:24+01:00
status: 1

chocolatière
type: Concept
modified: 2014-12-08T15:51:03+01:00
in scheme: Thésaurus de la désignation des objets mobiliers
preferred label: chocolate pots @en-us
broader: récipient pour le service et la consommation des boissons
created: 2012-05-16T00:00:00+02:00
related: réchaud de table
definition: Récipient verseur couvert, en céramique ou en métal, pour la préparation et le service du chocolat chaud. Son couvercle comporte une ouverture circulaire pour laisser passer le moussoir ou moulinet, sorte de pilon à tête cannelée ou ajourée, avec lequel on agite et fait mousser le chocolat. La chocolatière peut être posée sur un réchaud de table assorti.
TermeAssocie: réchaud de table
status: 1

réchaud
type: Concept
modified: 2014-12-08T12:36:40+01:00
in scheme: Thésaurus de la désignation des objets mobiliers
preferred label: chafing dishes @en-us
broader: récipient pour la cuisson des aliments
created: 2012-05-16T00:00:00+02:00
related: réchaud de table
related: T69-3263
definition: Récipient en poterie ou en métal, sur pieds ou à fond plat. Il sert de support à un autre récipient dont le contenu cuit ou réchauffe grâce à des braises situées dans sa partie inférieure. Il peut être complété par des anses latérales ou une anse supérieure mobile.
TermeAssocie: réchaud de table
TermeAssocie: T69-3263
status: 1

accessoire du service
type: Concept
modified: 2014-10-16T15:02:30+02:00
in scheme: Thésaurus de la désignation des objets mobiliers
narrower: réchaud de table
narrower: surtout de table
narrower: corbeille de table
narrower: dessous-de-plat
narrower: porte-couteau
narrower: rafraîchissoir à bouteille
narrower: présentoir à bouteille
narrower: soucoupe
narrower: nef de table
narrower: présentoir
narrower: aquamanile
narrower: bassin de table
narrower: porte-bouteilles
narrower: plateau
narrower: rafraîchissoir à verre
narrower: dessous-de-carafe
narrower: ramasse-couverts
narrower: sonnette de table
broader: objet lié aux aliments ou aux boissons
alternative label: ramasse-miettes
alternative label: porte-menu
alternative label: porte-verres
alternative label: porte-toasts
alternative label: rond de serviette
alternative label: présentoir à raisins
alternative label: porte-cure-dents
alternative label: cadenas de table
alternative label: cale-assiette
alternative label: coulant de serviette
alternative label: porte-serviette
alternative label: brosse à miettes
alternative label: étui à cure-dents
alternative label: rince-bouche
alternative label: rince-doigts
alternative label: boîte à cure-dents
alternative label: pelle à miettes
alternative label: panier à verres
created: 2012-05-16T00:00:00+02:00
definition: Élément complémentaire des récipients ou instruments du service et autres accessoires de la table.
status: 1

réchaud de table à braises
type: SimpleNonPreferredTerm
modified: 2014-12-05T15:56:31+01:00
created: 2014-01-15T14:54:24+01:00
status: 1

boule à eau chaude
type: SimpleNonPreferredTerm
modified: 2014-12-05T15:56:31+01:00
created: 2014-01-15T14:54:24+01:00
status: 1

siège de jardin
type: Concept
modified: 2015-02-24T10:52:29+01:00
in scheme: Thésaurus de la désignation des objets mobiliers
preferred label: garden seats @en-us
broader: édicule et mobilier de jardin
alternative label: chaise de jardin
alternative label: banc de jardin
alternative label: fauteuil de jardin
created: 2012-06-11T00:00:00+02:00
related: siège
definition: Meuble de repos à une ou plusieurs places servant à s’asseoir dans un jardin. Le fond comporte généralement des parties évidées pour l’écoulement de l’eau de pluie.
TermeAssocie: siège
status: 1

siège de jardin
type: PreferredTerm
modified: 2015-02-24T10:52:29+01:00
created: 2014-01-15T14:54:24+01:00
status: 1

siège
type: Concept
modified: 2014-10-14T12:13:47+02:00
in scheme: Thésaurus de la désignation des objets mobiliers
preferred label: seating furniture @en-us
narrower: siège d'une place
narrower: siège à plusieurs places
broader: meuble domestique
alternative label: siège pliant
created: 2012-05-16T00:00:00+02:00
related: siège de jardin
definition: Meuble de repos servant à s'asseoir. Les sièges se répartissent en différentes catégories selon le nombre de personnes pouvant s'asseoir et les parties du corps soutenues ; ils peuvent être en bois, métal, osier, paille, etc.
TermeAssocie: siège de jardin
status: 1

banc de jardin
type: SimpleNonPreferredTerm
modified: 2015-02-24T10:52:29+01:00
created: 2014-01-15T14:54:24+01:00
status: 1

édicule et mobilier de jardin
type: Concept
modified: 2015-02-24T10:47:33+01:00
in scheme: Thésaurus de la désignation des objets mobiliers
narrower: siège de jardin
narrower: treillage
narrower: vase décoratif de jardin
narrower: mobilier de jardin
narrower: caisse à plantes
narrower: jeu de jardin
broader: mobilier monumental ou de l'espace extérieur
created: 2012-05-16T00:00:00+02:00
definition: Meuble, objet ou construction autonome et non habitable situé dans un jardin et servant à décorer, éclairer, s’asseoir, se divertir, etc.
status: 1

chaise de jardin
type: SimpleNonPreferredTerm
modified: 2015-02-24T10:52:29+01:00
created: 2014-01-15T14:54:24+01:00
status: 1

fauteuil de jardin
type: SimpleNonPreferredTerm
modified: 2015-02-24T10:52:29+01:00
created: 2014-01-15T14:54:24+01:00
status: 1

moteur thermique à combustion interne
type: Concept
modified: 2015-08-10T11:59:33+02:00
in scheme: Thésaurus de la désignation des objets mobiliers
narrower: moteur à turbine à combustion
narrower: moteur à pistons à explosion
narrower: moteur à pistons à combustion
broader: moteur thermique
created: 2012-05-16T00:00:00+02:00
definition: Moteur thermique dont le fluide énergétique est un gaz chaud produit à l'intérieur de la chambre de travail.
status: 1

moteur à turbine à combustion
type: Concept
modified: 2015-10-07T18:21:05+02:00
in scheme: Thésaurus de la désignation des objets mobiliers
broader: moteur thermique à combustion interne
alternative label: turboréacteur
alternative label: turbine d'entraînement
alternative label: turbine de propulsion
alternative label: moteur-fusée
created: 2012-05-16T00:00:00+02:00
definition: Moteur thermique à combustion interne dont la production de gaz chauds est continue.
status: 1
narrow match: Turboréacteur

moteur thermique à combustion interne
type: PreferredTerm
modified: 2015-08-10T11:59:33+02:00
created: 2014-01-15T14:54:24+01:00
status: 1

moteur à pistons à explosion
type: Concept
modified: 2015-08-10T12:09:11+02:00
in scheme: Thésaurus de la désignation des objets mobiliers
broader: moteur thermique à combustion interne
alternative label: moteur à essence
created: 2012-05-16T00:00:00+02:00
definition: Moteur thermique à combustion interne dont la production cyclique de gaz chauds est provoquée par un arc électrique contrôlé.
status: 1

moteur thermique
type: Concept
modified: 2015-10-07T18:02:50+02:00
in scheme: Thésaurus de la désignation des objets mobiliers
narrower: moteur thermique à combustion interne
narrower: T69-6162
broader: moteur
alternative label: locomobile
created: 2012-05-16T00:00:00+02:00
definition: Moteur à énergie mécanique utilisant l’énergie thermique.
status: 1

moteur à pistons à combustion
type: Concept
modified: 2015-08-10T11:58:31+02:00
in scheme: Thésaurus de la désignation des objets mobiliers
broader: moteur thermique à combustion interne
alternative label: moteur Diesel
alternative label: moteur à huile lourde
alternative label: moteur Duvant
created: 2012-05-16T00:00:00+02:00
definition: Moteur thermique à combustion interne dont la production de gaz chauds se fait cycliquement par une inflammation naturelle.
status: 1
narrow match: http://vocab.getty.edu/aat/300262910
narrow match: cb11932537p
narrow match: Moteur Diesel

tarare
type: Concept
modified: 2014-12-04T15:03:57+01:00
in scheme: Thésaurus de la désignation des objets mobiliers
preferred label: sifters @en-us
broader: meuble pour farine ou pain
created: 2012-05-16T00:00:00+02:00
definition: Meuble servant à trier les grains selon leur grosseur et à les séparer des éléments légers (paille, peaux, etc.) qui les accompagnent. Il peut être constitué d'un cylindre rotatif à grillage dont les fils ont un espacement de taille croissante.
status: 1
broad match: http://data.bnf.fr/ark:/12148/cb131630461

meuble pour farine ou pain
type: Concept
modified: 2014-10-10T16:54:25+02:00
in scheme: Thésaurus de la désignation des objets mobiliers
narrower: tarare
narrower: blutoir domestique
narrower: pétrin
broader: meuble de préparation culinaire
alternative label: pile-mil
alternative label: table à porter le pain
alternative label: broyeur à pâte
alternative label: table à pâtisserie
created: 2012-05-16T00:00:00+02:00
related: mortier de cuisine
definition: Meuble servant à une des étapes de la fabrication de la farine ou du pain.
TermeAssocie: mortier de cuisine
status: 1
narrow match: Maie
broad match: http://vocab.getty.edu/aat/300199765

tarare
type: PreferredTerm
modified: 2014-12-04T15:03:57+01:00
created: 2014-01-15T14:54:24+01:00
status: 1

saladier
type: Concept
modified: 2014-12-10T13:03:46+01:00
in scheme: Thésaurus de la désignation des objets mobiliers
preferred label: salad bowls @en-us
broader: récipient pour le service ou la consommation des aliments
alternative label: jatte à salade
created: 2012-05-16T00:00:00+02:00
definition: Grand récipient circulaire, en terre cuite ou en verre, avec ou sans pied bas et sans anses, dans lequel on assaisonne et on sert la salade.
status: 1

jatte à salade
type: SimpleNonPreferredTerm
modified: 2014-12-10T13:03:46+01:00
created: 2014-01-15T14:54:24+01:00
status: 1

récipient pour le service ou la consommation des aliments
type: Concept
modified: 2014-10-17T10:55:00+02:00
in scheme: Thésaurus de la désignation des objets mobiliers
preferred label: containers for serving and consuming food @en-us
narrower: plat
narrower: couvre-plat
narrower: poêlon de table
narrower: saladier
narrower: ravier
narrower: salière
narrower: écuelle
narrower: assiette montée
narrower: pot à crème
narrower: tasse à glace
narrower: beurrier
narrower: sucrier
narrower: boîte à épices
narrower: boîte à thé ou à café
narrower: fromager
narrower: coupe à glace
narrower: porte-dîner
narrower: drageoir
narrower: confiturier
narrower: légumier
narrower: soupière
narrower: poivrière saupoudreuse
narrower: cloche à fromage
narrower: moutardier
narrower: huilier-vinaigrier
narrower: coquetier
narrower: assiette
narrower: huilier
narrower: jatte
narrower: saucière
broader: objet lié aux aliments ou aux boissons
alternative label: porte-moutardier
alternative label: melonnière
alternative label: plateau à huitres
alternative label: présentoir à huîtres
alternative label: plateau à melon
alternative label: coquille
alternative label: oeufrier
alternative label: présentoir à glace ou à fruit
alternative label: marronnière
alternative label: plateau à coquillages
alternative label: présentoir à œufs
created: 2012-05-16T00:00:00+02:00
definition: Contenant destiné à présenter des aliments en vue de les consommer.
status: 1

saladier
type: PreferredTerm
modified: 2014-12-10T13:03:46+01:00
created: 2014-01-15T14:54:24+01:00
status: 1

corbeille de table
type: Concept
modified: 2014-12-05T15:44:03+01:00
in scheme: Thésaurus de la désignation des objets mobiliers
broader: accessoire du service
alternative label: corbeille à pain
alternative label: corbeille à fruits
alternative label: corbeille desserts
created: 2012-05-16T00:00:00+02:00
definition: Récipient en faïence, en vannerie (ou l’imitant), utilisé pour présenter des aliments ou des fleurs, ou ayant une fonction seulement décorative.
status: 1
narrow match: http://vocab.getty.edu/aat/300197595
broad match: cb13516512g

corbeille à fruits
type: SimpleNonPreferredTerm
modified: 2014-12-05T15:44:03+01:00
created: 2014-01-15T14:54:24+01:00
status: 1

corbeille desserts
type: SimpleNonPreferredTerm
modified: 2014-12-05T15:44:03+01:00
created: 2014-01-15T14:54:24+01:00
status: 1

corbeille de table
type: PreferredTerm
modified: 2014-12-05T15:44:03+01:00
created: 2014-01-15T14:54:24+01:00
status: 1

corbeille à pain
type: SimpleNonPreferredTerm
modified: 2014-12-05T15:44:03+01:00
created: 2014-01-15T14:54:24+01:00
status: 1

couronne de mariage orthodoxe
type: Concept
modified: 2014-01-06T00:00:00+01:00
in scheme: Thésaurus de la désignation des objets mobiliers
broader: objet du culte orthodoxe
created: 2012-05-16T00:00:00+02:00
related: bijou
definition: Paire de couronnes placées au-dessus des mariés pendant la cérémonie du mariage. Elles portent des icônes du Christ pour la couronne du marié et de la Vierge pour celle de la mariée.
TermeAssocie: bijou
status: 1

bijou
type: Concept
modified: 2014-12-30T12:31:29+01:00
in scheme: Thésaurus de la désignation des objets mobiliers
preferred label: jewelry @en-us
narrower: bague
narrower: collier
broader: bijouterie et orfèvrerie civiles, monnaie, médaille
alternative label: bracelet
alternative label: breloque
alternative label: boucle d'oreille
alternative label: bijou de parure
alternative label: pendant d'oreille
alternative label: pendentif
alternative label: broche
created: 2013-07-19T00:00:00+02:00
related: couronne de mariage orthodoxe
related: couronne de statue
related: couronne royale
related: globe de mariage
definition: Élément de parure, précieux par ses matériaux, sa mise en œuvre, son décor ou encore son originalité, qui se porte sur le corps ou le vêtement.
TermeAssocie: couronne de mariage orthodoxe
TermeAssocie: couronne de statue
TermeAssocie: couronne royale
TermeAssocie: globe de mariage
status: 1

objet du culte orthodoxe
type: Concept
modified: 2014-01-10T00:00:00+01:00
in scheme: Thésaurus de la désignation des objets mobiliers
narrower: couronne de mariage orthodoxe
narrower: croix d'autel orthodoxe
narrower: croix de baptême orthodoxe
narrower: lampe du Lucernaire
narrower: croix d'épiphanie
narrower: nécessaire orthodoxe pour la communion des malades
narrower: colombe eucharistique orthodoxe
narrower: patène orthodoxe
narrower: éventail du culte
narrower: sainte lance
narrower: zéon
narrower: encensoir orthodoxe
narrower: chandelier de bénédiction
narrower: chandelier d'autel orthodoxe
narrower: coffret aux saintes huiles orthodoxe
narrower: T69-2104
narrower: T69-9085
narrower: T69-2130
narrower: T69-2137
narrower: T69-2107
narrower: T69-2145
narrower: T69-2109
narrower: T69-2147
broader: objet religieux
created: 2012-05-16T00:00:00+02:00
definition: Objet ou instrument lié à l’exercice ou à la pratique du culte orthodoxe.
status: 1

couronne de mariage orthodoxe
type: PreferredTerm
modified: 2014-01-10T00:00:00+01:00
created: 2014-01-15T14:54:24+01:00
status: 1

tourne-galettes
type: Concept
modified: 2014-12-05T16:36:18+01:00
in scheme: Thésaurus de la désignation des objets mobiliers
broader: instrument pour la préparation - le service ou la consommation des aliments et des boissons
alternative label: vire-galettes
created: 2012-05-16T00:00:00+02:00
related: dosseret de cuisine
definition: Spatule en bois ou en métal, généralement longue et étroite, prolongée par un manche et servant à retourner les galettes en cours de cuisson.
TermeAssocie: dosseret de cuisine
status: 1
broad match: http://vocab.getty.edu/aat/300199784
broad match: Ustensile de cuisine

tourne-galettes
type: PreferredTerm
modified: 2014-12-05T16:36:18+01:00
created: 2014-01-15T14:54:24+01:00
status: 1

dosseret de cuisine
type: Concept
modified: 2014-10-13T12:31:35+02:00
in scheme: Thésaurus de la désignation des objets mobiliers
broader: meuble-support
alternative label: barre porte-instruments de cuisine
created: 2012-05-16T00:00:00+02:00
related: tourne-galettes
related: louche
definition: Panneau plein ou cadre à barres transversales et verticales, hérissé de crochets ou clous, servant à suspendre la batterie de cuisine. Elle peut comporter une ou deux tablettes à la partie inférieure ou supérieure.
TermeAssocie: tourne-galettes
TermeAssocie: louche
status: 1
broad match: http://vocab.getty.edu/aat/300039337
broad match: cb13562642r

instrument pour la préparation - le service ou la consommation des aliments et des boissons
type: Concept
modified: 2014-10-16T15:24:25+02:00
in scheme: Thésaurus de la désignation des objets mobiliers
narrower: tourne-galettes
narrower: tamis
narrower: cuiller
narrower: louche
narrower: moulin de cuisine
narrower: entonnoir
narrower: rouleau à pâte
narrower: pelle de service
narrower: fourchette
narrower: pince à sucre
narrower: marque à biscuits
narrower: hache à sucre
narrower: passoire à thé
narrower: coupe-pâte
narrower: raclette à plat
narrower: alambic de table
narrower: pelle à farine
narrower: marque à pain
narrower: coupe-pain
narrower: pilon
narrower: couteau
narrower: ciseaux à raisin
narrower: aiguille à brider
narrower: marque à beurre
narrower: hachoir
narrower: casse-noix
narrower: chalumeau à boire
narrower: couperet
narrower: affûtoir
narrower: presse à fruits ou à légumes
narrower: râpe
narrower: gril
narrower: porte-couverts
broader: objet lié aux aliments ou aux boissons
alternative label: taille-soupe
alternative label: pétrisseur à beurre
alternative label: pince à côtelettes
alternative label: palette à égoutter
alternative label: spatule de cuisine
alternative label: fer à beignet
alternative label: brise-caillé
alternative label: coupe-œuf
alternative label: fouet de cuisine
alternative label: ouvre-bouteille
alternative label: plateau domestique
alternative label: fer à glacer
alternative label: support d'ustensile de cuisine
alternative label: décacheteur à bouteilles
alternative label: tranche-caillé
alternative label: manche à côtelette
alternative label: ouvre-boîte
alternative label: raclette à pétrin
alternative label: molette à pâte
alternative label: découpoir
alternative label: palette à essorer le beurre
alternative label: pince à plat
alternative label: pince à châtaignes
alternative label: essoreuse à beurre
alternative label: pique-pâte
alternative label: décapsuleur
alternative label: fouet à mayonnaise
alternative label: aiguille à piquer
alternative label: lardoir
alternative label: attendrisseur à viande
alternative label: casse-sucre
alternative label: écumoire
alternative label: manche à gigot
alternative label: poche à huile
alternative label: aiguille à larder
alternative label: fouet à œufs
alternative label: flamboir
alternative label: mouvette
alternative label: presse-viande
alternative label: tire-bouchon
alternative label: videlle
created: 2012-05-16T00:00:00+02:00
status: 1

vire-galettes
type: SimpleNonPreferredTerm
modified: 2014-12-05T16:36:18+01:00
created: 2014-01-15T14:54:24+01:00
status: 1

encadrement de fenêtre
type: Concept
modified: 2014-12-12T11:07:04+01:00
in scheme: Thésaurus de la désignation des objets mobiliers
preferred label: coverings and hangings for openings @en-us
broader: garniture architecturale
alternative label: lambrequin textile
alternative label: embrase
alternative label: cantonnière
alternative label: bandeau de fenêtre
created: 2012-05-16T00:00:00+02:00
definition: Décor de tissu encadrant une baie, assorti ou non aux rideaux, constitué d'un lambrequin ou d'un bandeau, de cantonnières, éventuellement d'embrases.
status: 1
narrow match: cb12003001h
broad match: Garniture

lambrequin textile
type: SimpleNonPreferredTerm
modified: 2014-12-12T11:07:04+01:00
created: 2014-01-15T14:54:24+01:00
status: 1

encadrement de fenêtre
type: PreferredTerm
modified: 2014-12-12T11:07:04+01:00
created: 2014-01-15T14:54:24+01:00
status: 1

cantonnière
type: SimpleNonPreferredTerm
modified: 2014-12-12T11:07:04+01:00
created: 2014-01-15T14:54:24+01:00
status: 1

bandeau de fenêtre
type: SimpleNonPreferredTerm
modified: 2014-12-12T11:07:04+01:00
created: 2014-01-15T14:54:24+01:00
status: 1

garniture architecturale
type: Concept
modified: 2014-12-12T11:04:21+01:00
in scheme: Thésaurus de la désignation des objets mobiliers
narrower: encadrement de fenêtre
narrower: tenture murale
narrower: tapis de sol
narrower: rideau de scène
narrower: rideau de fenêtre
narrower: toile de fond
narrower: portière
broader: textile, garniture ou vêtement laïcs
alternative label: cuir peint
alternative label: toile peinte
alternative label: papier peint
created: 2012-05-16T00:00:00+02:00
related: revêtement
related: peinture monumentale
definition: Garniture souple (tissu, papier, cuir, etc.) fixée sur un mur, un sol, un plafond ou une fenêtre.
TermeAssocie: revêtement
TermeAssocie: peinture monumentale
status: 1

embrase
type: SimpleNonPreferredTerm
modified: 2014-12-12T11:07:04+01:00
created: 2014-01-15T14:54:24+01:00
status: 1

porte-mortier
type: Concept
modified: 2014-12-04T16:56:01+01:00
in scheme: Thésaurus de la désignation des objets mobiliers
broader: meuble-support
created: 2012-05-16T00:00:00+02:00
related: mortier de cuisine
definition: Meuble constitué soit d’un pilier tourné, à hauteur d’appui, légèrement creusé à la partie supérieure, soit, d’un cadre horizontal monté sur pieds, à élégissement biais sur le pourtour intérieur, servant à recevoir un mortier et à l’élever à hauteur de travail.
TermeAssocie: mortier de cuisine
status: 1
broad match: http://vocab.getty.edu/aat/300039337

mortier de cuisine
type: Concept
modified: 2014-12-08T12:45:27+01:00
in scheme: Thésaurus de la désignation des objets mobiliers
preferred label: mortars (grinding tools) @en-us
broader: récipient pour la préparation des aliments
alternative label: mortier à sauce
alternative label: mortier à piler
alternative label: mortier à punch
alternative label: égrugeoir
created: 2012-05-16T00:00:00+02:00
related: meuble pour farine ou pain
related: porte-mortier
related: jatte à punch
related: pilon
definition: Récipient circulaire ou rectangulaire en bois, métal, faïence, porcelaine ou pierre, à parois épaisses et fond intérieur arrondi, dans lequel on écrase des aliments avec un pilon pour les réduire en poudre ou en pâte. L'égrugeoir permet de réduire en poudre le gros sel.
TermeAssocie: meuble pour farine ou pain
TermeAssocie: porte-mortier
TermeAssocie: jatte à punch
TermeAssocie: pilon
status: 1

porte-mortier
type: PreferredTerm
modified: 2014-12-04T16:56:01+01:00
created: 2014-01-15T14:54:24+01:00
status: 1

meuble-support
type: Concept
modified: 2014-10-13T12:30:11+02:00
in scheme: Thésaurus de la désignation des objets mobiliers
preferred label: support furniture @en-us
narrower: dosseret de cuisine
narrower: porte-mortier
narrower: porte-parapluies
narrower: repose-poêle
narrower: porte-écuelles
narrower: T69-3035
narrower: T69-3030
broader: meuble de rangement et d'exposition
alternative label: porte-coffre
alternative label: pied-porte-verres
alternative label: banc porte-récipients
alternative label: support de saloir à saler
created: 2012-05-16T00:00:00+02:00
definition: Meuble dont la forme est adaptée au rangement ou à l’accrochage d’objets essentiellement utilitaires.
status: 1
broad match: cb13562642r

élément de matériel nautique
type: Concept
modified: 2014-10-16T10:28:44+02:00
in scheme: Thésaurus de la désignation des objets mobiliers
preferred label: watercraft equipment @en-us
narrower: ancre
narrower: rame
narrower: figure de proue
broader: matériel de transport nautique
created: 2013-11-04T00:00:00+01:00
definition: Objet formant un élément constitutif ou complémentaire d'un matériel nautique complet.
status: 1
broad match: Watercraft

élément de matériel nautique
type: PreferredTerm
modified: 2014-10-16T10:28:44+02:00
created: 2014-01-15T14:54:24+01:00
status: 1

ancre
type: Concept
modified: 2014-12-19T16:17:06+01:00
in scheme: Thésaurus de la désignation des objets mobiliers
preferred label: anchors (watercraft equipment) @en-us
broader: élément de matériel nautique
created: 2013-11-04T00:00:00+01:00
definition: Pièce métallique qu'on laisse tomber à l'aide d'une chaîne ou d'un câble au fond de l'eau, où elle s'accroche, de manière à immobiliser le bateau.
status: 1

matériel de transport nautique
type: Concept
modified: 2014-10-15T09:53:57+02:00
in scheme: Thésaurus de la désignation des objets mobiliers
preferred label: watercraft @en-us
narrower: élément de matériel nautique
narrower: équipement embarqué
narrower: matériel flottant stationnaire
narrower: bateau
broader: moyen de transport
created: 2013-09-18T00:00:00+02:00
definition: Matériel de navigation maritime ou fluvial.
status: 1

rame
type: Concept
modified: 2014-12-19T16:21:39+01:00
in scheme: Thésaurus de la désignation des objets mobiliers
preferred label: oars @en-us
broader: élément de matériel nautique
alternative label: aviron
alternative label: pagaie
created: 2013-11-27T00:00:00+01:00
definition: Instrument en forme de pelle, manœuvré par une ou plusieurs personnes installées dans un bateau, qui permet de propulser celui-ci à la force des bras par un effet de levier.
status: 1

figure de proue
type: Concept
modified: 2014-12-19T16:18:54+01:00
in scheme: Thésaurus de la désignation des objets mobiliers
preferred label: prow ornaments @en-us
broader: élément de matériel nautique
created: 2013-11-04T00:00:00+01:00
definition: Elément sculpté décoratif ornant l'avant d'un navire.
status: 1

réseau de baie
type: Concept
modified: 2014-12-09T16:34:52+01:00
in scheme: Thésaurus de la désignation des objets mobiliers
preferred label: tracery @en-us
broader: remplage
created: 2012-05-16T00:00:00+02:00
definition: Ensemble des éléments de remplage formant des divisions nombreuses dans les baies ou parties de baie à tracé curviligne. Les jours ainsi formés prennent différents noms selon leur forme : polylobe, soufflet, mouchette, etc.
status: 1

remplage
type: Concept
modified: 2014-12-09T16:16:14+01:00
in scheme: Thésaurus de la désignation des objets mobiliers
narrower: réseau de baie
narrower: pilier central
narrower: tympan
narrower: traverse
narrower: meneau
broader: fermeture de baie
created: 2012-05-16T00:00:00+02:00
definition: Ensemble des parties fixes dans le même matériau que l'embrasure (souvent la pierre), rapportées dans celle-ci pour en réduire ou diviser l'ouverture.
status: 1
narrow match: http://data.bnf.fr/ark:/12148/cb12117685c
broad match: http://vocab.getty.edu/aat/300003138

réseau de baie
type: PreferredTerm
modified: 2014-12-09T16:34:52+01:00
created: 2014-01-15T14:54:24+01:00
status: 1

four à pâtisserie
type: Concept
modified: 2014-10-13T13:21:08+02:00
in scheme: Thésaurus de la désignation des objets mobiliers
preferred label: bake ovens (baking devices) @en-us
broader: meuble pour le feu ou le réchauffage
created: 2012-05-16T00:00:00+02:00
definition: Meuble en métal ou construction en maçonnerie à côté du four à pain, comportant uniquement un four chauffé par un foyer ou par le passage de la fumée d'un fourneau indépendant.
status: 1
broad match: http://data.bnf.fr/ark:/12148/cb119785071

meuble pour le feu ou le réchauffage
type: Concept
modified: 2014-10-13T13:14:23+02:00
in scheme: Thésaurus de la désignation des objets mobiliers
preferred label: cooking and heating devices @en-us
narrower: four à pâtisserie
narrower: cuisinière-cheminée
narrower: potager
narrower: meuble-foyer
narrower: potence d'âtre
narrower: cuisinière
narrower: T69-3268
narrower: T69-3247
narrower: T69-3263
broader: meuble lié à l'alimentation
created: 2012-05-16T00:00:00+02:00
related: récipient pour la cuisson des aliments
definition: Meuble générateur de chaleur conçu pour cuire, réchauffer ou garder chauds les aliments.
TermeAssocie: récipient pour la cuisson des aliments
status: 1

four à pâtisserie
type: PreferredTerm
modified: 2014-10-13T13:21:08+02:00
created: 2014-01-15T14:54:24+01:00
status: 1

tonneau
type: Concept
modified: 2014-12-08T11:58:45+01:00
in scheme: Thésaurus de la désignation des objets mobiliers
preferred label: casks @en-us
narrower: verrou de fût
broader: récipient pour la conservation des aliments ou des boissons
created: 2012-05-16T00:00:00+02:00
definition: Récipient cylindrique en bois, renflé en son milieu, fait de douves cintrées assemblées et maintenues par des cercles de bois ou de fer et fermé par deux fonds plats. Le tonneau est utilisé pour la conservation, le vieillissement et le transport de boissons. Il comporte sur la panse un orifice munis d'un robinet ou d'un goulot fermé par un bouchon. Il est posé le plus souvent horizontalement, sur un support.
status: 1

récipient pour la conservation des aliments ou des boissons
type: Concept
modified: 2014-10-16T16:06:46+02:00
in scheme: Thésaurus de la désignation des objets mobiliers
preferred label: containers for storing or transporting food @en-us
narrower: tonneau
narrower: bidon
narrower: bonbonne
narrower: canne à lait
narrower: jarre
narrower: cruche
narrower: boîte à sel
narrower: pot à conserves
narrower: T69-4180
narrower: T69-4162
narrower: T69-4158
narrower: T69-4156
broader: objet lié aux aliments ou aux boissons
alternative label: boîte à gaufres
alternative label: boîte à galettes
alternative label: escargotière
alternative label: pot à escargots
alternative label: panier à crêpes
created: 2012-05-16T00:00:00+02:00
definition: Contenant, souvent fermé, destiné à conserver des aliments ou des boissons et parfois à les transporter, tout en en préservant le goût et la qualité.
status: 1
broad match: cb13184671j

verrou de fût
type: Concept
modified: 2014-12-08T12:00:41+01:00
in scheme: Thésaurus de la désignation des objets mobiliers
broader: tonneau
created: 2013-03-01T00:00:00+01:00
definition: Elément participant au dispositif de fermeture d'un fût. Le verrou est la pièce de bois ou de métal, souvent ouvragée, placée à l'extérieur du fût sur laquelle vient se bloquer l'écrou de serrage de la vis du portillon (pièce de bois biseautée placée à l'intérieur du fût).
status: 1
broad match: http://vocab.getty.edu/aat/300194515
broad match: http://data.bnf.fr/ark:/12148/cb122166394
broad match: Tonneau (récipient)

tonneau
type: PreferredTerm
modified: 2014-12-08T11:58:45+01:00
created: 2014-01-15T14:54:24+01:00
status: 1

pupitre orthodoxe
type: Concept
modified: 2014-01-10T00:00:00+01:00
in scheme: Thésaurus de la désignation des objets mobiliers
broader: meuble du culte orthodoxe
created: 2012-05-16T00:00:00+02:00
definition: Pupitre mobile servant à lire tous les textes y compris l'Evangile.
status: 1

meuble du culte orthodoxe
type: Concept
modified: 2014-01-10T00:00:00+01:00
in scheme: Thésaurus de la désignation des objets mobiliers
narrower: pupitre orthodoxe
narrower: siège d'église orthodoxe
narrower: autel orthodoxe
narrower: iconostase
narrower: fonts baptismaux orthodoxes
narrower: proskynétaire
narrower: table pour l'office des morts
narrower: tabernacle orthodoxe
narrower: table de prothèse
broader: meuble religieux
created: 2012-05-16T00:00:00+02:00
status: 1

pupitre orthodoxe
type: PreferredTerm
modified: 2014-01-10T00:00:00+01:00
created: 2014-01-15T14:54:24+01:00
status: 1

sandales liturgiques
type: Concept
modified: 2014-12-03T12:48:37+01:00
in scheme: Thésaurus de la désignation des objets mobiliers
preferred label: liturgical sandals @en-us
preferred label: sandali pontificali @it
preferred label: sandálias pontificais @pt
broader: bas et chaussures liturgiques
alternative label: mules liturgiques
alternative label: escarpins liturgiques
alternative label: sandales pontificales
alternative label: mules du pape
alternative label: sandales épiscopales
created: 2012-05-16T00:00:00+02:00
definition: Chaussures fermées, à talon plat, portées lors des messes pontificales par les prélats. Elles sont en soie, de la couleur du temps liturgique (sauf le noir), et sont portées avec des bas liturgiques.
status: 1

mules liturgiques
type: SimpleNonPreferredTerm
modified: 2014-12-03T12:48:37+01:00
created: 2014-01-15T14:54:24+01:00
status: 1

mules du pape
type: SimpleNonPreferredTerm
modified: 2014-12-03T12:48:37+01:00
created: 2014-01-15T14:54:24+01:00
status: 1

escarpins liturgiques
type: SimpleNonPreferredTerm
modified: 2014-12-03T12:48:37+01:00
created: 2014-01-15T14:54:24+01:00
status: 1

sandales pontificales
type: SimpleNonPreferredTerm
modified: 2014-12-03T12:48:37+01:00
created: 2014-01-15T14:54:24+01:00
status: 1

sandales épiscopales
type: SimpleNonPreferredTerm
modified: 2014-12-03T12:48:37+01:00
created: 2014-01-15T14:54:24+01:00
status: 1

sandales liturgiques
type: PreferredTerm
modified: 2014-12-03T12:48:37+01:00
created: 2014-01-15T14:54:24+01:00
status: 1

bas et chaussures liturgiques
type: Concept
modified: 2014-12-03T12:45:49+01:00
in scheme: Thésaurus de la désignation des objets mobiliers
preferred label: liturgical gaiters and shoes @en-us
preferred label: calze e calzature liturgiche @it
preferred label: meias e sapatos litúrgicos @pt
narrower: sandales liturgiques
narrower: chaussures d'enfant de choeur
narrower: bas liturgiques
broader: vêtement du culte catholique
created: 2012-05-16T00:00:00+02:00
related: pièce chaussée
definition: Élément d’habillement des jambes et des pieds dont le caractère précieux est variable suivant le rang et la fonction du clerc qui le porte ou le temps liturgique.
TermeAssocie: pièce chaussée
status: 1

objet religieux
type: Concept
modified: 2014-10-20T15:05:31+02:00
in scheme: Thésaurus de la désignation des objets mobiliers
preferred label: religious objects @en-us
preferred label: ogetti ecclesiastici @it
narrower: objet du culte orthodoxe
narrower: objet de religion polythéiste
narrower: objet de la religion musulmane
narrower: objet du culte catholique
narrower: objet du culte protestant
narrower: objet de la religion juive
created: 2012-05-16T00:00:00+02:00
related: textile religieux
related: meuble religieux
definition: Objet ou instrument lié à la liturgie d’une religion.
TermeAssocie: textile religieux
TermeAssocie: meuble religieux
status: 1

textile religieux
type: Concept
modified: 2014-10-21T15:48:42+02:00
in scheme: Thésaurus de la désignation des objets mobiliers
narrower: textile du culte catholique
narrower: textile de la religion juive
narrower: textile du culte protestant
narrower: T69-9476
narrower: T69-9078
narrower: T69-9475
created: 2012-05-16T00:00:00+02:00
related: objet religieux
definition: Vêtement, linge ou garniture lié à la liturgie d'une religion.
TermeAssocie: objet religieux
status: 1

objet de religion polythéiste
type: Concept
modified: 2014-01-10T00:00:00+01:00
in scheme: Thésaurus de la désignation des objets mobiliers
broader: objet religieux
alternative label: momie
created: 2013-12-05T00:00:00+01:00
status: 1

objet de la religion musulmane
type: Concept
modified: 2014-01-10T00:00:00+01:00
in scheme: Thésaurus de la désignation des objets mobiliers
broader: objet religieux
created: 2013-12-05T00:00:00+01:00
status: 1

objet religieux
type: PreferredTerm
modified: 2014-10-20T15:05:31+02:00
created: 2014-01-15T14:54:24+01:00
status: 1

objet du culte catholique
type: Concept
modified: 2014-11-26T12:19:42+01:00
in scheme: Thésaurus de la désignation des objets mobiliers
preferred label: religious objects of the catholic faith @en-us
preferred label: corredo ecclesiastico di culto cattolico @it
preferred label: objectos do culto católico @pt
narrower: objet de dévotion
narrower: objet lié aux sacrements autres que l'Eucharistie
narrower: objet lié à l'autel
narrower: objet lié à la procession
narrower: insigne ecclésiastique
narrower: objet lié à l'offrande et à la quête
narrower: boîte et coffret pour le rangement des objets liturgiques
narrower: objet lié au pèlerinage
narrower: objet lié à l'Eucharistie
narrower: objet funéraire
narrower: objet lié à l'ablution, à l'aspersion et à l'encensement
narrower: objet lié aux temps de Noël et de Carême
narrower: objet pour l'éclairage
narrower: objet lié à la consécration des églises, des autels et de la Porte sainte
broader: objet religieux
created: 2012-05-16T00:00:00+02:00
definition: Objet ou instrument lié à l’exercice ou à la pratique du culte catholique.
status: 1

meuble religieux
type: Concept
modified: 2014-12-01T11:41:47+01:00
in scheme: Thésaurus de la désignation des objets mobiliers
preferred label: religious furniture and furnishings @en-us
preferred label: arredi ecclesiastici @it
preferred label: mobiliário religioso @pt
narrower: meuble du culte orthodoxe
narrower: meuble du culte catholique
narrower: meuble du culte protestant
narrower: T69-1016
narrower: T69-9472
narrower: T69-9471
created: 2012-05-16T00:00:00+02:00
related: objet religieux
definition: Mobilier lié à la liturgie d’une religion ou servant au rangement des objets nécessaires à cette liturgie.
TermeAssocie: objet religieux
status: 1

objet du culte protestant
type: Concept
modified: 2014-01-10T00:00:00+01:00
in scheme: Thésaurus de la désignation des objets mobiliers
narrower: récipient pour la quête protestant
narrower: tronc à quêter protestant
narrower: coupe de communion
narrower: boîte pour le pain de la communion
narrower: plat de communion
narrower: aiguière de baptême
narrower: aiguière de communion
narrower: gobelet de baptême
narrower: patène protestante
narrower: bassin de baptême
broader: objet religieux
created: 2012-05-16T00:00:00+02:00
definition: Objet ou instrument lié à l’exercice ou à la pratique du culte protestant.
status: 1

objet de la religion juive
type: Concept
modified: 2014-01-10T00:00:00+01:00
in scheme: Thésaurus de la désignation des objets mobiliers
narrower: objet lié au culte domestique
narrower: objet lié au culte synagogal
broader: objet religieux
created: 2012-05-16T00:00:00+02:00
definition: Objet ou instrument lié à l’exercice ou à la pratique du culte juif.
status: 1

sifflet
type: Concept
modified: 2014-12-12T16:40:01+01:00
in scheme: Thésaurus de la désignation des objets mobiliers
preferred label: whistles @en-us
broader: flûte à biseau
alternative label: sifflet à eau
created: 2012-05-16T00:00:00+02:00
definition: Petit instrument à conduit d'air aménagé entre l'embouchure et le biseau, à un seul trou ou même sans trou, qui peut être réalisé dans des matériaux divers, bois, métal, argile, verre, etc.
status: 1

flûte à biseau
type: Concept
modified: 2014-10-10T11:51:31+02:00
in scheme: Thésaurus de la désignation des objets mobiliers
preferred label: flutes (aerophones) @en-us
narrower: sifflet
narrower: ocarina
narrower: galoubet
narrower: T69-5104
narrower: T69-5106
narrower: T69-5102
narrower: T69-5108
broader: aérophone à bouche
alternative label: flûte à embouchure terminale
alternative label: flûte oblique
alternative label: flûte multiple
alternative label: flûte à encoche
created: 2012-05-16T00:00:00+02:00
definition: Instrument sans anche fonctionnant grâce à l'envoi, depuis l'embouchure, d'un flux d'air sur une arête, le plus souvent biseautée, puis qui vibre dans le corps de l'instrument. Lorsque le biseau, comme l'embouchure, sont constitués par le rebord du tuyau lui-même, on parle de flûte à embouchure terminale.
status: 1

sifflet à eau
type: SimpleNonPreferredTerm
modified: 2014-12-12T16:40:01+01:00
created: 2014-01-15T14:54:24+01:00
status: 1

sifflet
type: PreferredTerm
modified: 2014-12-12T16:40:01+01:00
created: 2014-01-15T14:54:24+01:00
status: 1

coeur de dévotion
type: Concept
modified: 2015-03-09T10:45:17+01:00
in scheme: Thésaurus de la désignation des objets mobiliers
preferred label: cuore devozionale @it
preferred label: devotional hearts @en-us
preferred label: coração devocional @pt
broader: objet de dévotion
alternative label: cœur de dévotion
created: 2012-05-16T00:00:00+02:00
related: ex-voto
TermeAssocie: ex-voto
status: 1
broad match: Dévotions catholiques

ex-voto
type: Concept
modified: 2014-11-26T16:10:28+01:00
in scheme: Thésaurus de la désignation des objets mobiliers
preferred label: ex voto
preferred label: ex-votos (religious visual works) @en-us
broader: objet de dévotion
alternative label: tableau ex-voto
alternative label: maquette de bateau ex-voto
alternative label: ex-voto morphologique
created: 2012-05-16T00:00:00+02:00
related: coeur de dévotion
related: attribut d'image sacrée
related: maquette
related: couronne votive
related: bouquet
definition: Objet offert pour l'obtention ou en remerciement d'une grâce. Ce peut être un objet usuel ou un objet spécialement fabriqué pour l'occasion. Il porte une inscription relative à l'événement ou au donateur et une date.
TermeAssocie: coeur de dévotion
TermeAssocie: attribut d'image sacrée
TermeAssocie: maquette
TermeAssocie: couronne votive
TermeAssocie: bouquet
status: 1

objet de dévotion
type: Concept
modified: 2015-10-28T15:24:23+01:00
in scheme: Thésaurus de la désignation des objets mobiliers
preferred label: devotional objects @en-us
preferred label: oggetti devozionali @it
preferred label: objectos de devoção @pt
narrower: coeur de dévotion
narrower: ex-voto
narrower: attribut d'image sacrée
narrower: lampion votif
narrower: paradis
narrower: croix
narrower: objet de dévotion sous globe
narrower: oratoire domestique
narrower: relique
narrower: objet de dévotion encadré
narrower: agnus Dei
narrower: reliquaire
narrower: rose d'or
narrower: baiser de paix
narrower: image de commémoration
narrower: tableau de mission
narrower: panneau de dévotion
narrower: instruments de la Passion
narrower: marque à pain bénit
narrower: bénitier d'applique
narrower: chapelet
narrower: oratoire portatif
narrower: médaille de dévotion
narrower: bouteille à eau bénite
narrower: chemin de croix
narrower: grain de chapelet
narrower: bouteille-calvaire
narrower: couronne votive
broader: objet du culte catholique
alternative label: rameau bénit
alternative label: clef de saint Pierre
alternative label: buis bénit
alternative label: estoc pontifical
alternative label: roue de cire votive
created: 2012-05-16T00:00:00+02:00
related: édicule religieux chrétien
definition: Objet bénit ou commémoratif suscitant la dévotion des fidèles ou lié à leurs pratiques privées en l’honneur de Dieu et des saints.
TermeAssocie: édicule religieux chrétien
status: 1

cœur de dévotion
type: SimpleNonPreferredTerm
modified: 2015-03-09T10:45:17+01:00
created: 2014-01-15T14:54:24+01:00
status: 1

carafe
type: Concept
modified: 2014-12-08T15:49:51+01:00
in scheme: Thésaurus de la désignation des objets mobiliers
preferred label: carafes @en-us
broader: récipient pour le service et la consommation des boissons
alternative label: carafe à liqueur
alternative label: carafon
alternative label: carafe à glace
created: 2012-05-16T00:00:00+02:00
definition: Récipient en verre, de forme proche de celle du broc, généralement muni d'un bouchon emboîté en verre ou en métal, pour le service de l'eau et du vin.
status: 1

carafe à glace
type: SimpleNonPreferredTerm
modified: 2014-12-08T15:49:51+01:00
created: 2014-01-15T14:54:24+01:00
status: 1

carafon
type: SimpleNonPreferredTerm
modified: 2014-12-08T15:49:51+01:00
created: 2014-01-15T14:54:24+01:00
status: 1

carafe à liqueur
type: SimpleNonPreferredTerm
modified: 2014-12-08T15:49:51+01:00
created: 2014-01-15T14:54:24+01:00
status: 1

carafe
type: PreferredTerm
modified: 2014-12-08T15:49:51+01:00
created: 2014-01-15T14:54:24+01:00
status: 1

wagon-tombereau
type: Concept
modified: 2014-12-18T10:37:18+01:00
in scheme: Thésaurus de la désignation des objets mobiliers
preferred label: gondola cars @en-us
broader: matériel remorqué pour le transport ferroviaire des marchandises
created: 2013-11-04T00:00:00+01:00
definition: Véhicule ferroviaire ouvert destiné au transport des marchandises en vrac.
status: 1

matériel remorqué pour le transport ferroviaire des marchandises
type: Concept
modified: 2014-12-18T10:40:08+01:00
in scheme: Thésaurus de la désignation des objets mobiliers
preferred label: freight cars @en-us
narrower: wagon-tombereau
narrower: wagonnet à benne
narrower: wagon plat
narrower: wagon postal
narrower: wagon de transport en vrac
narrower: wagon couvert
narrower: wagon citerne
narrower: wagon-fourgon d'accompagnement
narrower: T69-8820
narrower: T69-9184
broader: matériel ferroviaire roulant
alternative label: wagon
created: 2013-11-04T00:00:00+01:00
scope note: Employer le terme "rame" en PDEN pour désigner un ensemble de wagons.
definition: Matériel ferroviaire roulant destiné au transport des denrées et des matériaux.
status: 1

wagon-tombereau
type: PreferredTerm
modified: 2014-12-18T10:37:18+01:00
created: 2014-01-15T14:54:24+01:00
status: 1

drapeau ou insigne
type: Concept
modified: 2014-12-12T10:36:04+01:00
in scheme: Thésaurus de la désignation des objets mobiliers
preferred label: flags or badges @en-us
broader: textile, garniture ou vêtement laïcs
alternative label: cocarde
alternative label: bannière civile, professionnelle ou militaire
alternative label: pavillon maritime
alternative label: étendard
alternative label: fanion
created: 2012-05-16T00:00:00+02:00
related: bannière de procession
related: bannière funéraire
definition: Support, le plus souvent pièce d'étoffe, portant une devise, un signal, une marque de dignité, de charge, de grade ou représentant la personnalité juridique collective d'un groupe ou d'une communauté. Il peut servir d'emblème ou de signe de ralliement.
TermeAssocie: bannière de procession
TermeAssocie: bannière funéraire
status: 1

bannière civile, professionnelle ou militaire
type: SimpleNonPreferredTerm
modified: 2014-12-12T10:36:04+01:00
created: 2014-01-15T14:54:24+01:00
status: 1

étendard
type: SimpleNonPreferredTerm
modified: 2014-12-12T10:36:04+01:00
created: 2014-01-15T14:54:24+01:00
status: 1

cocarde
type: SimpleNonPreferredTerm
modified: 2014-12-12T10:36:04+01:00
created: 2014-01-15T14:54:24+01:00
status: 1

textile, garniture ou vêtement laïcs
type: Concept
modified: 2014-10-17T16:39:44+02:00
in scheme: Thésaurus de la désignation des objets mobiliers
narrower: garniture architecturale
narrower: drapeau ou insigne
narrower: garniture de meuble
narrower: élément textile ou de garniture
narrower: costume civil, professionnel ou militaire
narrower: linge domestique
created: 2012-05-16T00:00:00+02:00
definition: Ensemble des éléments, principalement textile, qui complètent les meubles ou les objets domestiques ou bien encore qui forment les pièces du vêtement civil, professionnel ou militaire.
status: 1

fanion
type: SimpleNonPreferredTerm
modified: 2014-12-12T10:36:04+01:00
created: 2014-01-15T14:54:24+01:00
status: 1

bannière de procession
type: Concept
modified: 2014-11-27T16:10:55+01:00
in scheme: Thésaurus de la désignation des objets mobiliers
preferred label: processional banners @en-us
preferred label: stendardo processionale @it
preferred label: bandeira processional @pt
broader: objet lié à la procession
alternative label: bannière de confrérie
alternative label: bannière de congrégation
created: 2012-05-16T00:00:00+02:00
related: drapeau ou insigne
related: armoire à bannières
related: T69-1576
definition: Pièce, généralement de tissu, ornée d'un décor et souvent d'inscriptions, portée en procession par les membres d'une confrérie religieuse, d'une congrégation ou d'une paroisse. De forme rectangulaire en général, elle est suspendue à un support horizontal porté par une hampe et peut comporter des cordons latéraux.
TermeAssocie: drapeau ou insigne
TermeAssocie: armoire à bannières
TermeAssocie: T69-1576
status: 1

bannière funéraire
type: Concept
modified: 2014-10-22T10:30:35+02:00
in scheme: Thésaurus de la désignation des objets mobiliers
preferred label: funeral banners @en-us
broader: linge ou garniture liés aux rites funéraires
created: 2013-12-06T00:00:00+01:00
related: drapeau ou insigne
TermeAssocie: drapeau ou insigne
status: 1

pavillon maritime
type: SimpleNonPreferredTerm
modified: 2014-12-12T10:36:04+01:00
created: 2014-01-15T14:54:24+01:00
status: 1

drapeau ou insigne
type: PreferredTerm
modified: 2014-12-12T10:36:04+01:00
created: 2014-01-15T14:54:24+01:00
status: 1

bras-reliquaire
type: Concept
modified: 2014-11-26T17:34:48+01:00
in scheme: Thésaurus de la désignation des objets mobiliers
preferred label: reliquiario a braccio @it
preferred label: arm-reliquaries @en-us
preferred label: braço-relicário @pt
broader: reliquaire morphologique
created: 2012-05-16T00:00:00+02:00
definition: Reliquaire ayant la forme du bras qui constitue la relique.
status: 1
broad match: http://vocab.getty.edu/aat/300263061

reliquaire morphologique
type: Concept
modified: 2014-11-26T17:30:48+01:00
in scheme: Thésaurus de la désignation des objets mobiliers
preferred label: reliquiario antropomorfo @it
preferred label: body-part reliquaries @en-us
preferred label: relicário antropomórfico @pt
narrower: bras-reliquaire
narrower: chef-reliquaire
narrower: coeur-reliquaire
broader: reliquaire
alternative label: doigt-reliquaire
alternative label: reliquaire de crâne
alternative label: main-reliquaire
alternative label: genou-reliquaire
alternative label: côte-reliquaire
alternative label: pied-reliquaire
alternative label: cuisse-reliquaire
created: 2012-05-16T00:00:00+02:00
related: tête
definition: Reliquaire représentant la partie du corps qui constitue la relique (chef-reliquaire, bras-reliquaire, doigt-reliquaire, etc.).
TermeAssocie: tête
status: 1
broad match: http://data.bnf.fr/ark:/12148/cb119327497

bras-reliquaire
type: PreferredTerm
modified: 2014-11-26T17:34:48+01:00
created: 2014-01-15T14:54:24+01:00
status: 1

étalon
type: Concept
modified: 2014-12-15T15:48:00+01:00
in scheme: Thésaurus de la désignation des objets mobiliers
broader: mesure de référence
created: 2013-12-18T00:00:00+01:00
definition: Objet permettant la matérialisation d’une unité de mesure, comportant, le plus souvent, la marque de garantie d’une institution de contrôle.
status: 1
narrow match: cb12412035g

mesure de référence
type: Concept
modified: 2014-09-09T16:10:39+02:00
in scheme: Thésaurus de la désignation des objets mobiliers
narrower: étalon
narrower: masse marquée
broader: instrument pédagogique ou scientifique
created: 2013-12-18T00:00:00+01:00
related: mesure
related: outil servant à mesurer ou dessiner
definition: Objet, pris comme référence, permettant de déterminer par comparaison la grandeur de ce que l’on cherche à mesurer.
TermeAssocie: mesure
TermeAssocie: outil servant à mesurer ou dessiner
status: 1
broad match: http://vocab.getty.edu/aat/300207870

étalon
type: PreferredTerm
modified: 2014-12-15T15:48:00+01:00
created: 2014-01-15T14:54:24+01:00
status: 1

linteau
type: Concept
modified: 2015-01-07T12:32:05+01:00
in scheme: Thésaurus de la désignation des objets mobiliers
preferred label: lintels @en-us
broader: couvrement
created: 2012-05-16T00:00:00+02:00
scope note: Voir aussi le Thesaurus de la désignation des œuvres architecturales et des espaces aménagés.
definition: Bloc de pierre (à la différence de la plate-bande qui est appareillée), pièce de bois ou de métal rectiligne, couvrant une baie. Il reçoit la charge des parties situées au-dessus de la baie et la reporte sur les deux points d'appui.
status: 1

linteau
type: PreferredTerm
modified: 2015-01-07T12:32:05+01:00
created: 2014-01-15T14:54:24+01:00
status: 1

couvrement
type: Concept
modified: 2015-01-28T17:08:53+01:00
in scheme: Thésaurus de la désignation des objets mobiliers
narrower: linteau
narrower: lambris de couvrement
narrower: plafond
narrower: plate-bande
narrower: voûte
narrower: élément de couvrement
narrower: T69-233
narrower: T69-231
broader: élément d'architecture
created: 2012-05-16T00:00:00+02:00
scope note: Voir aussi le Thesaurus de la désignation des œuvres architecturales et des espaces aménagés.
definition: Organe ou ouvrage limitant par le haut un entrecolonnement, une baie, une pièce, un vaisseau, etc.
status: 1

photographie
type: Concept
modified: 2014-12-03T15:43:31+01:00
in scheme: Thésaurus de la désignation des objets mobiliers
preferred label: photographs @en-us
narrower: plaque photographique
narrower: daguerréotype
broader: arts graphiques
alternative label: positif photographique
alternative label: autochrome
alternative label: photogramme
alternative label: photomontage
alternative label: tirage photographique
alternative label: diapositive
alternative label: négatif photographique
created: 2013-07-22T00:00:00+02:00
related: support d'enregistrement
definition: Image permanente obtenue à partir du procédé de la photographie, c'est-à-dire par l'action de la lumière sur une surface sensible (plaque de verre ou film pour la photographie argentique, capteur éledctronique pour la photographie numérique).
TermeAssocie: support d'enregistrement
status: 1

support d'enregistrement
type: Concept
modified: 2014-01-10T00:00:00+01:00
in scheme: Thésaurus de la désignation des objets mobiliers
broader: appareil d'enregistrement ou de restitution
alternative label: plaque de projection
alternative label: film
created: 2012-05-16T00:00:00+02:00
related: photographie
TermeAssocie: photographie
status: 1

arts graphiques
type: Concept
modified: 2014-10-17T15:38:13+02:00
in scheme: Thésaurus de la désignation des objets mobiliers
preferred label: graphic arts @en-us
narrower: photographie
narrower: carte
narrower: plan
narrower: manuscrit
narrower: plaque décorative
narrower: dessin
narrower: tag
narrower: document imprimé
narrower: graffiti
narrower: affiche
narrower: estampe
narrower: livre
broader: peinture, arts graphiques et des média
created: 2012-05-16T00:00:00+02:00
definition: Œuvre dont la technique de représentation utilise les lignes ou les courbes et évoque le dessin, aujourd'hui le graphisme. Par extension, on inclut les œuvres réalisées, le plus souvent sur papier, par des procédés de reproduction (gravure, typographie, imprimerie, photographie).
status: 1

photomontage
type: SimpleNonPreferredTerm
modified: 2014-12-03T15:43:31+01:00
created: 2014-01-15T14:54:24+01:00
status: 1

plaque photographique
type: Concept
modified: 2014-10-17T15:51:49+02:00
in scheme: Thésaurus de la désignation des objets mobiliers
preferred label: photographic plates @en-us
broader: photographie
created: 2013-07-22T00:00:00+02:00
definition: Plaque de verre couverte d'une couche d'émulsion sensible à la lumière, obtenue selon différents procédés, permettant la reproduction des images photographiques.
status: 1

photogramme
type: SimpleNonPreferredTerm
modified: 2014-12-03T15:43:31+01:00
created: 2014-01-15T14:54:24+01:00
status: 1

positif photographique
type: SimpleNonPreferredTerm
modified: 2014-12-03T15:43:31+01:00
created: 2014-01-15T14:54:24+01:00
status: 1

diapositive
type: SimpleNonPreferredTerm
modified: 2014-12-03T15:43:31+01:00
created: 2014-01-15T14:54:24+01:00
status: 1

autochrome
type: SimpleNonPreferredTerm
modified: 2014-12-03T15:43:31+01:00
created: 2014-01-15T14:54:24+01:00
status: 1

tirage photographique
type: SimpleNonPreferredTerm
modified: 2014-12-03T15:43:31+01:00
created: 2014-01-15T14:54:24+01:00
status: 1

daguerréotype
type: Concept
modified: 2014-12-03T15:45:27+01:00
in scheme: Thésaurus de la désignation des objets mobiliers
preferred label: daguerreotypes (photographs) @en-us
broader: photographie
created: 2013-07-22T00:00:00+02:00
definition: Image positive directe obtenue sur plaque de cuivre enduite d'une couche d'argent, rendue sensible à la lumière par les vapeurs d'iode, et développée au mercure. Image unique, fragile, souvent présentée encadrée, sous verre ou dans un écrin. Le daguerréotype est particulièrement présent en France entre 1839 et 1855/1860.
status: 1

photographie
type: PreferredTerm
modified: 2014-12-03T15:43:31+01:00
created: 2014-01-15T14:54:24+01:00
status: 1

négatif photographique
type: SimpleNonPreferredTerm
modified: 2014-12-03T15:43:31+01:00
created: 2014-01-15T14:54:24+01:00
status: 1

sceptre de statue
type: Concept
modified: 2014-11-26T14:32:09+01:00
in scheme: Thésaurus de la désignation des objets mobiliers
preferred label: statue scepters @en-us
preferred label: scettro di statua @it
preferred label: ceptro de estátua @pt
broader: attribut d'image sacrée
created: 2012-05-16T00:00:00+02:00
definition: Sceptre réalisé en matériau plus ou moins précieux et porté par une statue, religieuse en général (Christ, Vierge) ou un saint qu'il contribue à caractériser.
status: 1

attribut d'image sacrée
type: Concept
modified: 2014-11-26T14:18:57+01:00
in scheme: Thésaurus de la désignation des objets mobiliers
preferred label: attributes of a sacred image @en-us
preferred label: attributo iconografico di immagine sacra @it
preferred label: atributo de imagem sagrada @pt
narrower: sceptre de statue
narrower: couronne de statue
narrower: costume de statue
broader: objet de dévotion
alternative label: parure de sculpture
alternative label: parure d'image sacrée
alternative label: auréole de tableau
alternative label: parure de tableau
alternative label: parure de statue
alternative label: auréole de statue
alternative label: parement d'image pieuse
alternative label: auréole de dévotion
alternative label: sceptre d'image sacrée
alternative label: revêtement d'image sacrée
alternative label: parement d'image sacrée
alternative label: parement d'icône
alternative label: nimbe de dévotion
alternative label: parement de tableau
created: 2012-05-16T00:00:00+02:00
related: ex-voto
definition: Objet, souvent en métal, représentant un ou plusieurs attributs iconographiques (sceptre, etc.), appliqué sur une image sacrée qu'il contribue à caractériser ou porté par celle-ci comme protection ou en signe de révérence.
TermeAssocie: ex-voto
status: 1
broad match: cb12233110q
broad match: http://vocab.getty.edu/aat/300234144
broad match: Objets du culte catholique

sceptre de statue
type: PreferredTerm
modified: 2014-11-26T14:32:09+01:00
created: 2014-01-15T14:54:24+01:00
status: 1

réserve à eau baptismale
type: Concept
modified: 2014-12-01T10:46:55+01:00
in scheme: Thésaurus de la désignation des objets mobiliers
preferred label: baptismal water containers @en-us
preferred label: vaso per la reserva dell'acqua battesimale @it
preferred label: reservatório da água baptismal @pt
broader: objet lié aux sacrements autres que l'Eucharistie
alternative label: cuvette des fonts baptismaux
alternative label: réserve à eau de baptême
alternative label: bassin de fonts baptismaux
alternative label: cuvette baptismale
created: 2012-05-16T00:00:00+02:00
related: fonts baptismaux
definition: Récipient couvert, en forme de marmite, généralement en métal, permettant de conserver l'eau du baptême lorsqu'elle n'est pas contenue directement dans la cuve des fonts baptismaux ou dans un bassin des fonts baptismaux.
TermeAssocie: fonts baptismaux
status: 1
broad match: cb11978488k
broad match: http://vocab.getty.edu/aat/300194500
broad match: Fonts baptismaux

réserve à eau baptismale
type: PreferredTerm
modified: 2014-12-01T10:46:55+01:00
created: 2014-01-15T14:54:24+01:00
status: 1

bassin de fonts baptismaux
type: SimpleNonPreferredTerm
modified: 2014-12-01T10:46:55+01:00
created: 2014-01-15T14:54:24+01:00
status: 1

réserve à eau de baptême
type: SimpleNonPreferredTerm
modified: 2014-12-01T10:46:55+01:00
created: 2014-01-15T14:54:24+01:00
status: 1

objet lié aux sacrements autres que l'Eucharistie
type: Concept
modified: 2014-12-01T10:17:49+01:00
in scheme: Thésaurus de la désignation des objets mobiliers
preferred label: oggetti per gli altri sacramenti @it
preferred label: objects for the other sacraments @en-us
preferred label: objectos relacionados com os sacramentos @pt
narrower: réserve à eau baptismale
narrower: peigne liturgique
narrower: réserves aux saintes huiles
narrower: coffret aux saintes huiles
narrower: T69-1343
narrower: T69-1347
narrower: T69-1349
narrower: T69-1308
narrower: T69-1306
narrower: T69-1289
narrower: T69-1356
narrower: T69-1311
narrower: T69-1319
narrower: T69-1322
narrower: T69-1325
narrower: T69-1314
broader: objet du culte catholique
created: 2012-05-16T00:00:00+02:00
definition: Objet, instrument ou vase généralement à l’usage de l’officiant, lié à la préparation et à l’administration des autres sacrements (baptême, confirmation, réconciliation ou pénitence, onction des malades, mariage, ordre).
status: 1
broad match: cb11936841q
broad match: http://vocab.getty.edu/aat/300234147
broad match: Objets du culte catholique

fonts baptismaux
type: Concept
modified: 2014-12-02T12:15:31+01:00
in scheme: Thésaurus de la désignation des objets mobiliers
preferred label: baptismal fonts @en-us
preferred label: fonte battesimale @it
preferred label: pia baptismal @pt
narrower: T69-696
narrower: T69-694
broader: meuble lié aux sacrements autres que l'Eucharistie
created: 2012-05-16T00:00:00+02:00
related: réserve à eau baptismale
related: parement des fonts baptismaux
related: bénitier
definition: Cuve posée au-dessus du sol et servant à recevoir l'eau utilisée lors du baptême. Les fonts baptismaux comportent souvent un couvercle et peuvent être placés sur un pied. La cuve comporte un écoulement pour que l'eau du baptême puisse s’évacuer dans le sol. Elle peut être doublée par un bassin des fonts baptismaux.
TermeAssocie: réserve à eau baptismale
TermeAssocie: parement des fonts baptismaux
TermeAssocie: bénitier
status: 1

cuvette baptismale
type: SimpleNonPreferredTerm
modified: 2014-12-01T10:46:55+01:00
created: 2014-01-15T14:54:24+01:00
status: 1

cuvette des fonts baptismaux
type: SimpleNonPreferredTerm
modified: 2014-12-01T10:46:55+01:00
created: 2014-01-15T14:54:24+01:00
status: 1

pot à cuire
type: Concept
modified: 2014-12-08T12:34:36+01:00
in scheme: Thésaurus de la désignation des objets mobiliers
preferred label: crockpots @en-us
broader: récipient pour la cuisson des aliments
alternative label: pot à cuire-daubière
alternative label: diable
alternative label: pot à soupe
alternative label: pot à cuire suspendu
created: 2012-05-16T00:00:00+02:00
definition: Récipient en métal ou en céramique, aussi haut que large, à fond plat, arrondi ou sur pieds, couvert ou non, dans lequel on fait mijoter des aliments dans les braises. Il est muni d'une ou deux anses latérales juxtaposées et/ou d'un petit manche.
status: 1
broad match: cb12330782p

diable
type: SimpleNonPreferredTerm
modified: 2014-12-08T12:34:36+01:00
created: 2014-01-15T14:54:24+01:00
status: 1

pot à cuire suspendu
type: SimpleNonPreferredTerm
modified: 2014-12-08T12:34:36+01:00
created: 2014-01-15T14:54:24+01:00
status: 1

pot à soupe
type: SimpleNonPreferredTerm
modified: 2014-12-08T12:34:36+01:00
created: 2014-01-15T14:54:24+01:00
status: 1

pot à cuire-daubière
type: SimpleNonPreferredTerm
modified: 2014-12-08T12:34:36+01:00
created: 2014-01-15T14:54:24+01:00
status: 1

pot à cuire
type: PreferredTerm
modified: 2014-12-08T12:34:36+01:00
created: 2014-01-15T14:54:24+01:00
status: 1

récipient pour la cuisson des aliments
type: Concept
modified: 2014-10-16T16:21:46+02:00
in scheme: Thésaurus de la désignation des objets mobiliers
preferred label: containers for cooking food @en-us
narrower: réchaud
narrower: pot à cuire
narrower: bouilloire
narrower: étouffoir de cuisson
narrower: four de campagne
narrower: bain-marie
narrower: bassine à confit
narrower: tourtière
narrower: lèchefrite
narrower: moule à gâteau
narrower: moule à gaufres
narrower: daubière
narrower: bassine à sirop
narrower: bassine à confiture
narrower: marmite
narrower: plat à cuire
narrower: terrine à tripes
narrower: poêle à galettes
narrower: rôtissoire
narrower: cuit-oeufs
narrower: chaudron
narrower: pot à jus de viande
narrower: casserole
narrower: terrine à pâté
narrower: poêle à cuire
narrower: boule à cuire
broader: objet lié aux aliments ou aux boissons
alternative label: grilloir à café
alternative label: pot à bouillir le lait
alternative label: garde-lait
alternative label: jambonnière
alternative label: veille-lait
alternative label: couvercle de cuisine
alternative label: pot à châtaignes
alternative label: diable à trous
created: 2012-05-16T00:00:00+02:00
related: meuble pour le feu ou le réchauffage
definition: Contenant servant à cuire, réchauffer ou garder au chaud les aliments.
TermeAssocie: meuble pour le feu ou le réchauffage
status: 1

treillage
type: Concept
modified: 2015-02-24T10:56:07+01:00
in scheme: Thésaurus de la désignation des objets mobiliers
preferred label: trellises @en-us
broader: édicule et mobilier de jardin
created: 2012-06-11T00:00:00+02:00
definition: Assemblage de lattes de bois ou de plastique, d’échalas, de barres de fer, posées parallèlement ou croisées formant des mailles de différentes tailles. Un treillage est généralement adossé à un support vertical ou plan. Il ne doit pas être confondu avec la fabrique de treillage, qui peut emprunter diverses formes architecturales.
status: 1

treillage
type: PreferredTerm
modified: 2015-02-24T10:56:07+01:00
created: 2014-01-15T14:54:24+01:00
status: 1

objet lié à l'autel
type: Concept
modified: 2014-11-27T12:00:10+01:00
in scheme: Thésaurus de la désignation des objets mobiliers
preferred label: oggetti par l'altare @it
preferred label: objects for the altar @en-us
preferred label: objectos relacionados com o altar @pt
narrower: chapelle de messe
narrower: autel portatif
narrower: porte-bouquet d'autel
narrower: chandelier d'autel
narrower: vase-bouquet d'autel
narrower: main de lecture d'église
narrower: bouquet d'autel
narrower: pied de croix d'autel
narrower: pupitre-thabor
narrower: croix d'autel
narrower: plat de livre liturgique
narrower: pupitre d'autel
narrower: chandelier d'acolyte
narrower: service décoratif de crédence
narrower: vase d'autel
narrower: capsella
narrower: canon d'autel
broader: objet du culte catholique
created: 2012-05-16T00:00:00+02:00
related: sonnette d'autel
related: clochette d'autel
definition: Objet ou instrument positionné sur ou autour de l’autel lors de l’office. La plupart d’entre eux sont gardés dans la sacristie le reste du temps.
TermeAssocie: sonnette d'autel
TermeAssocie: clochette d'autel
status: 1

sonnette d'autel
type: Concept
modified: 2014-12-15T12:28:59+01:00
in scheme: Thésaurus de la désignation des objets mobiliers
preferred label: campanello d'altare multiplo @it
preferred label: altar bells @en-us
broader: clochette
alternative label: carillon liturgique
created: 2012-05-16T00:00:00+02:00
related: objet lié à l'autel
related: cloche de sacristie
related: cloche de choeur
definition: Instrument sonore à percussion constitué de plusieurs clochettes en métal, généralement en bronze et muni d'une poignée sur le dessus. La sonnette d'autel est actionnée par le servant de messe pour marquer certains moments importants d'un office.
TermeAssocie: objet lié à l'autel
TermeAssocie: cloche de sacristie
TermeAssocie: cloche de choeur
status: 1
broad match: cb11976117r

chapelle de messe
type: Concept
modified: 2014-11-27T13:04:53+01:00
in scheme: Thésaurus de la désignation des objets mobiliers
preferred label: servizio da messa portatile @it
preferred label: mass sets @en-us
preferred label: serviço de missa @pt
broader: objet lié à l'autel
created: 2012-05-16T00:00:00+02:00
related: calice
related: patène
related: coffret aux saintes huiles
related: seau à eau bénite
related: goupillon
related: bassin à ablutions
related: bougeoir pontifical
related: porte-burettes
related: T69-1360
related: T69-1180
related: T69-1189
related: T69-1289
definition: Ensemble d'objets servant à dire la messe, parfois à administrer les sacrements. La chapelle est généralement composée d'un calice, d'une patène et de burettes avec leur support (plateau ou bassin) souvent accompagnés d'une clochette d'autel, parfois d'un seau à eau bénite et d'un goupillon, d'une boîte à hosties, d'un coffret ou d'ampoules aux saintes huiles, etc. La chapelle d'un prélat ayant droit aux ornements pontificaux comporte en plus une aiguière à ablutions et un bassin à ablutions ainsi qu'un bougeoir pontifical et peut porter les armoiries de son commanditaire.
TermeAssocie: calice
TermeAssocie: patène
TermeAssocie: coffret aux saintes huiles
TermeAssocie: seau à eau bénite
TermeAssocie: goupillon
TermeAssocie: bassin à ablutions
TermeAssocie: bougeoir pontifical
TermeAssocie: porte-burettes
TermeAssocie: T69-1360
TermeAssocie: T69-1180
TermeAssocie: T69-1189
TermeAssocie: T69-1289
status: 1
broad match: cb11936841q
broad match: Objets du culte catholique

clochette d'autel
type: Concept
modified: 2014-12-15T12:27:14+01:00
in scheme: Thésaurus de la désignation des objets mobiliers
preferred label: campanello d'altare @it
preferred label: altar handbells @en-us
broader: clochette
created: 2012-05-16T00:00:00+02:00
related: objet lié à l'autel
definition: Petite cloche portative, généralement en bronze, munie d'un manche ou d'une poignée, que le servant de messe agite pour marquer certains moments importants d'un office. Elle peut porter un décor religieux.
TermeAssocie: objet lié à l'autel
status: 1
broad match: http://data.bnf.fr/ark:/12148/cb122711462

autel portatif
type: Concept
modified: 2014-11-27T12:02:12+01:00
in scheme: Thésaurus de la désignation des objets mobiliers
preferred label: portable altars @en-us
preferred label: altare portatile @it
preferred label: ara portátil @pt
broader: objet lié à l'autel
alternative label: autel mobile
created: 2012-05-16T00:00:00+02:00
scope note: Ne pas confondre avec l'autel de voyage.
definition: Pierre d'autel consacrée, mobile, utilisée pour célébrer le sacrifice de la messe sur un meuble ou un autel non consacré. Elle est généralement insérée dans un cadre en bois ou en métal qui peut prendre la forme d'un petit coffre. La pierre d'autel peut être en jaspe, onyx, porphyre, marbre, ardoise, etc.
status: 1

porte-bouquet d'autel
type: Concept
modified: 2014-11-27T13:16:40+01:00
in scheme: Thésaurus de la désignation des objets mobiliers
preferred label: altar bouquet holders @en-us
preferred label: vaso d'altare per composizione floreale @it
preferred label: suporte para ramo de altar @pt
broader: objet lié à l'autel
created: 2012-05-16T00:00:00+02:00
definition: Support indépendant utilisé pour porter un bouquet d'autel. Souvent en forme de vase, il n'est cependant généralement pas creux et n'est pas fait pour contenir de l'eau, mais présente à son sommet un trou dans lequel est inséré le bouquet d'autel.
status: 1

chandelier d'autel
type: Concept
modified: 2014-11-27T12:57:51+01:00
in scheme: Thésaurus de la désignation des objets mobiliers
preferred label: altar candlesticks @en-us
preferred label: candeliere d'altare @it
preferred label: castiçal de altar @pt
narrower: T69-1133
broader: objet lié à l'autel
created: 2012-05-16T00:00:00+02:00
related: chandelier d'église
definition: Chandelier à une seule lumière, posé sur l'autel ou sur les gradins d’autel. Assortis et disposés de part et d'autre du tabernacle, parfois de taille décroissante, les chandeliers d'autel sont utilisés en nombre variable selon les solennités (de deux à douze en général). Ils forment souvent un ensemble avec la croix d'autel, constituant une garniture d’autel.
TermeAssocie: chandelier d'église
status: 1

vase-bouquet d'autel
type: Concept
modified: 2014-11-27T13:29:27+01:00
in scheme: Thésaurus de la désignation des objets mobiliers
preferred label: vaso d'altare con composizione floreale @it
preferred label: altar bouquet vases @en-us
preferred label: vaso com ramo de altar @pt
broader: objet lié à l'autel
created: 2012-05-16T00:00:00+02:00
definition: Composition fixe ou démontable, destinée à orner un autel, formée de fleurs artificielles portées par un vase ou un support en forme de vase. L'ensemble peut être disposé sous un globe.
status: 1
broad match: http://data.bnf.fr/ark:/12148/cb119337709

main de lecture d'église
type: Concept
modified: 2014-11-27T13:10:19+01:00
in scheme: Thésaurus de la désignation des objets mobiliers
preferred label: indice segnalibro @it
preferred label: liturgical book pointers @en-us
preferred label: mão de leitura @pt
broader: objet lié à l'autel
created: 2012-05-16T00:00:00+02:00
related: T69-1915
definition: Petit instrument, généralement en métal, utilisé pour faciliter la lecture d'un livre liturgique en permettant d'en suivre les lignes. La main de lecture d'église a la forme d'un style, parfois terminé, à une de ses extrémités, par une main à l'index pointé, et à l'autre, par un anneau servant à attacher l'objet au livre ou à un pupitre.
TermeAssocie: T69-1915
status: 1
broad match: cb11936841q
broad match: Objets du culte catholique

bouquet d'autel
type: Concept
modified: 2014-11-27T12:05:44+01:00
in scheme: Thésaurus de la désignation des objets mobiliers
preferred label: altar bouquets @en-us
preferred label: composizione floreale d'altare @it
preferred label: ramo de altar @pt
broader: objet lié à l'autel
created: 2012-05-16T00:00:00+02:00
definition: Fleurs artificielles en métal, tissu, céramique, disposées en bouquet et destinées à orner un autel ou son environnement immédiat. Le bouquet d'autel est généralement maintenu par un porte-bouquet d'autel. Il peut encore reposer directement sur l'extrémité de ses tiges disposées en faisceau.
status: 1

pied de croix d'autel
type: Concept
modified: 2014-11-27T13:11:54+01:00
in scheme: Thésaurus de la désignation des objets mobiliers
preferred label: base per croce d'altare @it
preferred label: altar cross stands @en-us
preferred label: basa da cruz de altar @pt
broader: objet lié à l'autel
alternative label: pied de croix
created: 2012-05-16T00:00:00+02:00
related: croix d'autel
related: croix-reliquaire
related: croix de procession
definition: Pied destiné à recevoir, sur un autel, une croix-reliquaire ou une croix de procession qui, détachée de sa hampe et placée sur ce support, se transforme ainsi en croix d'autel.
TermeAssocie: croix d'autel
TermeAssocie: croix-reliquaire
TermeAssocie: croix de procession
status: 1
broad match: cb12647480k
broad match: Altar crucifix

pupitre-thabor
type: Concept
modified: 2014-11-27T13:25:32+01:00
in scheme: Thésaurus de la désignation des objets mobiliers
preferred label: thabor missal stands @en-us
preferred label: leggio d'altare-espositorio @it
preferred label: estante-expositório @pt
broader: objet lié à l'autel
alternative label: thabor porte-missel
created: 2012-05-16T00:00:00+02:00
related: thabor
definition: Pupitre d'autel dont le plan incliné peut se rabattre pour former un thabor.
TermeAssocie: thabor
status: 1

croix d'autel
type: Concept
modified: 2014-11-27T13:09:02+01:00
in scheme: Thésaurus de la désignation des objets mobiliers
preferred label: altar crosses @en-us
preferred label: croce d'altare @it
preferred label: cruz de altar @pt
broader: objet lié à l'autel
alternative label: crucifix d'autel
created: 2012-05-16T00:00:00+02:00
related: pied de croix d'autel
related: croix
definition: Crucifix que l'on place au centre d’un autel, au-dessus du tabernacle, ou sur les gradins et formant généralement un ensemble avec les chandeliers d'autel, appelé garniture d’autel.
TermeAssocie: pied de croix d'autel
TermeAssocie: croix
status: 1

plat de livre liturgique
type: Concept
modified: 2014-11-27T13:13:36+01:00
in scheme: Thésaurus de la désignation des objets mobiliers
preferred label: coperta di libro liturgico @it
preferred label: liturgical book covers @en-us
preferred label: capa de livro litúrgico @pt
broader: objet lié à l'autel
alternative label: plat de missel
alternative label: plat d'évangéliaire
created: 2012-05-16T00:00:00+02:00
related: livre liturgique
related: reliure
definition: Partie plate, rapportée, amovible ou détachée, de la reliure d'un livre liturgique. Les plats de livre liturgique sont généralement en métal ou en ivoire et sont richement décorés. Ils sont souvent conservés séparément.
TermeAssocie: livre liturgique
TermeAssocie: reliure
status: 1
broad match: http://data.bnf.fr/ark:/12148/cb12314743b

pupitre d'autel
type: Concept
modified: 2014-11-27T13:22:07+01:00
in scheme: Thésaurus de la désignation des objets mobiliers
preferred label: missal stands @en-us
preferred label: leggio d'altare @it
preferred label: estante de missal @pt
broader: objet lié à l'autel
alternative label: porte-missel
alternative label: trépied d'autel
created: 2012-05-16T00:00:00+02:00
related: voile de pupitre d'autel
definition: Support incliné, en bois ou en métal, parfois pliant, sur lequel on pose un livre liturgique.
TermeAssocie: voile de pupitre d'autel
status: 1

objet lié à l'autel
type: PreferredTerm
modified: 2014-11-27T12:00:10+01:00
created: 2014-01-15T14:54:24+01:00
status: 1

chandelier d'acolyte
type: Concept
modified: 2014-11-27T12:54:53+01:00
in scheme: Thésaurus de la désignation des objets mobiliers
preferred label: candelabro dell'accolito @it
preferred label: acolyte candlesticks @en-us
preferred label: castiçal de acólito @pt
broader: objet lié à l'autel
created: 2012-05-16T00:00:00+02:00
related: chandelier d'église
definition: Chandelier à une seule lumière porté à l'intérieur de l'église par les servants de rang inférieur lors des processions et durant les messes. On en compte deux en général, sept dans la liturgie papale et dans la liturgie pontificale de certains diocèses. Ces chandeliers possèdent souvent une base circulaire et une tige assez haute.
TermeAssocie: chandelier d'église
status: 1

service décoratif de crédence
type: Concept
modified: 2014-11-27T13:26:52+01:00
in scheme: Thésaurus de la désignation des objets mobiliers
preferred label: servizio da parata @it
preferred label: credence service sets @en-us
preferred label: serviço de aparato @pt
broader: objet lié à l'autel
alternative label: vase décoratif de crédence
alternative label: plat décoratif de crédence
alternative label: coupe décorative de crédence
alternative label: service d'apparat de crédence
alternative label: service de montre de crédence
created: 2012-05-16T00:00:00+02:00
related: crédence
definition: Ensemble de pièces d'apparat, caractérisées par leur richesse décorative et généralement par leur taille importante, faites pour être exposées sur une crédence, lors des messes solennelles. Le service décoratif de crédence, souvent timbré des armoiries de son commanditaire est composé de plats, de coupes, etc. Ce service ne se différencie souvent des services décoratifs civils que par une iconographie ou un décor religieux.
TermeAssocie: crédence
status: 1
broad match: cb11936841q

vase d'autel
type: Concept
modified: 2014-11-27T13:35:40+01:00
in scheme: Thésaurus de la désignation des objets mobiliers
preferred label: altar vases @en-us
preferred label: vaso d'altare @it
preferred label: jarra de altar @pt
broader: objet lié à l'autel
alternative label: vase d'église
created: 2012-05-16T00:00:00+02:00
definition: Récipient pouvant contenir de l'eau, posé sur l'autel ou près de celui-ci, dans lequel on met des fleurs naturelles ou artificielles.
status: 1

capsella
type: Concept
modified: 2014-11-27T12:52:27+01:00
in scheme: Thésaurus de la désignation des objets mobiliers
preferred label: sepulchers (reliquaries) @en-us
preferred label: capsella per reliquie d'altare @it
preferred label: cápsula @pt
broader: objet lié à l'autel
alternative label: coffret à reliques d'autel
alternative label: boîte à reliques d'autel
created: 2012-05-16T00:00:00+02:00
related: reliquaire
definition: Récipient contenant des reliques, une hostie, des linges ou des cotons ayant touché des reliques, des grains d'encens et, souvent, un papier ou un parchemin portant un texte commémoratif. La capsella est déposée dans une cavité, appelée sépulcre, placée dans une partie quelconque d'un autel, souvent sur la table, au moment de sa dédicace. Elle peut prendre la forme d'une petite châsse, d'une boîte, d'un coffret, d'un lacrymatoire, d'un vase, etc., et être décorée de motifs ou de symboles chrétiens.
TermeAssocie: reliquaire
status: 1
broad match: cb11936841q
broad match: Objets du culte catholique

canon d'autel
type: Concept
modified: 2014-11-27T12:10:07+01:00
in scheme: Thésaurus de la désignation des objets mobiliers
preferred label: altar cards @en-us
preferred label: cartagloria @it
preferred label: sacra @pt
broader: objet lié à l'autel
alternative label: carton d'autel
alternative label: tablette des secrètes
alternative label: table des secrètes
alternative label: secrète
created: 2012-05-16T00:00:00+02:00
definition: Petit(s) panneau(x), souvent encadré(s), portant, imprimés ou manuscrits, certains textes invariables de la messe et utilisés comme aide-mémoire par l'officiant. Les canons sont souvent au nombre de trois. Celui du milieu, plus grand que les deux autres, peut être pliant.
status: 1
broad match: cb11936841q

meuble de fabrique, de congrégation ou de confrérie catholique
type: Concept
modified: 2014-12-01T15:10:20+01:00
in scheme: Thésaurus de la désignation des objets mobiliers
preferred label: mobilia per la confraternita e la fabbriceria @it
preferred label: furniture and furnishings for parish, congregation and confraternity @en-us
preferred label: mobiliário de confraria e de fábrica @pt
narrower: armoire de confrérie, de congrégation ou de fabrique
narrower: table de confrérie, de congrégation ou de fabrique
narrower: coffre de confrérie, de congrégation ou de fabrique
narrower: siège de confrérie, de congrégation ou de fabrique
narrower: tableau de confrérie, de congrégation ou de fabrique
broader: meuble du culte catholique
alternative label: meuble de confrérie
alternative label: meuble de fabrique
alternative label: meuble de congrégation
created: 2012-05-16T00:00:00+02:00
definition: Mobilier destiné à l’usage d’une confrérie, d’une congrégation ou d’une fabrique.
status: 1

armoire de confrérie, de congrégation ou de fabrique
type: Concept
modified: 2014-12-01T15:14:01+01:00
in scheme: Thésaurus de la désignation des objets mobiliers
preferred label: armadio di confraternita e fabbriceria @it
preferred label: confraternity, congregation or parish cupboards @en-us
preferred label: armário de confraria e da fábrica @pt
broader: meuble de fabrique, de congrégation ou de confrérie catholique
alternative label: armoire de congrégation
alternative label: armoire de confrérie
alternative label: armoire de fabrique
created: 2012-05-16T00:00:00+02:00
related: armoire à archives
related: classeur à archives
related: armoire coffre-fort
definition: Armoire servant à conserver les biens d'une confrérie, d'une congrégation ou d'une fabrique. Elle se caractérise par la présence de deux ou trois serrures différentes dont les clés sont détenues par des membres distincts. Une inscription ou une iconographie en indique parfois l'appartenance.
TermeAssocie: armoire à archives
TermeAssocie: classeur à archives
TermeAssocie: armoire coffre-fort
status: 1

table de confrérie, de congrégation ou de fabrique
type: Concept
modified: 2014-12-01T15:27:35+01:00
in scheme: Thésaurus de la désignation des objets mobiliers
preferred label: tavolo di confraternita e fabbriceria @it
preferred label: confraternity, congregation or parish tables @en-us
preferred label: mesa de confraria e da fábrica @pt
broader: meuble de fabrique, de congrégation ou de confrérie catholique
alternative label: table de fabrique
alternative label: table de confrérie
alternative label: table de congrégation
created: 2012-05-16T00:00:00+02:00
definition: Table comportant une partie fermée par deux ou trois serrures et servant à conserver les biens d'une confrérie, d'une congrégation ou d'une fabrique. Une inscription ou une iconographie particulière en indique souvent l'appartenance.
status: 1

meuble de confrérie
type: SimpleNonPreferredTerm
modified: 2014-12-01T15:10:20+01:00
created: 2014-01-15T14:54:24+01:00
status: 1

coffre de confrérie, de congrégation ou de fabrique
type: Concept
modified: 2014-12-01T15:18:03+01:00
in scheme: Thésaurus de la désignation des objets mobiliers
preferred label: cassone di confraternita e fabbriceria @it
preferred label: confraternity, congregation or parish chests @en-us
preferred label: cofre de confraria e da fábrica @pt
broader: meuble de fabrique, de congrégation ou de confrérie catholique
alternative label: coffre de congrégation
alternative label: coffre de fabrique
alternative label: coffre de confrérie
created: 2012-05-16T00:00:00+02:00
related: coffre de communauté laïque
definition: Coffre servant à conserver les biens d'une confrérie, d'une congrégation ou d'une fabrique. Il possède en général au moins deux serrures. Une inscription ou une iconographie en indique parfois l'appartenance.
TermeAssocie: coffre de communauté laïque
status: 1

meuble de congrégation
type: SimpleNonPreferredTerm
modified: 2014-12-01T15:10:20+01:00
created: 2014-01-15T14:54:24+01:00
status: 1

meuble de fabrique, de congrégation ou de confrérie catholique
type: PreferredTerm
modified: 2014-12-01T15:10:20+01:00
created: 2014-01-15T14:54:24+01:00
status: 1

siège de confrérie, de congrégation ou de fabrique
type: Concept
modified: 2014-12-01T15:22:37+01:00
in scheme: Thésaurus de la désignation des objets mobiliers
preferred label: sedile di confraternita e fabbriceria @it
preferred label: confraternity, congregation or parish pews @en-us
preferred label: assento de confraria e da fábrica @pt
broader: meuble de fabrique, de congrégation ou de confrérie catholique
alternative label: siège de confrérie
alternative label: stalles de confrérie
alternative label: banc de confrérie
alternative label: banquette de confrérie
created: 2012-05-16T00:00:00+02:00
definition: Siège à plusieurs places réservé à une confrérie, une congrégation ou une fabrique et généralement placé dans la partie haute de la nef ou dans le chœur. Une inscription ou un élément iconographique peut en indiquer la destination.
status: 1

meuble du culte catholique
type: Concept
modified: 2014-10-14T13:07:16+02:00
in scheme: Thésaurus de la désignation des objets mobiliers
preferred label: furniture of the Roman catholic faith @en-us
preferred label: arredi della chiesa cattolica @it
narrower: meuble de fabrique, de congrégation ou de confrérie catholique
narrower: meuble lié à la procession et à la dévotion
narrower: siège et agenouilloir d'église du culte catholique
narrower: meuble luminaire d'église
narrower: meuble de rangement pour objets, linges et vêtements du culte
narrower: autel et son environnement
narrower: clôture et séparation interne d'une église
narrower: meuble lié aux rites funéraires
narrower: meuble lié à l'Eucharistie
narrower: meuble lié à l'offrande
narrower: meuble lié aux sacrements autres que l'Eucharistie
narrower: meuble lié à l'ablution, à l'aspersion et à l'encensement
narrower: T69-717
broader: meuble religieux
created: 2012-05-16T00:00:00+02:00
definition: Mobilier lié à l’exercice de la liturgie catholique ou servant au rangement des objets nécessaires à cette liturgie.
status: 1

meuble de fabrique
type: SimpleNonPreferredTerm
modified: 2014-12-01T15:10:20+01:00
created: 2014-01-15T14:54:24+01:00
status: 1

tableau de confrérie, de congrégation ou de fabrique
type: Concept
modified: 2014-12-01T15:25:58+01:00
in scheme: Thésaurus de la désignation des objets mobiliers
preferred label: tabella di confraternita e fabbriceria @it
preferred label: confraternity, congregation or parish boards @en-us
preferred label: quadro de confraria e da fábrica @pt
broader: meuble de fabrique, de congrégation ou de confrérie catholique
alternative label: panneau de congrégation
alternative label: panneau de confrérie
alternative label: tableau de fabrique
alternative label: panneau de fabrique
alternative label: tableau de congrégation
created: 2012-05-16T00:00:00+02:00
definition: .Grand panneau de bois, de carton ou de parchemin, généralement apposé sur un mur de sacristie. Il indique les noms des membres d'une confrérie, d'une fabrique ou d'une congrégation, leurs charges respectives et éventuellement les principales fêtes de l'année auxquelles la confrérie ou la congrégation est tenue de participer. Lorsqu'il est en bois, le panneau peut comporter des fentes permettant d'y insérer des plaquettes sur lesquelles sont inscrites ces informations. Une inscription ou une iconographie indique en outre le nom de la confrérie ou de la congrégation, ainsi que celui du saint qu'elle honore.
status: 1

meuble de naturaliste
type: Concept
modified: 2014-10-13T11:30:51+02:00
in scheme: Thésaurus de la désignation des objets mobiliers
broader: meuble de collection spécifique
created: 2012-05-16T00:00:00+02:00
definition: Meuble constitué de nombreux tiroirs à dessus vitré permettant d'exposer de façon protégée des collections d'insectes.
status: 1
broad match: http://vocab.getty.edu/aat/300379868
broad match: Meuble

meuble de collection spécifique
type: Concept
modified: 2014-10-13T11:28:05+02:00
in scheme: Thésaurus de la désignation des objets mobiliers
preferred label: display cabinets @en-us
narrower: meuble de naturaliste
narrower: meuble minéralogique
narrower: coquillier (meuble)
narrower: médaillier
narrower: serre-bijoux
broader: meuble de rangement et d'exposition
created: 2012-05-16T00:00:00+02:00
definition: Meuble destiné au rangement des objets d’une collection ou d’objets de même type.
status: 1
broad match: Meuble

meuble de naturaliste
type: PreferredTerm
modified: 2014-10-13T11:30:51+02:00
created: 2014-01-15T14:54:24+01:00
status: 1

pièce murale
type: Concept
modified: 2014-12-12T11:17:56+01:00
in scheme: Thésaurus de la désignation des objets mobiliers
preferred label: tapestries @en-us
narrower: entrefenêtre
broader: tenture murale
alternative label: tapisserie
created: 2012-05-16T00:00:00+02:00
definition: Ouvrage, généralement de tapisserie, constituant une œuvre en elle-même, mais pouvant également appartenir à un ensemble conçu et exécuté pour former une œuvre unique, la tenture murale (de tapisserie).
status: 1

entrefenêtre
type: Concept
modified: 2014-12-12T11:19:36+01:00
in scheme: Thésaurus de la désignation des objets mobiliers
preferred label: entrefenêtres @en-us
broader: pièce murale
created: 2012-05-16T00:00:00+02:00
definition: Pièce murale de tapisserie destinée, par ses dimensions en général étroites, à être placée entre deux fenêtres.
status: 1
broad match: http://data.bnf.fr/ark:/12148/cb119336376
broad match: Tapisserie

tenture murale
type: Concept
modified: 2014-12-12T11:13:47+01:00
in scheme: Thésaurus de la désignation des objets mobiliers
preferred label: wall hangings @en-us
narrower: pièce murale
broader: garniture architecturale
created: 2012-05-16T00:00:00+02:00
definition: Ensemble de pièces murales, généralement de tapisserie, illustrant différents aspects d'un thème ou les épisodes d'un cycle, et souvent tissées par le même atelier. Ces ensembles servent à parer ou à cacher les murs et sont destinés à être transportés de demeure en demeure.
status: 1

tapisserie
type: SimpleNonPreferredTerm
modified: 2014-12-12T11:17:56+01:00
created: 2014-01-15T14:54:24+01:00
status: 1

pièce murale
type: PreferredTerm
modified: 2014-12-12T11:17:56+01:00
created: 2014-01-15T14:54:24+01:00
status: 1

porte-parapluies
type: Concept
modified: 2014-12-04T16:57:32+01:00
in scheme: Thésaurus de la désignation des objets mobiliers
preferred label: umbrella stands @en-us
broader: meuble-support
created: 2012-05-16T00:00:00+02:00
definition: Meuble au sol, de milieu ou d'applique, comportant au moins un fond étanche servant à recevoir les parapluies verticalement.
status: 1

porte-parapluies
type: PreferredTerm
modified: 2014-12-04T16:57:32+01:00
created: 2014-01-15T14:54:24+01:00
status: 1

objet lié à la procession
type: Concept
modified: 2014-11-27T16:07:58+01:00
in scheme: Thésaurus de la désignation des objets mobiliers
preferred label: processional objects @en-us
preferred label: oggetti processionali @it
preferred label: objectos relacionados com as procissões @pt
narrower: bannière de procession
narrower: croix de confrérie
narrower: croix de procession
narrower: croix de la Passion
narrower: porte-cierge de procession
narrower: statue de procession
narrower: groupe sculpté de procession
narrower: ombellino de procession
narrower: T69-1580
narrower: T69-1582
narrower: T69-1567
narrower: T69-1565
narrower: T69-1588
narrower: T69-4831
narrower: T69-1584
narrower: T69-1560
narrower: T69-1576
narrower: T69-1574
narrower: T69-1578
broader: objet du culte catholique
created: 2012-05-16T00:00:00+02:00
related: linge ou garniture liés à la procession
related: clochette
definition: Objet utilisé ou porté lors d’une procession par les membres d’une confrérie religieuse, d’une congrégation ou d’une paroisse.
TermeAssocie: linge ou garniture liés à la procession
TermeAssocie: clochette
status: 1

insigne ecclésiastique
type: Concept
modified: 2014-11-26T12:37:59+01:00
in scheme: Thésaurus de la désignation des objets mobiliers
preferred label: insegne ecclesiastiche @it
preferred label: ecclesiastical insignias @en-us
preferred label: insígnias eclesiásticas @pt
narrower: armoiries d'évêque
narrower: matrice de sceau ecclésiastique
narrower: sceau ecclésiastique
narrower: éventail liturgique
narrower: croix pectorale
narrower: anneau pastoral
narrower: bâton de chantre
narrower: plateau de présentation
narrower: bâton pastoral
broader: objet du culte catholique
created: 2012-05-16T00:00:00+02:00
definition: Attribut presque toujours réservé à un haut dignitaire ecclésiastique, souvent personnalisé de ses marques ou armoiries, qu’il utilise lors des célébrations religieuses.
status: 1

objet du culte catholique
type: PreferredTerm
modified: 2014-11-26T12:19:42+01:00
created: 2014-01-15T14:54:24+01:00
status: 1

objet lié à l'offrande et à la quête
type: Concept
modified: 2014-11-27T15:49:06+01:00
in scheme: Thésaurus de la désignation des objets mobiliers
preferred label: oggetti per l'offerta e la questa @it
preferred label: objects for offering and collection @en-us
preferred label: objectos relacionados com a colecta do ofertório @pt
narrower: plat de quête
narrower: vase à quêter
narrower: tronc à quêter
narrower: T69-1400
broader: objet du culte catholique
created: 2012-05-16T00:00:00+02:00
definition: Objet, le plus souvent en forme de récipient, destiné à la collecte des dons.
status: 1
broad match: http://vocab.getty.edu/aat/300215552

boîte et coffret pour le rangement des objets liturgiques
type: Concept
modified: 2014-11-26T12:21:58+01:00
in scheme: Thésaurus de la désignation des objets mobiliers
preferred label: boxes and cases for storing liturgical objects @en-us
preferred label: custodie per oggetti ecclesiastici @it
preferred label: caixas e estojos de objectos religiosos @pt
narrower: boîte d'ostensoir
narrower: boîte de calice
narrower: boîte de ciboire
narrower: boîte de chapelle de messe
narrower: boîte de patène
narrower: coffret pour les réserves aux saintes huiles
narrower: boîte de croix
narrower: coffret pour le viatique
narrower: boîte de reliquaire
narrower: T69-1476
narrower: T69-1515
narrower: T69-1511
broader: objet du culte catholique
created: 2012-05-16T00:00:00+02:00
definition: Récipient muni d’un couvercle destiné à abriter un objet liturgique précieux lorsqu’il n’est pas utilisé. Il comprend généralement un compartiment intérieur épousant strictement la forme de cet objet afin de mieux le protéger.
status: 1

objet lié au pèlerinage
type: Concept
modified: 2014-11-28T13:04:06+01:00
in scheme: Thésaurus de la désignation des objets mobiliers
preferred label: oggetti di pellegrinaggio @it
preferred label: pilgrimage objects @en-us
preferred label: objectos de peregrinação @pt
narrower: T69-1768
narrower: T69-1784
narrower: T69-1775
narrower: T69-1772
broader: objet du culte catholique
alternative label: insigne de pèlerinage
created: 2012-05-16T00:00:00+02:00
definition: Objet, récipient, instrument à l’usage du pèlerin et l’accompagnant tout au long de son pèlerinage. Il peut être décoré d’inscriptions, de symboles ou de scènes religieuses.
status: 1

objet lié à l'Eucharistie
type: Concept
modified: 2014-11-27T13:40:45+01:00
in scheme: Thésaurus de la désignation des objets mobiliers
preferred label: objects for the Eucharist @en-us
preferred label: oggetti per l'Eucaristia @it
preferred label: objectos relacionados com a eucaristia @pt
narrower: ostensoir
narrower: calice
narrower: patène
narrower: plateau de communion
narrower: cierge de communion
narrower: ciboire
narrower: thabor
narrower: astérisque
narrower: clef de tabernacle
narrower: colombe eucharistique
narrower: couloire
narrower: couteau eucharistique
narrower: porte-lunule
narrower: porte-burettes
narrower: T69-1272
narrower: T69-1178
narrower: T69-1255
narrower: T69-1180
narrower: T69-1189
narrower: T69-1251
narrower: T69-1182
narrower: T69-1241
narrower: T69-1283
narrower: T69-1185
narrower: T69-1253
narrower: T69-1206
narrower: T69-1248
narrower: T69-1259
broader: objet du culte catholique
created: 2012-05-16T00:00:00+02:00
definition: Objet, instrument ou vase sacré principalement à l’usage de l’officiant, lié à la préparation et à l’administration du sacrement de l’Eucharistie (sacrement contenant le corps, le sang et la divinité du Christ au terme de la transsubstantiation du pain et du vin).
status: 1
broad match: http://vocab.getty.edu/aat/300234147

objet funéraire
type: Concept
modified: 2014-11-27T10:43:31+01:00
in scheme: Thésaurus de la désignation des objets mobiliers
preferred label: funerary objects @en-us
preferred label: oggetti funerari @it
preferred label: objectos funerários @pt
narrower: croix mortuaire
narrower: couronne mortuaire
narrower: croix funéraire de vêtement
narrower: patène funéraire
narrower: cire de deuil
narrower: calice funéraire
narrower: lacrymatoire
narrower: diptyque commémoratif
narrower: cierge funéraire
narrower: boîte à crâne
broader: objet du culte catholique
alternative label: fond de coupe
alternative label: fond d'or
created: 2012-05-16T00:00:00+02:00
related: meuble lié aux rites funéraires
related: monument funéraire
definition: Objet, vase sacré, instrument ou récipient utilisé dans le cadre des rites funéraires.
TermeAssocie: meuble lié aux rites funéraires
TermeAssocie: monument funéraire
status: 1
broad match: http://vocab.getty.edu/aat/300234126

objet lié à l'ablution, à l'aspersion et à l'encensement
type: Concept
modified: 2014-11-27T11:09:08+01:00
in scheme: Thésaurus de la désignation des objets mobiliers
preferred label: ogetti per l'abluzione, l'aspersione e l'incensazione @it
preferred label: objects for ablution, aspersion and censing @en-us
preferred label: objectos relacionados com a ablução, a aspersão e o incenso @pt
narrower: navette à encens
narrower: seau à eau bénite
narrower: encensoir
narrower: goupillon
narrower: réchaud à charbon liturgique
narrower: cuiller à encens
narrower: gémellions
narrower: bassin à ablutions
narrower: mortier à encens
narrower: T69-1397
narrower: T69-1360
narrower: T69-1366
broader: objet du culte catholique
created: 2012-05-16T00:00:00+02:00
related: bassin de table
related: bassin pour le lavement des pieds
related: aiguière pour le lavement des pieds
definition: Objet, instrument ou vase servant lors de la préparation ou pour la pratique des rites de l’ablution, de l’aspersion et de l’encensement.
TermeAssocie: bassin de table
TermeAssocie: bassin pour le lavement des pieds
TermeAssocie: aiguière pour le lavement des pieds
status: 1
narrow match: http://vocab.getty.edu/aat/300391284

objet lié aux temps de Noël et de Carême
type: Concept
modified: 2014-12-01T11:08:35+01:00
in scheme: Thésaurus de la désignation des objets mobiliers
preferred label: oggeti per il Natale e la Quaresima @it
preferred label: objects for Christmas and Lent @en-us
preferred label: objectos relacionados com o Natal e a Quaresma @pt
narrower: arundo
narrower: crèche de Noël
narrower: cierge pascal
narrower: bassin pour le lavement des pieds
narrower: récipient pour les cendres
narrower: croix du Vendredi saint
narrower: aiguière pour le lavement des pieds
narrower: style liturgique
broader: objet du culte catholique
created: 2012-05-16T00:00:00+02:00
definition: Objet, instrument ou récipient utilisé lors des temps de Noël ou de Carême.
status: 1

objet pour l'éclairage
type: Concept
modified: 2014-12-01T11:25:07+01:00
in scheme: Thésaurus de la désignation des objets mobiliers
preferred label: oggetti per l'illuminazione @it
preferred label: objects for lighting @en-us
preferred label: objectos relacionados com a iluminação @pt
narrower: cierge
narrower: lampe d'église
narrower: chandelier d'église
narrower: bougeoir d'église
narrower: bougeoir pontifical
broader: objet du culte catholique
alternative label: allumoir-éteignoir d'église
created: 2012-05-16T00:00:00+02:00
definition: Source de lumière ou son support destiné à l’éclairage dans une église. Il peut comporter des inscriptions, des symboles ou des scènes religieuses.
status: 1

objet lié à la consécration des églises, des autels et de la Porte sainte
type: Concept
modified: 2014-11-27T16:00:34+01:00
in scheme: Thésaurus de la désignation des objets mobiliers
preferred label: oggetti per la consacrazione della chiesa, dell'altare e della Porta Santa @it
preferred label: objects for the consecration of a church, an altar and the Porta Santa @en-us
preferred label: objectos relacionados com a consagração das igrejas, dos altares e da Porta-Santa @pt
narrower: service de cérémonie de la Porte sainte
narrower: chandelier de consécration
narrower: service de consécration
narrower: brique de la Porte sainte
broader: objet du culte catholique
created: 2012-05-16T00:00:00+02:00
definition: Objet ou ensemble d’objets précieux et symboliques, utilisés par le pape ou les prélats de haut rang, pour consacrer les églises, les autels et la Porte sainte.
status: 1

aérophone
type: Concept
modified: 2014-10-10T11:26:19+02:00
in scheme: Thésaurus de la désignation des objets mobiliers
preferred label: aerophones @en-us
narrower: aérophone à anche
narrower: aérophone pouvant combiner plusieurs systèmes d'émission
narrower: aérophone à bouche
broader: instrument de musique
created: 2012-05-16T00:00:00+02:00
definition: Terme générique désignant des instruments qui produisent un son en utilisant la vibration de l'air. On parle d'aérophone à air ambiant lorsque l'air mis en vibration est celui situé autour de l'instrument (rhombe) ou d'aérophone à air contenu lorsque la colonne d'air est enfermée dans un conduit. Cette dernière catégorie se subdivise entre les instruments à bouche ou à anche. L'air peut être produit par le souffle d'un instrumentiste (flûte, trompette), d'une soufflerie mécanique (orgue, accordéon) ou d'une poche d'air (cornemuse, veuze).
status: 1

aérophone
type: PreferredTerm
modified: 2014-10-10T11:26:19+02:00
created: 2014-01-15T14:54:24+01:00
status: 1

aérophone à anche
type: Concept
modified: 2014-10-10T11:28:31+02:00
in scheme: Thésaurus de la désignation des objets mobiliers
preferred label: reeds (aerophones) @en-us
narrower: aérophone à anche vibrante double
narrower: aérophone à anche vibrante simple
narrower: T69-9891
narrower: T69-5093
broader: aérophone
created: 2013-12-19T00:00:00+01:00
definition: Instrument dont le son est produit par la mise en vibration d'une ou plusieurs anches libres ou battantes.
status: 1

instrument de musique
type: Concept
modified: 2014-10-10T11:18:29+02:00
in scheme: Thésaurus de la désignation des objets mobiliers
preferred label: musical instruments @en-us
narrower: aérophone
narrower: accessoire du musicien
narrower: membranophone
narrower: idiophone
narrower: instrument électroacoustique
narrower: T69-8076
narrower: T69-5167
narrower: T69-5014
created: 2012-05-16T00:00:00+02:00
definition: Objet pouvant produire un son contrôlé par un musicien.
status: 1

aérophone pouvant combiner plusieurs systèmes d'émission
type: Concept
modified: 2014-10-10T12:22:08+02:00
in scheme: Thésaurus de la désignation des objets mobiliers
narrower: orgue mécanique
narrower: T69-5168
narrower: T69-8643
broader: aérophone
created: 2013-12-19T00:00:00+01:00
definition: Instrument à vent et à clavier pouvant combiner des tuyaux à bouche et des tuyaux à anches.
status: 1
broad match: cb11960149q
broad match: http://vocab.getty.edu/aat/300041622
broad match: Instrument à vent

aérophone à bouche
type: Concept
modified: 2014-10-10T11:48:40+02:00
in scheme: Thésaurus de la désignation des objets mobiliers
preferred label: lip-vibrated aerophones @en-us
narrower: flûte à biseau
narrower: trompette chromatique
narrower: trompette naturelle
broader: aérophone
created: 2013-12-19T00:00:00+01:00
definition: Instrument dont le son est produit par la mise en vibration du corps sonore par un flux d'air.
status: 1
broad match: Instrument à vent

ancre
type: PreferredTerm
modified: 2014-12-19T16:17:06+01:00
created: 2014-01-15T14:54:24+01:00
status: 1

table à dessin
type: Concept
modified: 2014-12-05T13:58:21+01:00
in scheme: Thésaurus de la désignation des objets mobiliers
preferred label: drawing tables (artists' tables) @en-us
broader: table pour le bureau ou les loisirs
alternative label: table de dessin
alternative label: table de peinture
created: 2012-05-16T00:00:00+02:00
definition: Table servant à dessiner dont le plateau est réglable en hauteur et/ou inclinable ou table dont le dessus est garni de tissu ou de cuir et dont le tiroir comporte des cases à crayons et compas (et non pas à encrier et éponge comme la table à écrire).
status: 1

table de peinture
type: SimpleNonPreferredTerm
modified: 2014-12-05T13:58:21+01:00
created: 2014-01-15T14:54:24+01:00
status: 1

table pour le bureau ou les loisirs
type: Concept
modified: 2014-10-14T12:51:38+02:00
in scheme: Thésaurus de la désignation des objets mobiliers
narrower: table à dessin
narrower: bureau
narrower: bonheur du jour
narrower: table de bibliothèque
narrower: table à écrire
narrower: table à jeu
narrower: T69-2785
narrower: T69-2812
broader: table
alternative label: table de télévision
alternative label: tablette à écrire
alternative label: table de téléphone
alternative label: table de fumeur
alternative label: table d'ordinateur
created: 2012-05-16T00:00:00+02:00
definition: Table adaptée aux fonctions de bureau ou à certains divertissements.
status: 1
broad match: http://vocab.getty.edu/aat/300039548

table de dessin
type: SimpleNonPreferredTerm
modified: 2014-12-05T13:58:21+01:00
created: 2014-01-15T14:54:24+01:00
status: 1

table à dessin
type: PreferredTerm
modified: 2014-12-05T13:58:21+01:00
created: 2014-01-15T14:54:24+01:00
status: 1

table de confrérie
type: SimpleNonPreferredTerm
modified: 2014-12-01T15:27:35+01:00
created: 2014-01-15T14:54:24+01:00
status: 1

table de congrégation
type: SimpleNonPreferredTerm
modified: 2014-12-01T15:27:35+01:00
created: 2014-01-15T14:54:24+01:00
status: 1

table de fabrique
type: SimpleNonPreferredTerm
modified: 2014-12-01T15:27:35+01:00
created: 2014-01-15T14:54:24+01:00
status: 1

table de confrérie, de congrégation ou de fabrique
type: PreferredTerm
modified: 2014-12-01T15:27:35+01:00
created: 2014-01-15T14:54:24+01:00
status: 1

tapis de sol
type: Concept
modified: 2014-12-12T11:12:43+01:00
in scheme: Thésaurus de la désignation des objets mobiliers
preferred label: rugs (textiles) @en-us
broader: garniture architecturale
created: 2012-05-16T00:00:00+02:00
definition: Ouvrage le plus souvent textile (tissé, noué ou brodé) destiné à recouvrir le sol pour l'orner ou l'isoler.
status: 1

tapis de sol
type: PreferredTerm
modified: 2014-12-12T11:12:43+01:00
created: 2014-01-15T14:54:24+01:00
status: 1

porte-instruments de procession
type: Concept
modified: 2014-12-02T10:19:33+01:00
in scheme: Thésaurus de la désignation des objets mobiliers
preferred label: processional equipment stands @en-us
preferred label: supporto per oggetti processionali @it
preferred label: suporte de objectos processionais @pt
broader: meuble lié à la procession et à la dévotion
alternative label: porte-croix funéraire
created: 2012-05-16T00:00:00+02:00
definition: Support destiné à maintenir en position verticale un ou plusieurs instruments de procession portés par une hampe. Il se présente comme un râtelier percé de trous ou comme un piédestal creux. Durant les cérémonies funéraires, un porte-instruments aux couleurs funéraires peut être posé devant le cercueil pour supporter une croix de procession.
status: 1
broad match: cb11949807g
broad match: http://vocab.getty.edu/aat/300039767

meuble lié à la procession et à la dévotion
type: Concept
modified: 2014-12-02T10:06:52+01:00
in scheme: Thésaurus de la désignation des objets mobiliers
preferred label: furniture, furnishings and monuments for processions and devotion @en-us
preferred label: arredi e monumenti per la processione e la devozione @it
preferred label: móveis relacionados com as procissões e a devoção @pt
narrower: porte-instruments de procession
narrower: porte-cierges votif
narrower: reposoir
narrower: porte-reliquaire de procession
narrower: dais de procession
narrower: clochette de basilique
narrower: brancard de procession
narrower: ombellino de basilique
broader: meuble du culte catholique
created: 2012-05-16T00:00:00+02:00
definition: Mobilier ou support destiné à protéger, présenter, transporter les objets utilisés notamment lors des processions.
status: 1

porte-croix funéraire
type: SimpleNonPreferredTerm
modified: 2014-12-02T10:19:33+01:00
created: 2014-01-15T14:54:24+01:00
status: 1

porte-instruments de procession
type: PreferredTerm
modified: 2014-12-02T10:19:33+01:00
created: 2014-01-15T14:54:24+01:00
status: 1

pot à lait
type: Concept
modified: 2014-12-08T16:10:29+01:00
in scheme: Thésaurus de la désignation des objets mobiliers
preferred label: milk jugs @en-us
broader: récipient pour le service et la consommation des boissons
alternative label: crémier
alternative label: pot à lait de déjeuner
created: 2012-05-16T00:00:00+02:00
definition: Petit broc en métal, porcelaine ou faïence fine, pour le service du lait ou de la crème de lait que l'on mélange au café, au thé ou au chocolat. A fond plat ou sur pied(s) bas, il est muni d'une anse latérale ou d'un manche. Ce pot fait souvent partie d'un service ou d'un déjeuner.
status: 1

crémier
type: SimpleNonPreferredTerm
modified: 2014-12-08T16:10:29+01:00
created: 2014-01-15T14:54:24+01:00
status: 1

pot à lait de déjeuner
type: SimpleNonPreferredTerm
modified: 2014-12-08T16:10:29+01:00
created: 2014-01-15T14:54:24+01:00
status: 1

pot à lait
type: PreferredTerm
modified: 2014-12-08T16:10:29+01:00
created: 2014-01-15T14:54:24+01:00
status: 1

tableau de broderie
type: Concept
modified: 2014-12-03T16:36:49+01:00
in scheme: Thésaurus de la désignation des objets mobiliers
broader: tableau
alternative label: tableau-canevas
created: 2012-05-16T00:00:00+02:00
related: canevas
related: pièce de broderie
definition: Œuvre constituée d'une pièce de tissu brodée, destinée à reproduire, dans le matériau et avec la technique qui lui sont propres, les effets du tableau de peinture.
TermeAssocie: canevas
TermeAssocie: pièce de broderie
status: 1

canevas
type: Concept
modified: 2014-12-12T10:56:51+01:00
in scheme: Thésaurus de la désignation des objets mobiliers
preferred label: canvas @en-us
broader: élément textile ou de garniture
created: 2012-05-16T00:00:00+02:00
related: tableau de broderie
definition: Toile écrue en coton, en lin ou en chanvre, très claire et divisée en petits carreaux qui sert à réaliser la tapisserie à l'aiguille. Ne pas confondre avec la broderie à l'aiguille sur canevas.
TermeAssocie: tableau de broderie
status: 1

pièce de broderie
type: Concept
modified: 2014-12-12T10:58:27+01:00
in scheme: Thésaurus de la désignation des objets mobiliers
preferred label: embroidery (visual works) @en-us
broader: élément textile ou de garniture
alternative label: morceau de broderie
created: 2012-05-16T00:00:00+02:00
related: tableau de broderie
related: tableau de tapisserie
definition: Pièce de tissu brodé dont la mise en œuvre est inconnue ou incompréhensible.
TermeAssocie: tableau de broderie
TermeAssocie: tableau de tapisserie
status: 1
broad match: http://data.bnf.fr/ark:/12148/cb119400073

tableau de broderie
type: PreferredTerm
modified: 2014-12-03T16:36:49+01:00
created: 2014-01-15T14:54:24+01:00
status: 1

tableau
type: Concept
modified: 2014-12-03T16:32:15+01:00
in scheme: Thésaurus de la désignation des objets mobiliers
preferred label: easel paintings @en-us
narrower: tableau de broderie
narrower: tableau tissé
narrower: tableau de tapisserie
narrower: miniature
broader: peinture
alternative label: tableau de chevalet
created: 2012-05-16T00:00:00+02:00
scope note: Pour la forme, on peut préciser, dans le champ PDEN s'il s'agit d'un diptyque, d'un triptyque ou d'un polyptyque.
related: polyptyque
related: tableautin d'autel
related: retable
related: retable des fonts baptismaux
definition: Peinture mobile généralement pourvue d'un cadre.
TermeAssocie: polyptyque
TermeAssocie: tableautin d'autel
TermeAssocie: retable
TermeAssocie: retable des fonts baptismaux
status: 1
broad match: http://data.bnf.fr/ark:/12148/cb11932942c

tableau-canevas
type: SimpleNonPreferredTerm
modified: 2014-12-03T16:36:49+01:00
created: 2014-01-15T14:54:24+01:00
status: 1

cartel
type: Concept
modified: 2014-12-10T14:09:16+01:00
in scheme: Thésaurus de la désignation des objets mobiliers
preferred label: cartel clocks @en-us
broader: horloge
created: 2012-05-16T00:00:00+02:00
definition: Horloge d'applique suspendue (sans socle) dont tous les éléments sont inclus dans une boîte.
status: 1

horloge
type: Concept
modified: 2014-12-10T14:07:14+01:00
in scheme: Thésaurus de la désignation des objets mobiliers
narrower: cartel
narrower: meuble à horloge
narrower: pendule
narrower: montre
broader: objet ou matériel d'indication du temps
alternative label: réveil-matin
created: 2012-05-16T00:00:00+02:00
related: instrument de mesure du temps
related: horloge publique
definition: Objet servant à indiquer les heures légales et très généralement les minutes, parfois les secondes (trotteuse). On parle d’horloge complexe lorsque l’objet permet également de connaître les jours de la semaine, les mois, les années, les équivalences horaires dans les diverses parties du monde, etc.
TermeAssocie: instrument de mesure du temps
TermeAssocie: horloge publique
status: 1

cartel
type: PreferredTerm
modified: 2014-12-10T14:09:16+01:00
created: 2014-01-15T14:54:24+01:00
status: 1

vase décoratif de jardin
type: Concept
modified: 2015-02-24T10:58:30+01:00
in scheme: Thésaurus de la désignation des objets mobiliers
broader: édicule et mobilier de jardin
created: 2012-06-11T00:00:00+02:00
definition: Vase décoratif comportant en général des parties sculptées et souvent posé sur un socle ou sur un piédestal et associé à une architecture de jardin. Il peut également servir de réceptacle à des plantes fleuries.
status: 1

vase décoratif de jardin
type: PreferredTerm
modified: 2015-02-24T10:58:30+01:00
created: 2014-01-15T14:54:24+01:00
status: 1

porte-pain
type: Concept
modified: 2014-12-04T16:47:46+01:00
in scheme: Thésaurus de la désignation des objets mobiliers
broader: étagère
alternative label: échelle porte-pain
created: 2012-05-16T00:00:00+02:00
definition: Support servant à conserver le pain en boule ou en couronne, fabriqué domestiquement. Il se présente sous forme de planche ou d’échelle porte-pain.
status: 1
broad match: http://vocab.getty.edu/aat/300079641

porte-pain
type: PreferredTerm
modified: 2014-12-04T16:47:46+01:00
created: 2014-01-15T14:54:24+01:00
status: 1

échelle porte-pain
type: SimpleNonPreferredTerm
modified: 2014-12-04T16:47:46+01:00
created: 2014-01-15T14:54:24+01:00
status: 1

étagère
type: Concept
modified: 2014-12-04T16:51:04+01:00
in scheme: Thésaurus de la désignation des objets mobiliers
preferred label: shelves @en-us
narrower: porte-pain
narrower: vaisselier
narrower: porte-fromages
narrower: fruitier
narrower: étagère porte-récipients
narrower: étagère-bibliothèque
narrower: étagère dressoir
narrower: étagère verrier
narrower: étagère à épices
narrower: bibliothèque en table
broader: meuble de rangement et d'exposition
alternative label: étagère à musique
created: 2012-05-16T00:00:00+02:00
definition: Meuble de rangement ou d'exposition pour objets spécifiques ou divers, constitué par un corps ouvert, à tablettes superposées. Ce meuble est d'applique, au sol ou suspendu, éventuellement en encoignure, ou posé sur un autre meuble.
status: 1
broad match: cb13562642r

chasse neige ferroviaire
type: Concept
modified: 2014-12-18T11:07:34+01:00
in scheme: Thésaurus de la désignation des objets mobiliers
preferred label: snowplows @en-us
broader: véhicule ferroviaire spécialisé
created: 2013-11-04T00:00:00+01:00
definition: Véhicule équipé d'un système, soc, lame ou turbine, permettant de repousser la neige hors de la voie ferrée.
status: 1

véhicule ferroviaire spécialisé
type: Concept
modified: 2014-12-18T11:32:44+01:00
in scheme: Thésaurus de la désignation des objets mobiliers
narrower: chasse neige ferroviaire
narrower: draisine à bras
narrower: T69-9942
narrower: T69-8844
narrower: T69-8843
narrower: T69-8842
narrower: T69-8841
narrower: T69-8840
broader: matériel ferroviaire roulant
alternative label: véhicule ferroviaire de secours
alternative label: véhicule ferroviaire d'inspection
alternative label: train de travaux
created: 2013-11-04T00:00:00+01:00
definition: Véhicule de chemin de fer à fonction technique déterminée.
status: 1
broad match: cb11938431s
broad match: Matériel roulant ferroviaire

chasse neige ferroviaire
type: PreferredTerm
modified: 2014-12-18T11:07:34+01:00
created: 2014-01-15T14:54:24+01:00
status: 1

pincettes
type: Concept
modified: 2014-12-05T14:45:40+01:00
in scheme: Thésaurus de la désignation des objets mobiliers
preferred label: fire tongs @en-us
broader: objet d'âtre
alternative label: pinces à braises
alternative label: pinces à feu
alternative label: tenailles à feu
created: 2012-05-16T00:00:00+02:00
definition: Pince à ressort en métal, parfois à charnière, permettant de saisir les bûches et les braises. Elles sont assorties à la pelle d'âtre et au tisonnier.
status: 1
broad match: Fire iron

pincettes
type: PreferredTerm
modified: 2014-12-05T14:45:40+01:00
created: 2014-01-15T14:54:24+01:00
status: 1

pinces à braises
type: SimpleNonPreferredTerm
modified: 2014-12-05T14:45:40+01:00
created: 2014-01-15T14:54:24+01:00
status: 1

objet d'âtre
type: Concept
modified: 2014-10-16T13:58:37+02:00
in scheme: Thésaurus de la désignation des objets mobiliers
preferred label: fire-making and controlling equipment @en-us
narrower: pincettes
narrower: plaque de cheminée
narrower: pelle d'âtre
narrower: fourche d'âtre
narrower: écran à main
narrower: repousse-braises
narrower: porte-instruments d'âtre
narrower: T69-4459
narrower: T69-4455
narrower: T69-4484
narrower: T69-4482
narrower: T69-4486
broader: objet civil domestique
alternative label: couvre-feu
alternative label: étouffoir à braises
alternative label: casserole à braises
alternative label: seau à charbon
alternative label: crible-cendres
alternative label: cloche à braises
alternative label: berceau à bûches
alternative label: chevrette d'âtre
alternative label: porte-braises
created: 2012-05-16T00:00:00+02:00
definition: Instrument ou dispositif lié à la cheminée et à l’entretien du feu.
status: 1

tenailles à feu
type: SimpleNonPreferredTerm
modified: 2014-12-05T14:45:40+01:00
created: 2014-01-15T14:54:24+01:00
status: 1

pinces à feu
type: SimpleNonPreferredTerm
modified: 2014-12-05T14:45:40+01:00
created: 2014-01-15T14:54:24+01:00
status: 1

trône papal
type: Concept
modified: 2014-12-02T15:26:57+01:00
in scheme: Thésaurus de la désignation des objets mobiliers
preferred label: trono papale @it
preferred label: papal thrones @en-us
preferred label: trono papal @pt
broader: trône pontifical
alternative label: sedia gestatoria
created: 2012-05-16T00:00:00+02:00
definition: Trône réservé au pape, portant ses emblèmes liturgiques, ses armoiries et parfois une iconographie liée à la prééminence de l'évêque de Rome. Parfois sur une estrade, il comporte souvent un dais.
status: 1

sedia gestatoria
type: SimpleNonPreferredTerm
modified: 2014-12-02T15:26:57+01:00
created: 2014-01-15T14:54:24+01:00
status: 1

trône pontifical
type: Concept
modified: 2014-12-02T15:22:10+01:00
in scheme: Thésaurus de la désignation des objets mobiliers
preferred label: cattedra pontificale @it
preferred label: pontifical thrones @en-us
preferred label: trono pontifical @pt
narrower: trône papal
narrower: trône épiscopal
narrower: trône abbatial
narrower: dais de trône pontifical
broader: siège et agenouilloir d'église du culte catholique
created: 2012-05-16T00:00:00+02:00
related: tenture de trône pontifical
related: tapis de trône pontifical
definition: Siège de chœur réservé aux dignitaires de l'Eglise. Accompagné souvent d'une tenture et d'un tapis, il est généralement surmonté d'un dais.
TermeAssocie: tenture de trône pontifical
TermeAssocie: tapis de trône pontifical
status: 1
broad match: http://vocab.getty.edu/aat/300038141

trône papal
type: PreferredTerm
modified: 2014-12-02T15:26:57+01:00
created: 2014-01-15T14:54:24+01:00
status: 1

croix d'autel orthodoxe
type: Concept
modified: 2014-01-10T00:00:00+01:00
in scheme: Thésaurus de la désignation des objets mobiliers
broader: objet du culte orthodoxe
created: 2012-05-16T00:00:00+02:00
definition: Croix destinée à être posée à plat sur l'autel et servant lors des bénédictions. De formes variées, mais comportant, si elle n'en a pas la forme, une représentation de la croix orthodoxe constituée d'un montant vertical et de trois traverses ; les deux traverses supérieures sont parallèles, horizontales et de longueurs inégales, la plus grande étant au centre ; la traverse inférieure est oblique, la branche la plus basse située à la gauche du Christ.
status: 1

croix d'autel orthodoxe
type: PreferredTerm
modified: 2014-01-10T00:00:00+01:00
created: 2014-01-15T14:54:24+01:00
status: 1

lambris de demi-revêtement
type: Concept
modified: 2015-01-16T12:40:32+01:00
in scheme: Thésaurus de la désignation des objets mobiliers
broader: lambris de revêtement
created: 2012-05-16T00:00:00+02:00
definition: Lambris de revêtement de hauteur intermédiaire entre le lambris d'appui et le lambris de hauteur.
status: 1
broad match: http://vocab.getty.edu/aat/300014658
broad match: cb12505322n

lambris de revêtement
type: Concept
modified: 2015-01-16T16:36:16+01:00
in scheme: Thésaurus de la désignation des objets mobiliers
preferred label: paneling @en-us
narrower: lambris de demi-revêtement
narrower: lambris d'appui
narrower: lambris de hauteur
broader: revêtement
created: 2012-05-16T00:00:00+02:00
related: lambris de couvrement
definition: Revêtement le plus souvent en bois couvrant les murs.
TermeAssocie: lambris de couvrement
status: 1

lambris de demi-revêtement
type: PreferredTerm
modified: 2015-01-16T12:40:32+01:00
created: 2014-01-15T14:54:24+01:00
status: 1

ravier
type: Concept
modified: 2014-12-08T16:59:19+01:00
in scheme: Thésaurus de la désignation des objets mobiliers
preferred label: pickle dishes @en-us
broader: récipient pour le service ou la consommation des aliments
alternative label: ménagère à ravier
alternative label: plat à hors-d'œuvres
created: 2012-05-16T00:00:00+02:00
definition: Petit récipient allongé, en métal, terre cuite ou verre, pour le service des hors-d’œuvre. Le ravier emprunte la forme d'un bateau. Il fait généralement partie d'une série, parfois disposée dans une monture.
status: 1

plat à hors-d'œuvres
type: SimpleNonPreferredTerm
modified: 2014-12-08T16:59:19+01:00
created: 2014-01-15T14:54:24+01:00
status: 1

ménagère à ravier
type: SimpleNonPreferredTerm
modified: 2014-12-08T16:59:19+01:00
created: 2014-01-15T14:54:24+01:00
status: 1

ravier
type: PreferredTerm
modified: 2014-12-08T16:59:19+01:00
created: 2014-01-15T14:54:24+01:00
status: 1

pique-plume
type: Concept
modified: 2014-12-10T15:20:15+01:00
in scheme: Thésaurus de la désignation des objets mobiliers
broader: objet pour écrire ou de bureau
alternative label: pique-plumes
created: 2012-05-16T00:00:00+02:00
definition: Support généralement en céramique, souvent figuratif, muni d'un ou plusieurs petits trous ou de goulots étroits pour y piquer une ou plusieurs plumes.
status: 1
broad match: Catégorie:Matériel d'écriture

pique-plumes
type: SimpleNonPreferredTerm
modified: 2014-12-10T15:20:15+01:00
created: 2014-01-15T14:54:24+01:00
status: 1

objet pour écrire ou de bureau
type: Concept
modified: 2014-10-17T12:21:22+02:00
in scheme: Thésaurus de la désignation des objets mobiliers
preferred label: writing equipment @en-us
narrower: pique-plume
narrower: accessoire d'écriture
narrower: cachet
narrower: plumier
narrower: marque-page
narrower: T69-4605
narrower: T69-4609
narrower: T69-4613
narrower: T69-4650
narrower: T69-4644
narrower: T69-4601
narrower: T69-4641
broader: objet civil domestique
alternative label: pèse-lettre
alternative label: sonnette de bureau
alternative label: coupe-papier
alternative label: loupe de bureau
alternative label: ciseaux de bureau
alternative label: étui à cire à cacheter
alternative label: perce-lettres
created: 2012-05-16T00:00:00+02:00
related: table à écrire
definition: Instrument ou accessoire lié aux activités de lecture, d’écriture, de correspondance.
TermeAssocie: table à écrire
status: 1

pique-plume
type: PreferredTerm
modified: 2014-12-10T15:20:15+01:00
created: 2014-01-15T14:54:24+01:00
status: 1

pilier central
type: Concept
modified: 2014-12-09T16:29:42+01:00
in scheme: Thésaurus de la désignation des objets mobiliers
broader: remplage
created: 2012-05-16T00:00:00+02:00
definition: Pilier portant la retombée des arcs des deux baies jumelées d'une porte ou soutenant en son milieu le linteau ou la plate-bande d'une porte à deux vantaux.
status: 1
broad match: http://vocab.getty.edu/aat/300003138
broad match: http://data.bnf.fr/ark:/12148/cb119552490
broad match: Remplage

pilier central
type: PreferredTerm
modified: 2014-12-09T16:29:42+01:00
created: 2014-01-15T14:54:24+01:00
status: 1

moteur à pistons à combustion
type: PreferredTerm
modified: 2015-08-10T11:58:31+02:00
created: 2014-01-15T14:54:24+01:00
status: 1

moteur Duvant
type: SimpleNonPreferredTerm
modified: 2015-08-10T11:58:31+02:00
created: 2014-01-15T14:54:24+01:00
status: 1

moteur à huile lourde
type: SimpleNonPreferredTerm
modified: 2015-08-10T11:58:31+02:00
created: 2014-01-15T14:54:24+01:00
status: 1

moteur Diesel
type: SimpleNonPreferredTerm
modified: 2015-08-10T11:58:31+02:00
created: 2014-01-15T14:54:24+01:00
status: 1

cuisinière-cheminée
type: Concept
modified: 2014-12-05T10:51:07+01:00
in scheme: Thésaurus de la désignation des objets mobiliers
broader: meuble pour le feu ou le réchauffage
created: 2012-05-16T00:00:00+02:00
definition: Cuisinière sur pieds élevés comportant des foyers accessibles par les bouches supérieures, des fours accessibles par la partie antérieure et un grand espace d'entrejambe servant effectivement de cheminée.
status: 1
broad match: cb11973489q
broad match: http://vocab.getty.edu/aat/300052201

cuisinière-cheminée
type: PreferredTerm
modified: 2014-12-05T10:51:07+01:00
created: 2014-01-15T14:54:24+01:00
status: 1

prie-Dieu
type: Concept
modified: 2014-12-02T14:53:48+01:00
in scheme: Thésaurus de la désignation des objets mobiliers
preferred label: prie-dieus @en-us
preferred label: inginocchiatoio @it
preferred label: genuflexório @pt
narrower: prie-Dieu de sacristie
broader: siège et agenouilloir d'église du culte catholique
alternative label: prie-Dieu commode
alternative label: prie-Dieu à armoire et pupitre
alternative label: prie-Dieu à pupitre
alternative label: prie-Dieu à armoire
created: 2012-05-16T00:00:00+02:00
definition: Meuble destiné à la prière à genoux composé d'une partie formant accoudoir, repose-livre ou pupitre et généralement d'un agenouilloir, parfois mobile. Il peut en outre comporter une étagère, une petite armoire ou des tiroirs, être recouvert d'une tenture de prie-Dieu et d’un coussin de prie-Dieu.
status: 1

prie-Dieu de sacristie
type: Concept
modified: 2014-12-02T14:55:16+01:00
in scheme: Thésaurus de la désignation des objets mobiliers
preferred label: sacristy prie-dieus @en-us
preferred label: inginocchiatoio da sacrestia @it
preferred label: genuflexório de sacristia @pt
broader: prie-Dieu
created: 2012-05-16T00:00:00+02:00
definition: Prie-Dieu placé dans une sacristie sur lequel le prêtre doit dire les prières de préparation de la messe avant d'entrer dans l'église. Il peut être fixe et intégré aux boiseries de la pièce. Il présente parfois à son sommet un couronnement comportant une image religieuse ainsi qu’un panneau contenant les prières de préparation à la messe et d'action de grâces après la messe.
status: 1

prie-Dieu à armoire et pupitre
type: SimpleNonPreferredTerm
modified: 2014-12-02T14:53:48+01:00
created: 2014-01-15T14:54:24+01:00
status: 1

prie-Dieu commode
type: SimpleNonPreferredTerm
modified: 2014-12-02T14:53:48+01:00
created: 2014-01-15T14:54:24+01:00
status: 1

prie-Dieu à pupitre
type: SimpleNonPreferredTerm
modified: 2014-12-02T14:53:48+01:00
created: 2014-01-15T14:54:24+01:00
status: 1

prie-Dieu
type: PreferredTerm
modified: 2014-12-02T14:53:48+01:00
created: 2014-01-15T14:54:24+01:00
status: 1

siège et agenouilloir d'église du culte catholique
type: Concept
modified: 2014-12-02T14:21:37+01:00
in scheme: Thésaurus de la désignation des objets mobiliers
preferred label: sedili e inginocchiatoi da chiesa @it
preferred label: furniture and furnishings for sitting and kneeling @en-us
preferred label: assentos e genuflexórios de igreja @pt
narrower: trône pontifical
narrower: prie-Dieu
narrower: faldistoire
narrower: chaise de lecteur
narrower: banc de choeur
narrower: banc de fidèle
narrower: agenouilloir
narrower: chaise d'église
narrower: banc d'exèdre
narrower: tabouret de chantre
narrower: stalle
narrower: tabouret d'église
narrower: siège de célébrant
broader: meuble du culte catholique
created: 2012-05-16T00:00:00+02:00
definition: Meuble pour s’asseoir ou s’agenouiller dans l’église ; certains sont destinés aux fidèles, d’autres aux célébrants.
status: 1

prie-Dieu à armoire
type: SimpleNonPreferredTerm
modified: 2014-12-02T14:53:48+01:00
created: 2014-01-15T14:54:24+01:00
status: 1

bouteille
type: Concept
modified: 2014-12-08T13:12:00+01:00
in scheme: Thésaurus de la désignation des objets mobiliers
preferred label: bottles @en-us
broader: récipient pour le service et la consommation des boissons
alternative label: flacon à liqueur
alternative label: bouteille à eau-de-vie
alternative label: bouteille à calvados
alternative label: jéroboam
alternative label: bouteille goutte-à-goutte
alternative label: bouteille à siphon
alternative label: topette
alternative label: appareil Lhotte
alternative label: bouteille à cidre
alternative label: flacon
alternative label: fillette
alternative label: flasque
alternative label: magnum
alternative label: flacon de poche
alternative label: bouteille bordelaise
alternative label: fiole
alternative label: mathusalem
alternative label: balthazar
alternative label: bouteille clissée
alternative label: bouteille bourguignonne
alternative label: bouteille à rafraîchir
created: 2012-05-16T00:00:00+02:00
related: bidon
related: verre d'eau
related: bonbonne
definition: Récipient pour le service puis la conservation et le transport des liquides. La bouteille, de forme, de contenance ou de destination diverses, comporte un goulot supérieur axial fermé par un bouchon. Elle peut être munie d'une ou deux anses latérales verticales. La bouteille en verre peut comporter une doublure extérieure pour la protéger des chocs.
TermeAssocie: bidon
TermeAssocie: verre d'eau
TermeAssocie: bonbonne
status: 1

bidon
type: Concept
modified: 2014-12-08T11:35:58+01:00
in scheme: Thésaurus de la désignation des objets mobiliers
preferred label: cans (containers) @en-us
broader: récipient pour la conservation des aliments ou des boissons
alternative label: boîte à lait
alternative label: bidon à lait
created: 2012-05-16T00:00:00+02:00
related: bouteille
definition: Grande bouteille en métal ou en céramique, généralement cylindrique, à fond plat, pour le transport de liquides variés. Le bidon est muni d'un couvercle et d'une ou deux anses.
TermeAssocie: bouteille
status: 1
narrow match: http://data.bnf.fr/ark:/12148/cb159635989

bouteille à eau-de-vie
type: SimpleNonPreferredTerm
modified: 2014-12-08T13:12:01+01:00
created: 2014-01-15T14:54:24+01:00
status: 1

magnum
type: SimpleNonPreferredTerm
modified: 2014-12-08T13:12:01+01:00
created: 2014-01-15T14:54:24+01:00
status: 1

bouteille à rafraîchir
type: SimpleNonPreferredTerm
modified: 2014-12-08T13:12:01+01:00
created: 2014-01-15T14:54:24+01:00
status: 1

mathusalem
type: SimpleNonPreferredTerm
modified: 2014-12-08T13:12:01+01:00
created: 2014-01-15T14:54:24+01:00
status: 1

topette
type: SimpleNonPreferredTerm
modified: 2014-12-08T13:12:01+01:00
created: 2014-01-15T14:54:24+01:00
status: 1

bouteille à siphon
type: SimpleNonPreferredTerm
modified: 2014-12-08T13:12:01+01:00
created: 2014-01-15T14:54:24+01:00
status: 1

bouteille bordelaise
type: SimpleNonPreferredTerm
modified: 2014-12-08T13:12:01+01:00
created: 2014-01-15T14:54:24+01:00
status: 1

flacon à liqueur
type: SimpleNonPreferredTerm
modified: 2014-12-08T13:12:01+01:00
created: 2014-01-15T14:54:24+01:00
status: 1

verre d'eau
type: Concept
modified: 2014-12-08T16:20:57+01:00
in scheme: Thésaurus de la désignation des objets mobiliers
broader: récipient pour le service et la consommation des boissons
created: 2012-05-16T00:00:00+02:00
related: bouteille
related: plateau
related: cuiller
related: sucrier
related: table d'en-cas
definition: Ensemble de récipients en verre, généralement individuels, pour boire de l'eau parfumée : il comprend au minimum une carafe et un verre, et peut être complété d’un sucrier, d’une cuillère, d’un plateau etc.
TermeAssocie: bouteille
TermeAssocie: plateau
TermeAssocie: cuiller
TermeAssocie: sucrier
TermeAssocie: table d'en-cas
status: 1
broad match: http://data.bnf.fr/ark:/12148/cb144303016

flacon de poche
type: SimpleNonPreferredTerm
modified: 2014-12-08T13:12:01+01:00
created: 2014-01-15T14:54:24+01:00
status: 1

bonbonne
type: Concept
modified: 2014-12-08T11:44:00+01:00
in scheme: Thésaurus de la désignation des objets mobiliers
preferred label: demijohns @en-us
broader: récipient pour la conservation des aliments ou des boissons
alternative label: bonbonne à huile
alternative label: dame-jeanne
alternative label: bonbonne à vin
alternative label: bonbonne clissée
created: 2012-05-16T00:00:00+02:00
related: bouteille
definition: Grosse bouteille en céramique ou verre, cylindrique ou sphérique, à goulot étroit et court, utilisée pour la conservation de liquides.
TermeAssocie: bouteille
status: 1
broad match: cb13184671j

appareil Lhotte
type: SimpleNonPreferredTerm
modified: 2014-12-08T13:12:01+01:00
created: 2014-01-15T14:54:24+01:00
status: 1

flasque
type: SimpleNonPreferredTerm
modified: 2014-12-08T13:12:01+01:00
created: 2014-01-15T14:54:24+01:00
status: 1

bouteille à cidre
type: SimpleNonPreferredTerm
modified: 2014-12-08T13:12:01+01:00
created: 2014-01-15T14:54:24+01:00
status: 1

fillette
type: SimpleNonPreferredTerm
modified: 2014-12-08T13:12:01+01:00
created: 2014-01-15T14:54:24+01:00
status: 1

fiole
type: SimpleNonPreferredTerm
modified: 2014-12-08T13:12:01+01:00
created: 2014-01-15T14:54:24+01:00
status: 1

bouteille goutte-à-goutte
type: SimpleNonPreferredTerm
modified: 2014-12-08T13:12:01+01:00
created: 2014-01-15T14:54:24+01:00
status: 1

bouteille
type: PreferredTerm
modified: 2014-12-08T13:12:01+01:00
created: 2014-01-15T14:54:24+01:00
status: 1

bouteille bourguignonne
type: SimpleNonPreferredTerm
modified: 2014-12-08T13:12:01+01:00
created: 2014-01-15T14:54:24+01:00
status: 1

balthazar
type: SimpleNonPreferredTerm
modified: 2014-12-08T13:12:01+01:00
created: 2014-01-15T14:54:24+01:00
status: 1

jéroboam
type: SimpleNonPreferredTerm
modified: 2014-12-08T13:12:01+01:00
created: 2014-01-15T14:54:24+01:00
status: 1

flacon
type: SimpleNonPreferredTerm
modified: 2014-12-08T13:12:01+01:00
created: 2014-01-15T14:54:24+01:00
status: 1

bouteille à calvados
type: SimpleNonPreferredTerm
modified: 2014-12-08T13:12:01+01:00
created: 2014-01-15T14:54:24+01:00
status: 1

bouteille clissée
type: SimpleNonPreferredTerm
modified: 2014-12-08T13:12:01+01:00
created: 2014-01-15T14:54:24+01:00
status: 1

repose-poêle
type: Concept
modified: 2014-10-13T12:37:24+02:00
in scheme: Thésaurus de la désignation des objets mobiliers
broader: meuble-support
created: 2012-05-16T00:00:00+02:00
related: trépied
related: porte-poêle
definition: Meuble en forme de petit tabouret bas, circulaire, prolongé par un manche horizontal terminé par une tige verticale, servant à poser une poêle sortie du feu.
TermeAssocie: trépied
TermeAssocie: porte-poêle
status: 1
broad match: http://vocab.getty.edu/aat/300039337

trépied
type: Concept
modified: 2014-12-05T15:02:35+01:00
in scheme: Thésaurus de la désignation des objets mobiliers
preferred label: trivets @en-us
broader: objet d'âtre pour la cuisson
alternative label: cale-pot
alternative label: trépied cale-pot
alternative label: accote-pot
alternative label: appuie-pot
created: 2012-05-16T00:00:00+02:00
related: repose-poêle
related: marmite
definition: Support à trois pieds et éventuellement à manche latéral, que l'on place dans l'âtre au-dessus des braises pour y poser les récipients de cuisson.
TermeAssocie: repose-poêle
TermeAssocie: marmite
status: 1

porte-poêle
type: Concept
modified: 2014-10-16T14:22:32+02:00
in scheme: Thésaurus de la désignation des objets mobiliers
broader: objet d'âtre pour la cuisson
alternative label: porte-écuelle
alternative label: porte-manche
created: 2012-05-16T00:00:00+02:00
related: repose-poêle
definition: Support, souvent trépied, sur lequel on pose les poêles chaudes en dehors de l’âtre.
TermeAssocie: repose-poêle
status: 1
broad match: Poêle (cuisine)

repose-poêle
type: PreferredTerm
modified: 2014-10-13T12:37:24+02:00
created: 2014-01-15T14:54:24+01:00
status: 1

revêtement
type: Concept
modified: 2015-01-15T17:30:47+01:00
in scheme: Thésaurus de la désignation des objets mobiliers
preferred label: surface elements (architectural) @en-us
narrower: lambris de revêtement
narrower: carrelage mural
broader: décor d'architecture
alternative label: revêtement mural
alternative label: mosaïque monumentale
alternative label: revêtement intérieur
alternative label: céramique monumentale
alternative label: revêtement extérieur
created: 2012-06-07T00:00:00+02:00
related: garniture architecturale
definition: Ce qui recouvre la fourrure ou le gros-œuvre d’une construction.
TermeAssocie: garniture architecturale
status: 1

peinture monumentale
type: Concept
modified: 2014-12-03T16:12:02+01:00
in scheme: Thésaurus de la désignation des objets mobiliers
preferred label: mural paintings (visual works) @en-us
broader: peinture
alternative label: mur peint
alternative label: panorama
alternative label: diorama
alternative label: peinture murale
alternative label: peinture murale marouflée
created: 2012-05-16T00:00:00+02:00
related: garniture architecturale
related: tag
definition: Peinture réalisée ou appliquée sur les parois intérieures (y compris les voûtes et plafonds) ou extérieurs d'un édifice ainsi que sur les différents éléments d'une architecture (poutres, etc.). Il s'agit essentiellement de peinture murale ou de peinture murale marouflée.
TermeAssocie: garniture architecturale
TermeAssocie: tag
status: 1

toile peinte
type: SimpleNonPreferredTerm
modified: 2014-12-12T11:04:21+01:00
created: 2014-01-15T14:54:24+01:00
status: 1

garniture architecturale
type: PreferredTerm
modified: 2014-12-12T11:04:21+01:00
created: 2014-01-15T14:54:24+01:00
status: 1

rideau de scène
type: Concept
modified: 2014-12-12T11:11:28+01:00
in scheme: Thésaurus de la désignation des objets mobiliers
preferred label: stage curtains @en-us
broader: garniture architecturale
alternative label: rideau d'avant-scène
created: 2012-05-16T00:00:00+02:00
definition: Grande draperie ou toile peinte placée entre la salle et la scène et destinée, outre son rôle décoratif, à dissimuler cette dernière quand elle n'est pas occupée par le déroulement d'une représentation.
status: 1

rideau de fenêtre
type: Concept
modified: 2014-12-12T11:09:26+01:00
in scheme: Thésaurus de la désignation des objets mobiliers
preferred label: curtains (window hangings) @en-us
broader: garniture architecturale
alternative label: voilage
alternative label: store
alternative label: double-rideau
created: 2012-05-16T00:00:00+02:00
definition: Pièce de tissu, voilage ou tissu épais, suspendue devant une baie, et destinée à filtrer ou à masquer la lumière.
status: 1

toile de fond
type: Concept
modified: 2014-10-20T11:50:02+02:00
in scheme: Thésaurus de la désignation des objets mobiliers
preferred label: backdrops @en-us
broader: garniture architecturale
alternative label: décor de théâtre
alternative label: rideau de fond
created: 2012-05-16T00:00:00+02:00
definition: Grande toile peinte occupant le fond de la scène après les dernières coulisses. Elle tient toute la hauteur de la scène et s'enroule sur un cylindre.
status: 1

papier peint
type: SimpleNonPreferredTerm
modified: 2014-12-12T11:04:21+01:00
created: 2014-01-15T14:54:24+01:00
status: 1

cuir peint
type: SimpleNonPreferredTerm
modified: 2014-12-12T11:04:21+01:00
created: 2014-01-15T14:54:24+01:00
status: 1

portière
type: Concept
modified: 2014-12-12T11:07:53+01:00
in scheme: Thésaurus de la désignation des objets mobiliers
preferred label: portieres @en-us
broader: garniture architecturale
created: 2012-05-16T00:00:00+02:00
definition: Pièce de tapisserie ou de tissu masquant une porte.
status: 1
broad match: http://data.bnf.fr/ark:/12148/cb131628658

tenture d'église
type: Concept
modified: 2014-12-03T11:20:07+01:00
in scheme: Thésaurus de la désignation des objets mobiliers
preferred label: church hangings @en-us
preferred label: parato da chiesa @it
preferred label: armação de igreja @pt
broader: linge ou garniture du culte catholique
alternative label: tenture de tapisserie d'église
alternative label: tenture de chœur
alternative label: portière d'église
created: 2012-05-16T00:00:00+02:00
related: tenture funéraire
definition: Garnitures, souvent en velours rouge, suspendues, lors des grandes cérémonies, sur les murs autour du maître-autel et généralement dans le reste de l’église, sur les piliers, les pilastres ou les colonnes, ainsi que parfois, à l’extérieur, autour de la porte d’entrée (portière d’église). On appelle tenture de tapisserie d’église, un ensemble constitué de tapisseries, le plus souvent suspendu dans le chœur (tenture de chœur).
TermeAssocie: tenture funéraire
status: 1

portière d'église
type: SimpleNonPreferredTerm
modified: 2014-12-03T11:20:07+01:00
created: 2014-01-15T14:54:24+01:00
status: 1

linge ou garniture du culte catholique
type: Concept
modified: 2014-12-02T15:45:32+01:00
in scheme: Thésaurus de la désignation des objets mobiliers
preferred label: liturgical linen and ornaments @en-us
preferred label: lini e coperture liturgiche @it
preferred label: linhos e guarnições de uso litúrgico @pt
narrower: tenture d'église
narrower: linge ou garniture liés à l'Eucharistie
narrower: linge ou garniture liés à l'autel
narrower: linge ou garniture liés à la procession
narrower: linge ou garniture liés aux sacrements autres que l'Eucharistie
narrower: linge ou garniture liés aux temps de Carême
narrower: linge ou garniture liés aux rites funéraires
narrower: linge lié à la dévotion
narrower: linge ou garniture liés aux sièges
narrower: linge lié aux insignes pontificaux
narrower: linge lié aux ablutions
narrower: linge ou garniture liés à la prédication, à la lecture et au chant
narrower: bannière d'église
broader: textile du culte catholique
created: 2012-05-16T00:00:00+02:00
definition: Pièce textile destinée à la garniture du mobilier ou des objets liés au culte. Sa forme, son iconographie, son décor, sa couleur, et la nature même du tissu, plus ou moins précieux, varient selon la fonction et le temps liturgique. Elle peut porter des marques d’appartenance.
status: 1

tenture d'église
type: PreferredTerm
modified: 2014-12-03T11:20:07+01:00
created: 2014-01-15T14:54:24+01:00
status: 1

tenture funéraire
type: Concept
modified: 2014-12-03T10:52:49+01:00
in scheme: Thésaurus de la désignation des objets mobiliers
preferred label: funeral hangings @en-us
preferred label: cortina funebre @it
preferred label: armação fúnebre @pt
broader: linge ou garniture liés aux rites funéraires
alternative label: portière funéraire
created: 2012-05-16T00:00:00+02:00
related: tenture d'église
definition: Étoffes fixées, à l'occasion d'une cérémonie funèbre, à l'extérieur, autour de la porte d'une église et à l'intérieur, sur les murs, les piliers ou les colonnes. Elles portent parfois les initiales ou les armoiries du défunt.
TermeAssocie: tenture d'église
status: 1

tenture de chœur
type: SimpleNonPreferredTerm
modified: 2014-12-03T11:20:07+01:00
created: 2014-01-15T14:54:24+01:00
status: 1

tenture de tapisserie d'église
type: SimpleNonPreferredTerm
modified: 2014-12-03T11:20:07+01:00
created: 2014-01-15T14:54:24+01:00
status: 1

chef-reliquaire
type: Concept
modified: 2014-11-26T17:37:18+01:00
in scheme: Thésaurus de la désignation des objets mobiliers
preferred label: head-reliquaries @en-us
preferred label: reliquiario a testa @it
preferred label: cabeça-relicario @pt
broader: reliquaire morphologique
created: 2012-05-16T00:00:00+02:00
scope note: Ne pas confondre le chef-reliquaire et le reliquaire de crâne : l'un est en forme de tête, l'autre, bien que contenant un crâne ou un os du crâne, n'en prend pas la forme.
related: tête
definition: Reliquaire ayant la forme de la tête qui constitue la relique.
TermeAssocie: tête
status: 1
broad match: http://vocab.getty.edu/aat/300263061

chef-reliquaire
type: PreferredTerm
modified: 2014-11-26T17:37:18+01:00
created: 2014-01-15T14:54:24+01:00
status: 1

tête
type: Concept
modified: 2014-12-04T10:55:36+01:00
in scheme: Thésaurus de la désignation des objets mobiliers
preferred label: heads @en-us
broader: sculpture
created: 2012-05-16T00:00:00+02:00
scope note: La tête est en ronde-bosse ou en haut-relief : ne pas la confondre avec la tête plate ou le mascaron qui sont des faces et qui ne comprennent pas le cou.
related: reliquaire morphologique
related: chef-reliquaire
definition: Représentation en ronde-bosse ou en relief de l'extrémité supérieure du corps humain ou de l'extrémité antérieure du corps de l'animal comprenant la tête et le cou.
TermeAssocie: reliquaire morphologique
TermeAssocie: chef-reliquaire
status: 1

machine à mettre en caisse
type: Concept
modified: 2015-10-14T16:08:53+02:00
in scheme: Thésaurus de la désignation des objets mobiliers
broader: machine à conditionner
created: 2012-05-16T00:00:00+02:00
definition: Machine à conditionner un produit dans une caisse.
status: 1
broad match: cb12011474j

machine à conditionner
type: Concept
modified: 2015-10-14T15:57:20+02:00
in scheme: Thésaurus de la désignation des objets mobiliers
narrower: machine à mettre en caisse
narrower: machine à embouteiller
narrower: machine à mettre en boîte
narrower: machine à pasteuriser
narrower: machine à ensacher
narrower: machine à obturer
narrower: machine à palettiser
narrower: machine à envelopper
narrower: machine à empaqueter
narrower: machine à stériliser
broader: machine à mettre en état
alternative label: machine à empiler
created: 2012-05-16T00:00:00+02:00
definition: Machine à mettre un produit brut dans un emballage afin de répondre à des impératifs commerciaux (transport, vente, etc).
status: 1

machine à mettre en caisse
type: PreferredTerm
modified: 2015-10-14T16:08:53+02:00
created: 2014-01-15T14:54:24+01:00
status: 1

support anthropomorphe
type: Concept
modified: 2015-02-20T16:59:45+01:00
in scheme: Thésaurus de la désignation des objets mobiliers
preferred label: anthropomorphic supporting elements @en-us
broader: support vertical
alternative label: atlante
alternative label: canéphore
alternative label: cariatide
created: 2012-05-16T00:00:00+02:00
related: statue
definition: Statue de forme humaine servant de support vertical.
TermeAssocie: statue
status: 1
broad match: cb11977661v

support anthropomorphe
type: PreferredTerm
modified: 2015-02-20T16:59:45+01:00
created: 2014-01-15T14:54:24+01:00
status: 1

canéphore
type: SimpleNonPreferredTerm
modified: 2015-02-20T16:59:45+01:00
created: 2014-01-15T14:54:24+01:00
status: 1

support vertical
type: Concept
modified: 2014-10-15T15:44:48+02:00
in scheme: Thésaurus de la désignation des objets mobiliers
narrower: support anthropomorphe
narrower: socle d'architecture
narrower: pilier
narrower: T69-193
narrower: T69-191
narrower: T69-199
narrower: T69-197
narrower: T69-187
broader: support ou organe de stabilité
created: 2012-05-16T00:00:00+02:00
related: ronde-bosse
definition: Élément structurel vertical jouant un rôle dans la stabilité de l'architecture.
TermeAssocie: ronde-bosse
status: 1
broad match: cb11977661v
broad match: http://vocab.getty.edu/aat/300078048

statue
type: Concept
modified: 2014-12-04T10:46:20+01:00
in scheme: Thésaurus de la désignation des objets mobiliers
preferred label: statues @en-us
broader: ronde-bosse
created: 2012-05-16T00:00:00+02:00
scope note: Spécifier dans le champ PDEN, statue d'applique, statue en pied ou statue équestre, ou en ce qui concerne le format, statue colossale ou grandeur nature, petite nature, demi-nature, statuette, figurine. Ne pas employer pour un gisant, généralement en haut ou demi-relief.
related: support anthropomorphe
related: statue de procession
related: statue cinéraire
related: statue-reliquaire
related: statue ouvrante
definition: Représentation en ronde-bosse d'une figure entière (homme, animal, hybride) debout, assise, agenouillée ou couchée.
TermeAssocie: support anthropomorphe
TermeAssocie: statue de procession
TermeAssocie: statue cinéraire
TermeAssocie: statue-reliquaire
TermeAssocie: statue ouvrante
status: 1

cariatide
type: SimpleNonPreferredTerm
modified: 2015-02-20T16:59:45+01:00
created: 2014-01-15T14:54:24+01:00
status: 1

atlante
type: SimpleNonPreferredTerm
modified: 2015-02-20T16:59:45+01:00
created: 2014-01-15T14:54:24+01:00
status: 1

machine à doser
type: Concept
modified: 2015-10-15T15:16:47+02:00
in scheme: Thésaurus de la désignation des objets mobiliers
broader: machine à organiser
alternative label: doseuse
alternative label: machine à distribuer
alternative label: doseuse pondérale à peser
alternative label: distributeur-doseur
created: 2012-05-16T00:00:00+02:00
definition: Machine à organiser des matériaux ou des produits selon des normes quantitatives.
status: 1
narrow match: Pompe doseuse

machine à doser
type: PreferredTerm
modified: 2015-10-15T15:16:47+02:00
created: 2014-01-15T14:54:24+01:00
status: 1

distributeur-doseur
type: SimpleNonPreferredTerm
modified: 2015-10-15T15:16:47+02:00
created: 2014-01-15T14:54:24+01:00
status: 1

machine à organiser
type: Concept
modified: 2014-01-10T00:00:00+01:00
in scheme: Thésaurus de la désignation des objets mobiliers
narrower: machine à doser
narrower: machine à bobiner
narrower: machine à homogénéiser
narrower: machine à plier
narrower: machine à répartir
narrower: machine à arranger
narrower: T69-5905
narrower: T69-5901
broader: machine à mettre en état
alternative label: machine à accumuler
alternative label: machine à renforcer
created: 2012-05-16T00:00:00+02:00
definition: Machine à mettre en état des produits pour répondre à des exigences de fabrication ou de conditionnement.
status: 1

doseuse
type: SimpleNonPreferredTerm
modified: 2015-10-15T15:16:47+02:00
created: 2014-01-15T14:54:24+01:00
status: 1

doseuse pondérale à peser
type: SimpleNonPreferredTerm
modified: 2015-10-15T15:16:47+02:00
created: 2014-01-15T14:54:24+01:00
status: 1

machine à distribuer
type: SimpleNonPreferredTerm
modified: 2015-10-15T15:16:47+02:00
created: 2014-01-15T14:54:24+01:00
status: 1

ocarina
type: Concept
modified: 2014-10-10T11:56:59+02:00
in scheme: Thésaurus de la désignation des objets mobiliers
preferred label: ocarinas @en-us
broader: flûte à biseau
created: 2012-05-16T00:00:00+02:00
definition: Instrument à conduit d'air aménagé entre l'embouchure et le biseau, ayant la forme renflée d'unœuf aplati et allongé. En général, il comporte deux trous pour les pouces au revers et huit pour les autres doigts sur la face antérieure et est en argile ou en porcelaine.
status: 1

ocarina
type: PreferredTerm
modified: 2014-10-10T11:56:59+02:00
created: 2014-01-15T14:54:24+01:00
status: 1

figure de proue
type: PreferredTerm
modified: 2014-12-19T16:18:54+01:00
created: 2014-01-15T14:54:24+01:00
status: 1

meuble minéralogique
type: Concept
modified: 2014-10-13T11:31:50+02:00
in scheme: Thésaurus de la désignation des objets mobiliers
broader: meuble de collection spécifique
created: 2012-05-16T00:00:00+02:00
definition: Cabinet ou meuble, très généralement à tiroirs multiples relativement profonds et, le plus souvent, de tailles différentes, servant à déposer des minéraux.
status: 1
broad match: http://vocab.getty.edu/aat/300379868
broad match: Meuble

meuble minéralogique
type: PreferredTerm
modified: 2014-10-13T11:31:50+02:00
created: 2014-01-15T14:54:24+01:00
status: 1

outil servant à percuter
type: PreferredTerm
modified: 2014-01-10T00:00:00+01:00
created: 2014-01-15T14:54:24+01:00
status: 1

pic
type: Concept
modified: 2014-01-10T00:00:00+01:00
in scheme: Thésaurus de la désignation des objets mobiliers
broader: outil servant à percuter
alternative label: piochon
alternative label: pioche
created: 2013-12-16T00:00:00+01:00
status: 1

outil
type: Concept
modified: 2014-01-10T00:00:00+01:00
in scheme: Thésaurus de la désignation des objets mobiliers
narrower: outil servant à percuter
narrower: outil servant à peindre
narrower: outil servant à mesurer ou dessiner
narrower: outil servant à découper
narrower: outil servant à marquer
narrower: enclume
narrower: T69-9655
narrower: T69-4923
narrower: T69-9710
narrower: T69-9651
narrower: T69-9714
narrower: T69-9647
broader: matériel artisanal
created: 2013-12-16T00:00:00+01:00
status: 1

plaque de cheminée
type: Concept
modified: 2014-12-05T14:48:07+01:00
in scheme: Thésaurus de la désignation des objets mobiliers
preferred label: firebacks @en-us
broader: objet d'âtre
alternative label: taque
alternative label: plaque foyère
alternative label: contre-foyer
alternative label: plaque de foyer
alternative label: contre-feu
created: 2012-05-16T00:00:00+02:00
related: plaque de poêle
related: placard chauffant
definition: Plaque fixée sur le contre-cœur, parfois sur les tableaux ou les ébrasements d'une cheminée pour protéger le mur et diffuser la chaleur.
TermeAssocie: plaque de poêle
TermeAssocie: placard chauffant
status: 1

plaque de poêle
type: Concept
modified: 2014-12-05T11:07:42+01:00
in scheme: Thésaurus de la désignation des objets mobiliers
preferred label: stove plates @en-us
broader: poêle de chauffage
created: 2012-05-16T00:00:00+02:00
scope note: Ne pas confondre avec le carreau de poêle qui est en céramique.
related: plaque de cheminée
definition: Plaque en fonte de fer destinée à orner l'extérieur d'un poêle ; l'iconographie peut en être très élaborée.
TermeAssocie: plaque de cheminée
status: 1
broad match: cb16580229s
broad match: Poêle (chauffage)

contre-foyer
type: SimpleNonPreferredTerm
modified: 2014-12-05T14:48:07+01:00
created: 2014-01-15T14:54:24+01:00
status: 1

taque
type: SimpleNonPreferredTerm
modified: 2014-12-05T14:48:07+01:00
created: 2014-01-15T14:54:24+01:00
status: 1

placard chauffant
type: Concept
modified: 2014-12-05T10:59:28+01:00
in scheme: Thésaurus de la désignation des objets mobiliers
broader: meuble lié au chauffage
created: 2012-05-16T00:00:00+02:00
related: plaque de cheminée
definition: Placard situé dans une pièce jouxtant celle de l'âtre et placé contre le revers de ce dernier, ce qui fait que le meuble, et par conséquent la pièce, sont chauffés à travers le mur et la plaque de cheminée (le mur est supprimé à l'emplacement de la plaque). Le placard peut inclure un poêle récupérateur.
TermeAssocie: plaque de cheminée
status: 1
broad match: http://data.bnf.fr/ark:/12148/cb131627383
broad match: http://vocab.getty.edu/aat/300163292

plaque de cheminée
type: PreferredTerm
modified: 2014-12-05T14:48:07+01:00
created: 2014-01-15T14:54:24+01:00
status: 1

contre-feu
type: SimpleNonPreferredTerm
modified: 2014-12-05T14:48:07+01:00
created: 2014-01-15T14:54:24+01:00
status: 1

plaque foyère
type: SimpleNonPreferredTerm
modified: 2014-12-05T14:48:07+01:00
created: 2014-01-15T14:54:24+01:00
status: 1

plaque de foyer
type: SimpleNonPreferredTerm
modified: 2014-12-05T14:48:07+01:00
created: 2014-01-15T14:54:24+01:00
status: 1

couronne de statue
type: Concept
modified: 2014-11-26T14:29:39+01:00
in scheme: Thésaurus de la désignation des objets mobiliers
preferred label: statue crowns @en-us
preferred label: corona da statua @it
preferred label: coroa de estátua @pt
broader: attribut d'image sacrée
alternative label: couronne mariale
alternative label: couronne de dévotion
alternative label: couronne de tableau
alternative label: couronne d'image pieuse
alternative label: couronne d'image sacrée
created: 2012-05-16T00:00:00+02:00
related: bijou
related: couronne royale
definition: Couronne placée au-dessus de la tête d'une statue particulièrement honorée d'un personnage sacré, en général une Vierge à l'Enfant.
TermeAssocie: bijou
TermeAssocie: couronne royale
status: 1

couronne mariale
type: SimpleNonPreferredTerm
modified: 2014-11-26T14:29:39+01:00
created: 2014-01-15T14:54:24+01:00
status: 1

couronne de dévotion
type: SimpleNonPreferredTerm
modified: 2014-11-26T14:29:39+01:00
created: 2014-01-15T14:54:24+01:00
status: 1

couronne de statue
type: PreferredTerm
modified: 2014-11-26T14:29:39+01:00
created: 2014-01-15T14:54:24+01:00
status: 1

couronne d'image pieuse
type: SimpleNonPreferredTerm
modified: 2014-11-26T14:29:39+01:00
created: 2014-01-15T14:54:24+01:00
status: 1

couronne de tableau
type: SimpleNonPreferredTerm
modified: 2014-11-26T14:29:39+01:00
created: 2014-01-15T14:54:24+01:00
status: 1

couronne d'image sacrée
type: SimpleNonPreferredTerm
modified: 2014-11-26T14:29:39+01:00
created: 2014-01-15T14:54:24+01:00
status: 1

couronne royale
type: Concept
modified: 2014-10-09T12:54:21+02:00
in scheme: Thésaurus de la désignation des objets mobiliers
preferred label: royal crowns @en-us
broader: emblème de pouvoir
created: 2013-11-29T00:00:00+01:00
related: bijou
related: couronne de statue
definition: <!--[if gte mso 9]> <o:OfficeDocumentSettings> <o:AllowPNG/> </o:OfficeDocumentSettings> <![endif]-->Objet circulaire de métal précieux souvent orné de pierreries, que le souverain porte sur sa tête comme insigne de sa puissance et de sa dignité.
TermeAssocie: bijou
TermeAssocie: couronne de statue
status: 1

peigne liturgique
type: Concept
modified: 2014-12-01T10:44:15+01:00
in scheme: Thésaurus de la désignation des objets mobiliers
preferred label: pettine liturgico @it
preferred label: liturgical combs @en-us
preferred label: pente litúrgico @pt
broader: objet lié aux sacrements autres que l'Eucharistie
created: 2012-05-16T00:00:00+02:00
definition: Peigne généralement en ivoire, utilisé pour le sacre d'un évêque et avant une messe pontificale.
status: 1

peigne liturgique
type: PreferredTerm
modified: 2014-12-01T10:44:15+01:00
created: 2014-01-15T14:54:24+01:00
status: 1

arundo
type: Concept
modified: 2014-12-01T11:10:31+01:00
in scheme: Thésaurus de la désignation des objets mobiliers
preferred label: arundine @it
preferred label: harundos @en-us
preferred label: serpentina (vela) @pt
broader: objet lié aux temps de Noël et de Carême
alternative label: cierge trident
alternative label: tricerio
alternative label: cierge à trois branches
created: 2012-05-16T00:00:00+02:00
related: chandelier pascal
related: cierge
definition: Cierge à trois chandelles ou chandelier à trois branches porté par un manche unique, utilisé au cours de la veillée pascale, le Samedi saint, pour allumer le cierge pascal, lors du lumen Christi.
TermeAssocie: chandelier pascal
TermeAssocie: cierge
status: 1
broad match: http://data.bnf.fr/ark:/12148/cb119367105
broad match: http://vocab.getty.edu/aat/300037654
broad match: Cierge (bougie)

tricerio
type: SimpleNonPreferredTerm
modified: 2014-12-01T11:10:31+01:00
created: 2014-01-15T14:54:24+01:00
status: 1

chandelier pascal
type: Concept
modified: 2014-12-02T12:33:11+01:00
in scheme: Thésaurus de la désignation des objets mobiliers
preferred label: candelabro per il cero pasquale @it
preferred label: paschal candlesticks @en-us
preferred label: tocheiro pascal @pt
broader: meuble luminaire d'église
created: 2012-05-16T00:00:00+02:00
related: arundo
related: chandelier d'église
related: cierge pascal
definition: Grand chandelier destiné à recevoir le cierge pascal, placé dans le chœur ou dans le sanctuaire du côté de l'Evangile.
TermeAssocie: arundo
TermeAssocie: chandelier d'église
TermeAssocie: cierge pascal
status: 1

cierge trident
type: SimpleNonPreferredTerm
modified: 2014-12-01T11:10:31+01:00
created: 2014-01-15T14:54:24+01:00
status: 1

cierge à trois branches
type: SimpleNonPreferredTerm
modified: 2014-12-01T11:10:31+01:00
created: 2014-01-15T14:54:24+01:00
status: 1

cierge
type: Concept
modified: 2014-12-01T11:38:41+01:00
in scheme: Thésaurus de la désignation des objets mobiliers
preferred label: cero liturgico @it
preferred label: liturgical candles @en-us
preferred label: círio @pt
broader: objet pour l'éclairage
alternative label: flamberge
alternative label: cierge votif
alternative label: souche de cierge
alternative label: cierge de la Chandeleur
created: 2012-05-16T00:00:00+02:00
related: arundo
related: cierge de communion
related: cierge pascal
related: cire de deuil
related: cierge funéraire
related: T69-1567
definition: Grande bougie composée en majeure partie de cire d'abeille purifiée. Les cierges utilisés sur l’autel, dont le nombre varie en fonction de la messe, doivent être de cire blanche ; ceux utilisés lors des messes de requiem, du Vendredi saint ou des offices des Ténèbres doivent être de cire non traitée et jaune. Les cierges votifs sont allumés devant une représentation religieuse vénérée. Ils peuvent être décorés en relief d’une iconographie se rapportant au donateur ou à une dévotion spécifique. Lors des cérémonies religieuses, des cierges sont utilisés ou distribués : cierges de communion, de baptême, de procession, etc. La souche est un faux cierge, muni d’un ressort à l’intérieur, dans lequel on introduit une bougie.
TermeAssocie: arundo
TermeAssocie: cierge de communion
TermeAssocie: cierge pascal
TermeAssocie: cire de deuil
TermeAssocie: cierge funéraire
TermeAssocie: T69-1567
status: 1

arundo
type: PreferredTerm
modified: 2014-12-01T11:10:31+01:00
created: 2014-01-15T14:54:24+01:00
status: 1

lambris d'appui
type: Concept
modified: 2015-01-16T12:34:17+01:00
in scheme: Thésaurus de la désignation des objets mobiliers
preferred label: wainscoting @en-us
broader: lambris de revêtement
created: 2012-05-16T00:00:00+02:00
definition: Lambris de revêtement couvrant un mur du sol jusqu'à la hauteur d'appui, soit un mètre environ.
status: 1
broad match: cb12505322n

lambris d'appui
type: PreferredTerm
modified: 2015-01-16T12:34:17+01:00
created: 2014-01-15T14:54:24+01:00
status: 1

croix de baptême orthodoxe
type: Concept
modified: 2014-01-10T00:00:00+01:00
in scheme: Thésaurus de la désignation des objets mobiliers
broader: objet du culte orthodoxe
created: 2012-05-16T00:00:00+02:00
definition: Croix pouvant être de toutes formes et de toutes tailles, portée accrochée au cou, portant souvent l'inscription "sauve et garde".
status: 1

croix de baptême orthodoxe
type: PreferredTerm
modified: 2014-01-10T00:00:00+01:00
created: 2014-01-15T14:54:24+01:00
status: 1

étui à cure-dents
type: SimpleNonPreferredTerm
modified: 2014-10-16T15:02:30+02:00
created: 2014-01-15T14:54:24+01:00
status: 1

dessous-de-plat
type: Concept
modified: 2014-10-16T15:09:04+02:00
in scheme: Thésaurus de la désignation des objets mobiliers
broader: accessoire du service
alternative label: porte-plat
alternative label: porte-assiette
created: 2012-05-16T00:00:00+02:00
definition: Plaque ou disque sur laquelle on pose un plat pour protéger la nappe. Souvent ajouré, le dessous de plat peut être porté par des petits pieds et muni de coulisses pour en agrandir la surface.
status: 1
broad match: Service de table

ramasse-miettes
type: SimpleNonPreferredTerm
modified: 2014-10-16T15:02:30+02:00
created: 2014-01-15T14:54:24+01:00
status: 1

présentoir à raisins
type: SimpleNonPreferredTerm
modified: 2014-10-16T15:02:30+02:00
created: 2014-01-15T14:54:24+01:00
status: 1

porte-couteau
type: Concept
modified: 2014-10-16T15:13:27+02:00
in scheme: Thésaurus de la désignation des objets mobiliers
preferred label: knife rests @en-us
broader: accessoire du service
alternative label: porte-couteaux
created: 2012-05-16T00:00:00+02:00
related: broc
related: porte-couverts
definition: D’une part, petit support sur lequel on pose l'extrémité de la lame d'un couteau pour ne pas salir la nappe ; d’autre part, support destiné à ranger ou présenter plusieurs couteaux.
TermeAssocie: broc
TermeAssocie: porte-couverts
status: 1
broad match: cb11941209k

porte-verres
type: SimpleNonPreferredTerm
modified: 2014-10-16T15:02:30+02:00
created: 2014-01-15T14:54:24+01:00
status: 1

porte-menu
type: SimpleNonPreferredTerm
modified: 2014-10-16T15:02:30+02:00
created: 2014-01-15T14:54:24+01:00
status: 1

rafraîchissoir à bouteille
type: Concept
modified: 2014-12-05T15:53:55+01:00
in scheme: Thésaurus de la désignation des objets mobiliers
preferred label: wine coolers (containers) @en-us
broader: accessoire du service
alternative label: rafraîchissoir à bouteilles
alternative label: seau à bouteille
created: 2012-05-16T00:00:00+02:00
definition: Récipient en métal ou en céramique, où l'on met une ou plusieurs bouteilles à rafraîchir dans de la glace pilée ou de l'eau froide. Le rafraîchissoir est à fond plat ou sur pied bas, muni de deux anses ou de deux oreilles sur les côtés.
status: 1
broad match: http://data.bnf.fr/ark:/12148/cb11965899d

présentoir à bouteille
type: Concept
modified: 2014-10-16T15:15:43+02:00
in scheme: Thésaurus de la désignation des objets mobiliers
broader: accessoire du service
alternative label: chariot à vin
alternative label: corbeille à bouteille
created: 2012-05-16T00:00:00+02:00
definition: Accessoire pour présenter sur la table et servir en position inclinée une bouteille de vin. Il est constitué d'une corbeille munie d'une encoche pour maintenir le goulot de la bouteille, d'une monture articulée ou d'un chariot muni d'une manivelle permettant de régler l'inclinaison de la bouteille (chariot à vin).
status: 1
broad match: http://data.bnf.fr/ark:/12148/cb11965899d

soucoupe
type: Concept
modified: 2014-12-05T15:57:51+01:00
in scheme: Thésaurus de la désignation des objets mobiliers
preferred label: saucers @en-us
broader: accessoire du service
alternative label: sous-tasse
created: 2012-05-16T00:00:00+02:00
related: écuelle
related: tasse
related: gobelet
definition: Petite assiette destinée à supporter une tasse, une écuelle, une coupe ou un gobelet auxquels elle est assortie. La soucoupe comporte généralement au centre un rebord, un creux ou un décor marquant l'emplacement du récipient placé dessus.
TermeAssocie: écuelle
TermeAssocie: tasse
TermeAssocie: gobelet
status: 1

nef de table
type: Concept
modified: 2014-10-16T15:09:59+02:00
in scheme: Thésaurus de la désignation des objets mobiliers
preferred label: nefs @en-us
broader: accessoire du service
alternative label: vaisseau de table
created: 2012-05-16T00:00:00+02:00
related: T69-572
definition: Accessoire placé sur la table pour marquer la place d'un personnage important. Empruntant souvent la forme d’une nef, il peut être utilisé comme cadenas de table pour y enfermer le sel, le couvert et parfois les épreuves (objets accrochés au languier et destinés à déceler la présence de poison dans les aliments). Sa fonction peut aussi être uniquement décorative.
TermeAssocie: T69-572
status: 1

porte-toasts
type: SimpleNonPreferredTerm
modified: 2014-10-16T15:02:30+02:00
created: 2014-01-15T14:54:24+01:00
status: 1

boîte à cure-dents
type: SimpleNonPreferredTerm
modified: 2014-10-16T15:02:30+02:00
created: 2014-01-15T14:54:24+01:00
status: 1

pelle à miettes
type: SimpleNonPreferredTerm
modified: 2014-10-16T15:02:30+02:00
created: 2014-01-15T14:54:24+01:00
status: 1

objet lié aux aliments ou aux boissons
type: Concept
modified: 2014-10-16T15:00:08+02:00
in scheme: Thésaurus de la désignation des objets mobiliers
preferred label: culinary equipment @en-us
narrower: récipient pour le service et la consommation des boissons
narrower: accessoire du service
narrower: récipient pour le service ou la consommation des aliments
narrower: instrument pour la préparation - le service ou la consommation des aliments et des boissons
narrower: récipient pour la conservation des aliments ou des boissons
narrower: récipient pour la cuisson des aliments
narrower: récipient pour la préparation des aliments
broader: objet civil domestique
created: 2013-12-05T00:00:00+01:00
definition: Récipient ou ustensile destiné à la préparation, à la cuisson, à la conservation, à la consommation ou au service des aliments et des boissons.
status: 1

présentoir
type: Concept
modified: 2014-12-05T15:52:07+01:00
in scheme: Thésaurus de la désignation des objets mobiliers
broader: accessoire du service
created: 2012-05-16T00:00:00+02:00
related: soupière
definition: Support pour présenter des objets ou des aliments ou encore servant de décor ou de surtout. Il se présente sous forme de socle, de plat ou de plateau.
TermeAssocie: soupière
status: 1
broad match: http://data.bnf.fr/ark:/12148/cb155053551

porte-serviette
type: SimpleNonPreferredTerm
modified: 2014-10-16T15:02:30+02:00
created: 2014-01-15T14:54:24+01:00
status: 1

accessoire du service
type: PreferredTerm
modified: 2014-10-16T15:02:30+02:00
created: 2014-01-15T14:54:24+01:00
status: 1

brosse à miettes
type: SimpleNonPreferredTerm
modified: 2014-10-16T15:02:30+02:00
created: 2014-01-15T14:54:24+01:00
status: 1

aquamanile
type: Concept
modified: 2014-12-05T15:42:31+01:00
in scheme: Thésaurus de la désignation des objets mobiliers
preferred label: aquamaniles @en-us
broader: accessoire du service
alternative label: puisette
created: 2013-02-12T00:00:00+01:00
related: aiguière
related: T69-1360
definition: Récipient à eau, en bronze ou en laiton, servant aux ablutions des mains, empruntant souvent une forme animale ou humaine, sur pieds ou non, muni d'une anse et d'un goulot latéral ou d'un orifice d'évacuation.
TermeAssocie: aiguière
TermeAssocie: T69-1360
status: 1

rond de serviette
type: SimpleNonPreferredTerm
modified: 2014-10-16T15:02:30+02:00
created: 2014-01-15T14:54:24+01:00
status: 1

cale-assiette
type: SimpleNonPreferredTerm
modified: 2014-10-16T15:02:30+02:00
created: 2014-01-15T14:54:24+01:00
status: 1

rince-bouche
type: SimpleNonPreferredTerm
modified: 2014-10-16T15:02:30+02:00
created: 2014-01-15T14:54:24+01:00
status: 1

coulant de serviette
type: SimpleNonPreferredTerm
modified: 2014-10-16T15:02:30+02:00
created: 2014-01-15T14:54:24+01:00
status: 1

bassin de table
type: Concept
modified: 2014-10-16T15:04:59+02:00
in scheme: Thésaurus de la désignation des objets mobiliers
broader: accessoire du service
created: 2012-05-16T00:00:00+02:00
related: objet lié à l'ablution, à l'aspersion et à l'encensement
related: aiguière
related: gémellions
related: bassin à ablutions
definition: Récipient circulaire plus ou moins profond, utilisé pour le lavage des mains avant et après les repas. Il accompagne l'aiguière, à laquelle il est assorti.
TermeAssocie: objet lié à l'ablution, à l'aspersion et à l'encensement
TermeAssocie: aiguière
TermeAssocie: gémellions
TermeAssocie: bassin à ablutions
status: 1
broad match: http://vocab.getty.edu/aat/300045614
broad match: http://data.bnf.fr/ark:/12148/cb11978277c

porte-bouteilles
type: Concept
modified: 2014-12-05T15:50:26+01:00
in scheme: Thésaurus de la désignation des objets mobiliers
preferred label: bottle cases @en-us
broader: accessoire du service
alternative label: panier à bouteilles
created: 2012-05-16T00:00:00+02:00
definition: Récipient utilisé pour transporter des bouteilles ; il comporte un fond plat, des compartiments adaptés et une anse sur le dessus.
status: 1
broad match: http://data.bnf.fr/ark:/12148/cb11965899d

cadenas de table
type: SimpleNonPreferredTerm
modified: 2014-10-16T15:02:30+02:00
created: 2014-01-15T14:54:24+01:00
status: 1

plateau
type: Concept
modified: 2014-12-05T15:49:40+01:00
in scheme: Thésaurus de la désignation des objets mobiliers
preferred label: trays @en-us
broader: accessoire du service
alternative label: plateau pour pots à crème
alternative label: plateau pour tasses à glace
alternative label: plateau pour pots à jus
alternative label: plateau porte-verres
created: 2012-05-16T00:00:00+02:00
related: verre d'eau
related: assiette montée
related: pot à crème
related: tasse à glace
definition: Support comportant généralement un fond plat ou compartimenté et un rebord, parfois un ou plusieurs pieds et des éléments de prise, sur lequel on transporte et présente des aliments ou des boissons, des instruments, ou encore des récipients auxquels il est souvent assorti et qui forment avec lui un service.
TermeAssocie: verre d'eau
TermeAssocie: assiette montée
TermeAssocie: pot à crème
TermeAssocie: tasse à glace
status: 1

rafraîchissoir à verre
type: Concept
modified: 2014-12-05T15:54:35+01:00
in scheme: Thésaurus de la désignation des objets mobiliers
preferred label: wine-glass coolers @en-us
broader: accessoire du service
alternative label: seau à verres
alternative label: rafraîchissoir à verres
created: 2012-05-16T00:00:00+02:00
definition: Rafraîchissoir à fond plat ou arrondi, sur pied bas ou non et dont le bord supérieur comporte une ou plusieurs encoches servant à caler la jambe du ou des verres qui y trempent. Le rafraîchissoir à verre unique se différencie du rafraîchissoir à bouteille par la présence d'une encoche sur le bord. Il peut faire partie d'un surtout.
status: 1
broad match: http://data.bnf.fr/ark:/12148/cb144303016

rince-doigts
type: SimpleNonPreferredTerm
modified: 2014-10-16T15:02:30+02:00
created: 2014-01-15T14:54:24+01:00
status: 1

porte-cure-dents
type: SimpleNonPreferredTerm
modified: 2014-10-16T15:02:30+02:00
created: 2014-01-15T14:54:24+01:00
status: 1

dessous-de-carafe
type: Concept
modified: 2014-10-16T15:07:52+02:00
in scheme: Thésaurus de la désignation des objets mobiliers
preferred label: coasters (containers) @en-us
broader: accessoire du service
alternative label: dessous-de-bouteille
created: 2012-05-16T00:00:00+02:00
definition: Plaque généralement circulaire, que l'on place sous une bouteille ou une carafe pour protéger la nappe. Le dessous de carafe, est souvent muni d'un haut rebord vertical.
status: 1

ramasse-couverts
type: Concept
modified: 2014-10-16T15:19:02+02:00
in scheme: Thésaurus de la désignation des objets mobiliers
broader: accessoire du service
alternative label: corbeille à couverts
created: 2012-05-16T00:00:00+02:00
definition: Récipient en métal, où l'on place les couverts sales.
status: 1
broad match: http://vocab.getty.edu/aat/300043071
broad match: http://data.bnf.fr/ark:/12148/cb122111177

panier à verres
type: SimpleNonPreferredTerm
modified: 2014-10-16T15:02:30+02:00
created: 2014-01-15T14:54:24+01:00
status: 1

sonnette de table
type: Concept
modified: 2014-10-16T15:21:33+02:00
in scheme: Thésaurus de la désignation des objets mobiliers
broader: accessoire du service
created: 2013-01-15T00:00:00+01:00
definition: Instrument, le plus souvent en forme de cloche, servant à appeler les domestiques et le personnel hôtelier.
status: 1
broad match: http://vocab.getty.edu/aat/300041884

harpe à pédales
type: Concept
modified: 2014-10-10T12:58:32+02:00
in scheme: Thésaurus de la désignation des objets mobiliers
preferred label: pedal harps @en-us
broader: harpe
created: 2012-05-16T00:00:00+02:00
definition: Instrument disposant d'un mécanisme (placé dans la console), à crochets ou fourchettes, reliant les pédales aux cordes, qui agit sur celles-ci pour en modifier la longueur et jouer ainsi des altérations. Les sept pédales peuvent être à simple mouvement (une seule position) ou à double mouvement (trois positions).
status: 1
broad match: cb16682203r

harpe
type: Concept
modified: 2014-12-15T11:49:34+01:00
in scheme: Thésaurus de la désignation des objets mobiliers
preferred label: harps (chordophones) @en-us
narrower: harpe à pédales
narrower: harpe chromatique
broader: cordophone composite
alternative label: harpe triangulaire
alternative label: harpe arquée
alternative label: harpe ditale
alternative label: harpe portative
created: 2012-05-16T00:00:00+02:00
definition: Terme générique désignant un groupe d'instruments dans lesquels le plan des cordes est perpendiculaire à celui de la caisse de résonance. De forme triangulaire, la harpe est constituée d'une caisse de résonance, d'une console (élément qui reçoit les chevilles et le mécanisme) et de cordes. Le plus souvent, la harpe est fermée par un quatrième élément : une colonne reliant la console au bas de la caisse de résonance.
status: 1

harpe à pédales
type: PreferredTerm
modified: 2014-10-10T12:58:32+02:00
created: 2014-01-15T14:54:24+01:00
status: 1

lampe du Lucernaire
type: Concept
modified: 2014-01-10T00:00:00+01:00
in scheme: Thésaurus de la désignation des objets mobiliers
broader: objet du culte orthodoxe
created: 2012-05-16T00:00:00+02:00
definition: Cercle de lumière formé de bougies ou électrique, placé au centre de la nef et qui s'allume à certains moments de l'office. Les chants du Lucernaire se déroulent pendant les vêpres.
status: 1

lampe du Lucernaire
type: PreferredTerm
modified: 2014-01-10T00:00:00+01:00
created: 2014-01-15T14:54:24+01:00
status: 1

croix d'épiphanie
type: Concept
modified: 2014-01-10T00:00:00+01:00
in scheme: Thésaurus de la désignation des objets mobiliers
broader: objet du culte orthodoxe
created: 2012-05-16T00:00:00+02:00
definition: Croix mobile sur pied, servant à la bénédiction des eaux (le Jeudi saint), à l'élévation de la croix (le Vendredi saint) et pour la bénédiction dans les demeures particulières.
status: 1

croix d'épiphanie
type: PreferredTerm
modified: 2014-01-10T00:00:00+01:00
created: 2014-01-15T14:54:24+01:00
status: 1

porte-cierges votif
type: Concept
modified: 2014-12-02T10:17:51+01:00
in scheme: Thésaurus de la désignation des objets mobiliers
preferred label: portaceri votivo @it
preferred label: votive candle racks @en-us
preferred label: suporte de velas votivas @pt
broader: meuble lié à la procession et à la dévotion
alternative label: porte-cierges
created: 2012-05-16T00:00:00+02:00
related: lampion votif
definition: Meuble de formes diverses, souvent en fer, composé d'un ou plusieurs plateaux superposés ou de barres étagées comportant des supports ou des broches destinés à porter des cierges ou des lampions votifs. Le porte-cierges votifs est généralement placé en dessous ou à proximité d'une représentation religieuse particulièrement honorée.
TermeAssocie: lampion votif
status: 1
broad match: http://data.bnf.fr/ark:/12148/cb119367105

porte-cierges
type: SimpleNonPreferredTerm
modified: 2014-12-02T10:17:51+01:00
created: 2014-01-15T14:54:24+01:00
status: 1

porte-cierges votif
type: PreferredTerm
modified: 2014-12-02T10:17:51+01:00
created: 2014-01-15T14:54:24+01:00
status: 1

lampion votif
type: Concept
modified: 2014-11-26T16:18:05+01:00
in scheme: Thésaurus de la désignation des objets mobiliers
preferred label: lumino votivo @it
preferred label: votive lights @en-us
preferred label: lamparina votiva @pt
broader: objet de dévotion
alternative label: lampe de dévotion
alternative label: veilleuse votive
created: 2012-05-16T00:00:00+02:00
related: porte-cierges votif
definition: Courte bougie, généralement dans un godet souvent de couleur rouge, bleue ou blanche. Posé sur un porte-cierges votif, il est allumé devant des images du Christ, de la Vierge, d'un saint ou devant des reliques comme signe tangible d'une prière ou comme ex-voto.
TermeAssocie: porte-cierges votif
status: 1

wagonnet à benne
type: Concept
modified: 2014-12-18T10:31:16+01:00
in scheme: Thésaurus de la désignation des objets mobiliers
preferred label: dump cars @en-us
broader: matériel remorqué pour le transport ferroviaire des marchandises
created: 2013-11-04T00:00:00+01:00
definition: Petit wagon à voie étroite, destiné au transport des matériaux dans les mines, les usines, les chantiers. La benne est le plus souvent basculante afin de faciliter le déchargement.
status: 1

wagonnet à benne
type: PreferredTerm
modified: 2014-12-18T10:31:16+01:00
created: 2014-01-15T14:54:24+01:00
status: 1

bureau à gradin
type: Concept
modified: 2014-12-05T13:51:41+01:00
in scheme: Thésaurus de la désignation des objets mobiliers
preferred label: bureaux à gradin @en-us
broader: bureau
created: 2012-05-16T00:00:00+02:00
definition: Bureau surmonté d'un gradin en partie postérieure ou latérale du plateau.
status: 1
broad match: cb13163042n

bureau
type: Concept
modified: 2014-12-05T13:56:46+01:00
in scheme: Thésaurus de la désignation des objets mobiliers
preferred label: desks @en-us
narrower: bureau à gradin
broader: table pour le bureau ou les loisirs
created: 2012-05-16T00:00:00+02:00
related: secrétaire
definition: Table dont le dessus est généralement couvert de drap de velours ou de cuir, qui sert à écrire et peut être utilisée simultanément par plusieurs personnes. Le bureau peut comporter des tiroirs et des tablettes coulissantes dans la ceinture, et éventuellement des caissons latéraux constitués de tiroirs supplémentaires (par rapport à ceux de la ceinture).
TermeAssocie: secrétaire
status: 1

bureau à gradin
type: PreferredTerm
modified: 2014-12-05T13:51:41+01:00
created: 2014-01-15T14:54:24+01:00
status: 1

récipient pour la toilette
type: Concept
modified: 2014-10-17T15:03:27+02:00
in scheme: Thésaurus de la désignation des objets mobiliers
preferred label: containers for personal grooming and hygiene @en-us
narrower: fontaine de toilette
narrower: crachoir
narrower: plat à barbe
narrower: pot de chambre
narrower: seau de toilette
narrower: boîte à savon
narrower: flacon de toilette
narrower: bain d'oeil
narrower: boîte à rasoirs
narrower: broc à eau de toilette
narrower: porte-brosses de toilette
narrower: gantière
narrower: bain de bras
narrower: cuvette à laver
narrower: boîte de toilette
narrower: bassin de fontaine
narrower: pot de toilette
narrower: pot de siège d'aisances
narrower: boîte à éponge
broader: objet pour la toilette
alternative label: coquille de bain
alternative label: bain de pieds
alternative label: bain de jambe
created: 2012-05-16T00:00:00+02:00
definition: Tout type de contenant utilisé pour la toilette et les soins du corps. On appelle « toilette » un ensemble de boîtes, de flacons et de pots de toilette.
status: 1

fontaine de toilette
type: Concept
modified: 2014-12-10T16:51:13+01:00
in scheme: Thésaurus de la désignation des objets mobiliers
broader: récipient pour la toilette
created: 2012-05-16T00:00:00+02:00
related: porte-fontaine lavabo
definition: Ensemble en métal ou en céramique constitué d’un bassin de fontaine et d'un réservoir à eau muni d’un couvercle et d'un ou plusieurs robinets.
TermeAssocie: porte-fontaine lavabo
status: 1
broad match: http://data.bnf.fr/ark:/12148/cb121299131

crachoir
type: Concept
modified: 2014-12-10T16:46:04+01:00
in scheme: Thésaurus de la désignation des objets mobiliers
preferred label: spittoons @en-us
broader: récipient pour la toilette
alternative label: bassin à cracher
alternative label: crachoir au sol
created: 2012-05-16T00:00:00+02:00
definition: Récipient en général circulaire, en métal ou en céramique, utilisé pour recevoir les crachats. A fond plat, couvert ou non, il comporte soit une large collerette fixe ou mobile, soit une fente ou des petits trous au centre du couvercle en forme de large entonnoir fixe ou mobile ; le crachoir est vidé soit par l'ouverture du dessus, soit par une ouverture latérale, soit encore par un tiroir placé au-dessous. Le crachoir peut comporter une ou deux anses ou encore un manche creux fermé par un bouchon et servant d'orifice d'évacuation ; il peut être rempli de sciure.
status: 1
broad match: http://data.bnf.fr/ark:/12148/cb121299131

plat à barbe
type: Concept
modified: 2014-12-10T16:54:15+01:00
in scheme: Thésaurus de la désignation des objets mobiliers
preferred label: shaving basins @en-us
broader: récipient pour la toilette
alternative label: bassin à barbe
alternative label: assiette à barbe
created: 2012-05-16T00:00:00+02:00
related: table-lavabo
definition: Bassin réservé au rasage de la barbe. A large marli relevé vers l'extérieur, il comporte une ou deux échancrures arrondies sur le bord. Une cavité sur le marli sert à faire mousser le savon. Il est fréquemment accompagné d'un pot à eau de toilette et peut faire partie d’une « toilette d’homme » (parfois complétée d’un rasoir et d’un bol à savon à barbe).
TermeAssocie: table-lavabo
status: 1
broad match: http://data.bnf.fr/ark:/12148/cb120982343

pot de chambre
type: Concept
modified: 2014-12-10T16:56:48+01:00
in scheme: Thésaurus de la désignation des objets mobiliers
preferred label: chamber pots @en-us
broader: récipient pour la toilette
alternative label: urinal
alternative label: seau d'aisances
alternative label: vase de nuit
alternative label: seau d'hygiène
alternative label: bourdaloue
created: 2012-05-16T00:00:00+02:00
related: bassin de lit
related: table de nuit
definition: Récipient généralement non couvert, servant à recueillir les excréments. A fond plat ou sur un pied bas, il est muni d'une anse verticale latérale et son bord supérieur forme un large rebord horizontal. Le bourdaloue est un pot de chambre, en forme de haricot, de moindres dimensions, utilisé fréquemment en voyage. L'urinal est un réceptacle fermé, muni d'un large goulot latéral oblique, permettant à un homme d'uriner couché.
TermeAssocie: bassin de lit
TermeAssocie: table de nuit
status: 1

seau de toilette
type: Concept
modified: 2014-10-17T15:26:01+02:00
in scheme: Thésaurus de la désignation des objets mobiliers
broader: récipient pour la toilette
created: 2012-05-16T00:00:00+02:00
related: bidet
definition: Récipient en céramique servant, comme le bidet, à la toilette intime. Posé sur un pied bas, légèrement évasé vers le haut, muni de deux anses latérales et d'un couvercle plat, il est placé dans une monture en bois adaptée sur pieds.
TermeAssocie: bidet
status: 1

récipient pour la toilette
type: PreferredTerm
modified: 2014-10-17T15:03:27+02:00
created: 2014-01-15T14:54:24+01:00
status: 1

boîte à savon
type: Concept
modified: 2014-12-10T16:42:25+01:00
in scheme: Thésaurus de la désignation des objets mobiliers
preferred label: soap boxes @en-us
broader: récipient pour la toilette
alternative label: boule à savon
alternative label: boîte à savonnette
alternative label: grille à savon
alternative label: boîte à savon à barbe
alternative label: porte-savon
alternative label: bol à savon à barbe
created: 2012-05-16T00:00:00+02:00
definition: Boîte, parfois réceptacle ajouré non couvert, de même forme que la boîte à éponge à laquelle elle est assortie et servant à ranger un savon.
status: 1

flacon de toilette
type: Concept
modified: 2014-12-10T16:49:13+01:00
in scheme: Thésaurus de la désignation des objets mobiliers
broader: récipient pour la toilette
alternative label: balsamaire
alternative label: flacon à eau de mélisse
alternative label: flacon à sels
alternative label: flacon à vinaigre de toilette
alternative label: flacon de senteur
alternative label: vaporisateur de toilette
alternative label: fontaine à parfum
alternative label: flacon à parfum
created: 2012-05-16T00:00:00+02:00
scope note: Indiquer dans le champ PDEN la destination du flacon. Les flacons de toilette font partie de la toilette : le préciser dans le champ PDEN. Utiliser la double dénomination dans le champ DENO si les flacons sont posés sur un plateau assorti.
definition: Bouteille, éventuellement fontaine, en métal, céramique ou verre, fermé hermétiquement et contenant des liquides parfumés. Elle peut être munie d'un second bouchon doublant extérieurement le premier, pour empêcher l'évaporation du parfum. Les flacons de toilette peuvent être placés sur un plateau ou un support dans lequel sont ménagés des réceptacles adaptés.
status: 1
narrow match: cb11997536s

objet pour la toilette
type: Concept
modified: 2014-10-17T14:28:29+02:00
in scheme: Thésaurus de la désignation des objets mobiliers
preferred label: equipment for personal use : grooming, hygiene and health care @en-us
narrower: récipient pour la toilette
narrower: instrument ou accessoire pour la toilette
broader: objet civil domestique
created: 2013-12-05T00:00:00+01:00
definition: Récipient ou ustensile servant pour l’hygiène et les soins du corps.
status: 1

bain d'oeil
type: Concept
modified: 2015-03-09T10:52:28+01:00
in scheme: Thésaurus de la désignation des objets mobiliers
preferred label: eyecups (health care apparatuses) @en-us
broader: récipient pour la toilette
alternative label: œillère
alternative label: bain d'œil
created: 2012-05-16T00:00:00+02:00
status: 1

boîte à rasoirs
type: Concept
modified: 2014-12-10T16:41:31+01:00
in scheme: Thésaurus de la désignation des objets mobiliers
broader: récipient pour la toilette
alternative label: trousse à rasoirs
created: 2012-05-16T00:00:00+02:00
related: rasoir
definition: Boîte allongée, parfois trousse, comportant des cloisons entre lesquelles on range des rasoirs.
TermeAssocie: rasoir
status: 1
broad match: http://vocab.getty.edu/aat/300045643

broc à eau de toilette
type: Concept
modified: 2014-12-10T16:45:08+01:00
in scheme: Thésaurus de la désignation des objets mobiliers
broader: récipient pour la toilette
alternative label: pot à eau de toilette
created: 2012-05-16T00:00:00+02:00
definition: Grand broc en métal ou en céramique, non couvert, à fond plat et large bec, qui sert à transporter l'eau pour la toilette et à la conserver, posé au sol. Le pot à eau de toilette, plus petit, est associé à la cuvette à laver. Certains disposent d’un couvercle et sont destinés à contenir de l’eau chaude.
status: 1
broad match: http://data.bnf.fr/ark:/12148/cb121299131

porte-brosses de toilette
type: Concept
modified: 2014-10-17T15:21:45+02:00
in scheme: Thésaurus de la désignation des objets mobiliers
broader: récipient pour la toilette
alternative label: casier à peignes
alternative label: porte-brosses à dents
alternative label: plateau à brosses
alternative label: porte-brosses à cheveux
alternative label: porte-brosses
alternative label: porte-brosses à habits
alternative label: porte-peignes
created: 2012-05-16T00:00:00+02:00
related: brosse de toilette
definition: Récipient, servant à ranger verticalement les brosses de toilette. Il présente un ou deux réceptacles semi-circulaires fixés sur une plaque d'applique accrochée au mur. Le porte-brosse peut également prendre la forme d’un plateau.
TermeAssocie: brosse de toilette
status: 1
narrow match: http://vocab.getty.edu/aat/300079058
broad match: http://data.bnf.fr/ark:/12148/cb121299131
broad match: Brosse (outil)

bain de jambe
type: SimpleNonPreferredTerm
modified: 2014-10-17T15:03:27+02:00
created: 2014-01-15T14:54:24+01:00
status: 1

gantière
type: Concept
modified: 2014-12-10T16:52:40+01:00
in scheme: Thésaurus de la désignation des objets mobiliers
broader: récipient pour la toilette
alternative label: plateau à gants
alternative label: boîte à gants
created: 2012-05-16T00:00:00+02:00
definition: Plateau ovale, éventuellement corbeille ou boîte, plus ou moins creux, généralement sur un pied bas, servant à présenter les gants ou le bouquet. Les gantières sont disposées par paire et font généralement partie de la toilette.
status: 1
broad match: http://data.bnf.fr/ark:/12148/cb119591428
broad match: Gant

bain de pieds
type: SimpleNonPreferredTerm
modified: 2014-10-17T15:03:27+02:00
created: 2014-01-15T14:54:24+01:00
status: 1

bain de bras
type: Concept
modified: 2014-10-17T15:05:56+02:00
in scheme: Thésaurus de la désignation des objets mobiliers
broader: récipient pour la toilette
created: 2012-05-16T00:00:00+02:00
definition: Cuvette ovale étroite, à hauts bords, dont les petits côtés sont inclinés dans le même sens et servent à plonger l'avant-bras.
status: 1
broad match: http://vocab.getty.edu/aat/300198746

cuvette à laver
type: Concept
modified: 2014-12-10T16:48:10+01:00
in scheme: Thésaurus de la désignation des objets mobiliers
preferred label: washbowls @en-us
broader: récipient pour la toilette
created: 2012-05-16T00:00:00+02:00
scope note: Employer la double dénomination dans le champ DENO quand la cuvette est assortie au pot à eau
related: table-lavabo
definition: Grand récipient pour la toilette, en métal, verre ou céramique, généralement circulaire ou ovale, à fond plat ou sur un pied très bas, à bords évasés ou droits. La cuvette à laver est généralement complétée par un broc à eau de toilette assorti ou elle est isolée, placée sur un support ou encastrée dans un meuble de toilette.
TermeAssocie: table-lavabo
status: 1
broad match: http://data.bnf.fr/ark:/12148/cb121299131

boîte de toilette
type: Concept
modified: 2014-12-10T16:43:16+01:00
in scheme: Thésaurus de la désignation des objets mobiliers
broader: récipient pour la toilette
alternative label: boîte à mouches
alternative label: boîte à chapeaux
alternative label: boîte à perruque
alternative label: carré de toilette
alternative label: boîte à brosse à dents
alternative label: boîte à brosse à cheveux
alternative label: boîte à brosses à cheveux
alternative label: boîte à brosses à dents
alternative label: boîte à racines
alternative label: boîte à coiffure
alternative label: boîte à peignes
alternative label: boîte à épingles de toilette
created: 2012-05-16T00:00:00+02:00
definition: Boîte, sans élément de prise, dont la dimension et l'aménagement intérieur sont adaptés au contenu (brosses à cheveux, mouches, perruques, etc.).
status: 1

coquille de bain
type: SimpleNonPreferredTerm
modified: 2014-10-17T15:03:27+02:00
created: 2014-01-15T14:54:24+01:00
status: 1

bassin de fontaine
type: Concept
modified: 2014-12-10T16:39:21+01:00
in scheme: Thésaurus de la désignation des objets mobiliers
preferred label: fountain basins @en-us
broader: récipient pour la toilette
alternative label: bassin à eaux sales
created: 2012-05-16T00:00:00+02:00
related: porte-fontaine lavabo
related: fontaine de sacristie
related: porte-fontaine à eau potable
definition: Récipient placé sous la fontaine, auquel il est assorti. Il peut être d’applique ; il est alors à dos plat et muni d'éléments d'accrochage.
TermeAssocie: porte-fontaine lavabo
TermeAssocie: fontaine de sacristie
TermeAssocie: porte-fontaine à eau potable
status: 1

pot de toilette
type: Concept
modified: 2014-12-10T17:00:54+01:00
in scheme: Thésaurus de la désignation des objets mobiliers
preferred label: cosmetic boxes @en-us
broader: récipient pour la toilette
alternative label: tasse de toilette
alternative label: boîte à fard
alternative label: poudrier de toilette
alternative label: boîte à poudre
alternative label: pot à pâte
alternative label: pot à fards
created: 2012-05-16T00:00:00+02:00
definition: Petit récipient contenant les poudres et les pommades de toilette. Il se présente comme un gobelet couvert muni ou non de deux anses latérales, ou comme une boîte cylindrique à fond plat et couvercle indépendant. Les pots de toilette sont soit en série de grandeurs décroissantes, soit par paire de taille identique, et placés sur un plateau ou une soucoupe assortis.
status: 1

pot de siège d'aisances
type: Concept
modified: 2014-12-10T16:58:05+01:00
in scheme: Thésaurus de la désignation des objets mobiliers
broader: récipient pour la toilette
created: 2012-05-16T00:00:00+02:00
related: siège d'aisances
definition: Récipient en céramique, cylindrique plus ou moins galbé, couvert ou non, de même fonction que le pot de chambre. Muni de deux éléments de prise latéraux, il est placé à l'intérieur d'un siège d'aisances.
TermeAssocie: siège d'aisances
status: 1
broad match: cb15008171k

boîte à éponge
type: Concept
modified: 2014-12-10T16:40:30+01:00
in scheme: Thésaurus de la désignation des objets mobiliers
preferred label: spongeboxes @en-us
broader: récipient pour la toilette
alternative label: boule à éponge à fard
alternative label: bol à éponge
alternative label: grille à éponge
alternative label: boule à éponge
created: 2012-05-16T00:00:00+02:00
definition: Boîte en céramique ou en métal, souvent ajourée, servant à ranger une éponge.
status: 1

matériel de transport ferroviaire
type: Concept
modified: 2014-12-18T11:35:15+01:00
in scheme: Thésaurus de la désignation des objets mobiliers
preferred label: rail guideway vehicles @en-us
narrower: élément de matériel de transport ferroviaire
narrower: matériel ferroviaire roulant
narrower: matériel de traction ferroviaire
broader: moyen de transport
created: 2013-11-04T00:00:00+01:00
definition: Véhicule ou matériel destiné au transport sur rail.
status: 1

matériel de transport ferroviaire
type: PreferredTerm
modified: 2014-12-18T11:35:15+01:00
created: 2014-01-15T14:54:24+01:00
status: 1

élément de matériel de transport ferroviaire
type: Concept
modified: 2014-12-17T17:11:30+01:00
in scheme: Thésaurus de la désignation des objets mobiliers
narrower: coupon de voie
broader: matériel de transport ferroviaire
alternative label: bogie
created: 2013-11-04T00:00:00+01:00
definition: Partie constitutive d'un équipement ferroviaire.
status: 1
broad match: cb13163072k
broad match: http://vocab.getty.edu/aat/300162982
broad match: Matériel roulant ferroviaire

matériel ferroviaire roulant
type: Concept
modified: 2014-12-18T11:34:43+01:00
in scheme: Thésaurus de la désignation des objets mobiliers
preferred label: railroad cars @en-us
narrower: matériel remorqué pour le transport ferroviaire des marchandises
narrower: véhicule ferroviaire spécialisé
narrower: matériel remorqué pour le transport ferroviaire des voyageurs
broader: matériel de transport ferroviaire
created: 2013-11-04T00:00:00+01:00
definition: Matériel ferroviaire remorqué pour le transport des voyageurs ou des marchandises.
status: 1

matériel de traction ferroviaire
type: Concept
modified: 2014-10-14T16:07:19+02:00
in scheme: Thésaurus de la désignation des objets mobiliers
narrower: locomotive
narrower: automoteur ferroviaire
broader: matériel de transport ferroviaire
created: 2013-11-04T00:00:00+01:00
definition: Matériel motorisé roulant sur voies ferrées.
status: 1
broad match: http://vocab.getty.edu/aat/300228410
broad match: cb13163072k
broad match: Matériel roulant ferroviaire

moyen de transport
type: Concept
modified: 2014-10-14T15:28:07+02:00
in scheme: Thésaurus de la désignation des objets mobiliers
preferred label: transportation vehicles @en-us
narrower: matériel de transport nautique
narrower: matériel de transport ferroviaire
narrower: matériel de transport aéronautique
narrower: matériel de transport terrestre
created: 2012-05-16T00:00:00+02:00
definition: Engin ou ses accessoires nécessaire au transport des matériels, des marchandises ou des personnes.
status: 1

outil servant à peindre
type: Concept
modified: 2014-01-10T00:00:00+01:00
in scheme: Thésaurus de la désignation des objets mobiliers
broader: outil
alternative label: guippon
alternative label: pinceau
alternative label: palette de peintre
created: 2013-12-16T00:00:00+01:00
status: 1

outil servant à peindre
type: PreferredTerm
modified: 2014-01-10T00:00:00+01:00
created: 2014-01-15T14:54:24+01:00
status: 1

pinceau
type: SimpleNonPreferredTerm
modified: 2014-01-10T00:00:00+01:00
created: 2014-01-15T14:54:24+01:00
status: 1

palette de peintre
type: SimpleNonPreferredTerm
modified: 2014-01-10T00:00:00+01:00
created: 2014-01-15T14:54:24+01:00
status: 1

guippon
type: SimpleNonPreferredTerm
modified: 2014-01-10T00:00:00+01:00
created: 2014-01-15T14:54:24+01:00
status: 1

chaussures d'enfant de choeur
type: Concept
modified: 2015-03-09T10:47:53+01:00
in scheme: Thésaurus de la désignation des objets mobiliers
preferred label: choirboy shoes @en-us
preferred label: scarpe del chierichetto @it
preferred label: sapatos dos meninos de coro @pt
broader: bas et chaussures liturgiques
alternative label: chaussures d'enfant de chœur
created: 2012-05-16T00:00:00+02:00
related: calotte
TermeAssocie: calotte
status: 1
broad match: http://vocab.getty.edu/aat/300046065

calotte
type: Concept
modified: 2014-12-03T12:52:27+01:00
in scheme: Thésaurus de la désignation des objets mobiliers
preferred label: zucchetto @it
preferred label: skullcaps (caps) @en-us
preferred label: solidéu @pt
broader: coiffure liturgique
alternative label: mitelle
alternative label: bonnet d'enfant de chœur
alternative label: camauro
created: 2012-05-16T00:00:00+02:00
related: chaussures d'enfant de choeur
related: soutane
definition: Coiffure ronde qui couvre le sommet du crâne ou légèrement plus grande, portée pendant presque tout l'office par l'ensemble des clercs. La coiffure réservée au pape est appelée camauro.
TermeAssocie: chaussures d'enfant de choeur
TermeAssocie: soutane
status: 1

chaussures d'enfant de chœur
type: SimpleNonPreferredTerm
modified: 2015-03-09T10:47:53+01:00
created: 2014-01-15T14:54:24+01:00
status: 1

dominical
type: Concept
modified: 2014-12-02T16:35:15+01:00
in scheme: Thésaurus de la désignation des objets mobiliers
preferred label: dominicals @en-us
preferred label: domenicale (velo) @it
broader: linge ou garniture liés à l'Eucharistie
created: 2012-05-16T00:00:00+02:00
definition: Linge de couleur blanche, avec lequel les fidèles se couvraient la main droite pour recevoir l'Eucharistie.
status: 1
broad match: cb11936841q
broad match: Catégorie:Linge liturgique

linge ou garniture liés à l'Eucharistie
type: Concept
modified: 2014-12-02T16:13:54+01:00
in scheme: Thésaurus de la désignation des objets mobiliers
preferred label: linen and ornaments for the Eucharist @en-us
preferred label: lini e coperture per l'Eucaristia @it
preferred label: linhos e guarnições relacionados com e eucaristia @pt
narrower: dominical
narrower: housse d'ostensoir
narrower: pale
narrower: housse de calice
narrower: voile de calice
narrower: purificatoire
narrower: nappe de communion
narrower: pavillon de ciboire
narrower: bourse du viatique
narrower: conopée
narrower: voile d'ostensoir
narrower: voile d'exposition du saint sacrement
narrower: corporal
narrower: T69-2214
broader: linge ou garniture du culte catholique
created: 2012-05-16T00:00:00+02:00
definition: Pièce textile, principalement à l’usage de l’officiant, liée à la préparation et à l’administration du sacrement de l’Eucharistie.
status: 1

dominical
type: PreferredTerm
modified: 2014-12-02T16:35:15+01:00
created: 2014-01-15T14:54:24+01:00
status: 1

machine à dépolir
type: Concept
modified: 2015-10-14T16:59:11+02:00
in scheme: Thésaurus de la désignation des objets mobiliers
broader: machine à surfacer
alternative label: sableuse
created: 2012-05-16T00:00:00+02:00
definition: Machine à surfacer un produit (verre, cristal, métal, etc.) en lui ôtant son poli, sa transparence ou son éclat.
status: 1
broad match: Sablage

sableuse
type: SimpleNonPreferredTerm
modified: 2015-10-14T16:59:11+02:00
created: 2014-01-15T14:54:24+01:00
status: 1

machine à dépolir
type: PreferredTerm
modified: 2015-10-14T16:59:11+02:00
created: 2014-01-15T14:54:24+01:00
status: 1

machine à surfacer
type: Concept
modified: 2015-10-14T16:51:57+02:00
in scheme: Thésaurus de la désignation des objets mobiliers
narrower: machine à dépolir
narrower: machine à lisser
narrower: machine à pelucher
narrower: T69-5807
narrower: T69-5815
narrower: T69-5799
broader: machine à donner un aspect
alternative label: surfaceuse
created: 2012-05-16T00:00:00+02:00
definition: Machine à donner un aspect à un matériau ou à un produit, en modifiant son apparence naturelle ou celle obtenue lors de sa fabrication.
status: 1

inhalateur
type: Concept
modified: 2014-01-10T00:00:00+01:00
in scheme: Thésaurus de la désignation des objets mobiliers
broader: instrument ou matériel de pharmacie
created: 2013-12-10T00:00:00+01:00
status: 1

instrument ou matériel de pharmacie
type: Concept
modified: 2014-01-10T00:00:00+01:00
in scheme: Thésaurus de la désignation des objets mobiliers
narrower: inhalateur
narrower: pot à pharmacie
narrower: pot à sangsues
narrower: mâche-bouchon
narrower: cuiller à médicament
narrower: boîte à pansements
broader: matériel médical
alternative label: pansement
alternative label: filtre de pharmacie
alternative label: bandage
created: 2013-12-10T00:00:00+01:00
status: 1

inhalateur
type: PreferredTerm
modified: 2014-01-10T00:00:00+01:00
created: 2014-01-15T14:54:24+01:00
status: 1

pelle d'âtre
type: Concept
modified: 2014-12-05T14:44:45+01:00
in scheme: Thésaurus de la désignation des objets mobiliers
preferred label: fire shovels @en-us
broader: objet d'âtre
alternative label: palette à braises
alternative label: pelle de foyer
alternative label: pelle à feu
alternative label: palette à cendres
created: 2012-05-16T00:00:00+02:00
definition: Pelle en métal, à long manche, à spatule généralement pleine, servant à ramasser les braises et à les dégager de la cendre. Elle est assortie aux pincettes et au tisonnier.
status: 1
broad match: Fire iron

palette à cendres
type: SimpleNonPreferredTerm
modified: 2014-12-05T14:44:45+01:00
created: 2014-01-15T14:54:24+01:00
status: 1

pelle à feu
type: SimpleNonPreferredTerm
modified: 2014-12-05T14:44:45+01:00
created: 2014-01-15T14:54:24+01:00
status: 1

palette à braises
type: SimpleNonPreferredTerm
modified: 2014-12-05T14:44:45+01:00
created: 2014-01-15T14:54:24+01:00
status: 1

pelle de foyer
type: SimpleNonPreferredTerm
modified: 2014-12-05T14:44:45+01:00
created: 2014-01-15T14:54:24+01:00
status: 1

pelle d'âtre
type: PreferredTerm
modified: 2014-12-05T14:44:45+01:00
created: 2014-01-15T14:54:24+01:00
status: 1

architecture légère ou démontable
type: Concept
modified: 2015-02-24T10:45:56+01:00
in scheme: Thésaurus de la désignation des objets mobiliers
preferred label: portable buildings @en-us
broader: mobilier monumental ou de l'espace extérieur
alternative label: cabane de jardin
alternative label: manège forain
alternative label: cabane de plage
alternative label: attraction foraine
alternative label: baraque de camp d'internement
alternative label: tente
alternative label: baraque de chantier
created: 2012-06-11T00:00:00+02:00
definition: Abri, équipement ou construction dépourvu de fondations et dont la durée de vie est limitée. Il peut être éphémère, démontable, mobile etc.
status: 1

baraque de camp d'internement
type: SimpleNonPreferredTerm
modified: 2015-02-24T10:45:56+01:00
created: 2014-01-15T14:54:24+01:00
status: 1

attraction foraine
type: SimpleNonPreferredTerm
modified: 2015-02-24T10:45:56+01:00
created: 2014-01-15T14:54:24+01:00
status: 1

mobilier monumental ou de l'espace extérieur
type: Concept
modified: 2014-10-15T15:57:43+02:00
in scheme: Thésaurus de la désignation des objets mobiliers
preferred label: outdoor furniture @en-us
narrower: édicule et mobilier de jardin
narrower: architecture légère ou démontable
narrower: monument
narrower: ouvrage lié à l'alimentation en eau
narrower: édicule ou mobilier de l'espace public ou du génie civil
narrower: édicule religieux chrétien
created: 2012-05-16T00:00:00+02:00
definition: Mobilier implanté généralement dans un espace extérieur, public ou privé. Il peut s’agir de mobilier monumental, de mobilier commémoratif, de mobilier urbain, de mobilier de jardin, etc.
status: 1
broad match: cb13163003r
broad match: Mobilier

cabane de plage
type: SimpleNonPreferredTerm
modified: 2015-02-24T10:45:56+01:00
created: 2014-01-15T14:54:24+01:00
status: 1

architecture légère ou démontable
type: PreferredTerm
modified: 2015-02-24T10:45:56+01:00
created: 2014-01-15T14:54:24+01:00
status: 1

manège forain
type: SimpleNonPreferredTerm
modified: 2015-02-24T10:45:56+01:00
created: 2014-01-15T14:54:24+01:00
status: 1

baraque de chantier
type: SimpleNonPreferredTerm
modified: 2015-02-24T10:45:56+01:00
created: 2014-01-15T14:54:24+01:00
status: 1

cabane de jardin
type: SimpleNonPreferredTerm
modified: 2015-02-24T10:45:56+01:00
created: 2014-01-15T14:54:24+01:00
status: 1

tente
type: SimpleNonPreferredTerm
modified: 2015-02-24T10:45:56+01:00
created: 2014-01-15T14:54:24+01:00
status: 1

chalemie
type: Concept
modified: 2014-10-10T11:40:33+02:00
in scheme: Thésaurus de la désignation des objets mobiliers
preferred label: shawns @en-us
broader: aérophone à anche vibrante double
alternative label: chelemelle
alternative label: bombarde (instrument)
created: 2012-05-16T00:00:00+02:00
definition: Instrument de dimensions variées, ancêtre du hautbois, tourné dans une seule pièce avec une perce conique. La bombarde est une chalemie grave.
status: 1

chelemelle
type: SimpleNonPreferredTerm
modified: 2014-10-10T11:40:33+02:00
created: 2014-01-15T14:54:24+01:00
status: 1

aérophone à anche vibrante double
type: Concept
modified: 2014-10-10T11:39:16+02:00
in scheme: Thésaurus de la désignation des objets mobiliers
preferred label: reedpipes with double reed @en-us
narrower: chalemie
narrower: basson
narrower: hautbois
narrower: cornemuse
narrower: cromorne
broader: aérophone à anche
alternative label: sarrusophone
created: 2012-05-16T00:00:00+02:00
definition: Instrument à vent utilisant un système d'anche (en roseau ou matériau composite) où l'air met en vibration deux languettes battant l'une contre l'autre.
status: 1
broad match: http://data.bnf.fr/ark:/12148/cb16686981f

chalemie
type: PreferredTerm
modified: 2014-10-10T11:40:33+02:00
created: 2014-01-15T14:54:24+01:00
status: 1

bombarde (instrument)
type: SimpleNonPreferredTerm
modified: 2014-10-10T11:40:33+02:00
created: 2014-01-15T14:54:24+01:00
status: 1

tableau tissé
type: Concept
modified: 2014-12-03T16:40:09+01:00
in scheme: Thésaurus de la désignation des objets mobiliers
broader: tableau
created: 2012-05-16T00:00:00+02:00
related: pièce de tissu
definition: Œuvre constituée d'une pièce de tissu destinée à reproduire, dans le matériau et avec la technique qui lui sont propres, les effets du tableau de peinture.
TermeAssocie: pièce de tissu
status: 1
broad match: http://vocab.getty.edu/aat/300033618

pièce de tissu
type: Concept
modified: 2014-12-12T11:02:53+01:00
in scheme: Thésaurus de la désignation des objets mobiliers
preferred label: cloth @en-us
broader: élément textile ou de garniture
alternative label: étoffe
alternative label: morceau de tissu
created: 2012-05-16T00:00:00+02:00
related: tableau tissé
definition: Pièce de tissu, de forme et de taille variables, dont la mise en œuvre est inconnue ou incompréhensible.
TermeAssocie: tableau tissé
status: 1
broad match: cb11933606x

tableau tissé
type: PreferredTerm
modified: 2014-12-03T16:40:09+01:00
created: 2014-01-15T14:54:24+01:00
status: 1

machine à dessouder
type: Concept
modified: 2014-01-10T00:00:00+01:00
in scheme: Thésaurus de la désignation des objets mobiliers
broader: machine à désassembler
created: 2012-05-16T00:00:00+02:00
definition: Machine à détacher des éléments soudés.
status: 1

machine à désassembler
type: Concept
modified: 2014-01-10T00:00:00+01:00
in scheme: Thésaurus de la désignation des objets mobiliers
narrower: machine à dessouder
narrower: machine à déboulonner
broader: machine à dissocier
created: 2012-05-16T00:00:00+02:00
definition: Machine à dissocier des matériaux ou des produits en en retirant le lien qui les solidarise.
status: 1

machine à dessouder
type: PreferredTerm
modified: 2014-01-10T00:00:00+01:00
created: 2014-01-15T14:54:24+01:00
status: 1

cache-radiateur
type: Concept
modified: 2014-12-04T15:13:29+01:00
in scheme: Thésaurus de la désignation des objets mobiliers
preferred label: radiator enclosures @en-us
broader: meuble de protection
created: 2012-05-16T00:00:00+02:00
definition: Paroi ajourée servant à protéger et à camoufler un radiateur fixe.
status: 1
broad match: http://data.bnf.fr/ark:/12148/cb124263046

meuble de protection
type: Concept
modified: 2014-10-10T17:03:34+02:00
in scheme: Thésaurus de la désignation des objets mobiliers
narrower: cache-radiateur
narrower: barrière de lit
narrower: écran pare-étincelles
narrower: écran à feu
narrower: devant de cheminée
narrower: parc d'enfant
narrower: clôture de lit
narrower: parasol
narrower: paravent
broader: meuble domestique
created: 2012-05-16T00:00:00+02:00
definition: Structure ou élément de séparation, de protection ou de camouflage.
status: 1
broad match: http://vocab.getty.edu/aat/300037680
broad match: Meuble

cache-radiateur
type: PreferredTerm
modified: 2014-12-04T15:13:29+01:00
created: 2014-01-15T14:54:24+01:00
status: 1

bouquet d'autel
type: PreferredTerm
modified: 2014-11-27T12:05:44+01:00
created: 2014-01-15T14:54:24+01:00
status: 1

table de décharge
type: Concept
modified: 2014-12-05T13:38:29+01:00
in scheme: Thésaurus de la désignation des objets mobiliers
preferred label: sideboard tables @en-us
broader: table pour l'alimentation
alternative label: table porte-gâteaux
alternative label: table servante
alternative label: desserte
created: 2012-05-16T00:00:00+02:00
related: table d'applique
definition: Table à un ou plusieurs plateaux d'entrejambe, servant à présenter, à préparer ou à desservir la vaisselle, les mets et les boissons.
TermeAssocie: table d'applique
status: 1
broad match: http://data.bnf.fr/ark:/12148/cb131630926

table porte-gâteaux
type: SimpleNonPreferredTerm
modified: 2014-12-05T13:38:29+01:00
created: 2014-01-15T14:54:24+01:00
status: 1

desserte
type: SimpleNonPreferredTerm
modified: 2014-12-05T13:38:29+01:00
created: 2014-01-15T14:54:24+01:00
status: 1

table pour l'alimentation
type: Concept
modified: 2014-10-14T12:33:58+02:00
in scheme: Thésaurus de la désignation des objets mobiliers
narrower: table de décharge
narrower: table de cuisine
narrower: table à manger
narrower: table rafraîchissoir
narrower: table garde-manger
narrower: table à déjeuner
narrower: table en cabaret
broader: table
alternative label: table susbout
alternative label: table porte-chaudrons
created: 2012-05-16T00:00:00+02:00
definition: Table servant à préparer, présenter, consommer ou conserver des aliments ou des boissons.
status: 1
broad match: http://vocab.getty.edu/aat/300039548

table d'applique
type: Concept
modified: 2014-12-05T13:32:45+01:00
in scheme: Thésaurus de la désignation des objets mobiliers
preferred label: console tables @en-us
broader: table
alternative label: console-table
created: 2012-07-17T00:00:00+02:00
related: table de décharge
definition: Table adossée au mur, fixée, indépendante ou éventuellement suspendue, parfois appelée console. Elle est monopode, bipode ou quadripode, à une ou plusieurs tablettes d’entrejambe. Généralement dépourvue de décor au revers, elle peut comporter un panneau de dos, éventuellement en glace.
TermeAssocie: table de décharge
status: 1
broad match: Table

table de décharge
type: PreferredTerm
modified: 2014-12-05T13:38:29+01:00
created: 2014-01-15T14:54:24+01:00
status: 1

table servante
type: SimpleNonPreferredTerm
modified: 2014-12-05T13:38:29+01:00
created: 2014-01-15T14:54:24+01:00
status: 1

machine à embouteiller
type: Concept
modified: 2015-10-14T15:59:55+02:00
in scheme: Thésaurus de la désignation des objets mobiliers
broader: machine à conditionner
created: 2012-05-16T00:00:00+02:00
definition: Machine à conditionner un produit dans une bouteille.
status: 1
broad match: cb12011474j

machine à embouteiller
type: PreferredTerm
modified: 2015-10-14T15:59:55+02:00
created: 2014-01-15T14:54:24+01:00
status: 1

machine à forger libre
type: Concept
modified: 2015-10-14T12:29:19+02:00
in scheme: Thésaurus de la désignation des objets mobiliers
broader: machine à modeler
alternative label: marteau-pilon
alternative label: presse à forger
created: 2012-05-16T00:00:00+02:00
definition: Machine à modeler un matériau ou un produit à l'aide d'une presse ou d'un marteau-pilon équipés d'un outillage adapté.
status: 1

presse à forger
type: SimpleNonPreferredTerm
modified: 2015-10-14T12:29:19+02:00
created: 2014-01-15T14:54:24+01:00
status: 1

machine à forger libre
type: PreferredTerm
modified: 2015-10-14T12:29:19+02:00
created: 2014-01-15T14:54:24+01:00
status: 1

machine à modeler
type: Concept
modified: 2015-10-14T11:53:40+02:00
in scheme: Thésaurus de la désignation des objets mobiliers
narrower: machine à forger libre
narrower: machine à allonger
narrower: machine à estamper
narrower: T69-5641
narrower: T69-5619
broader: machine à façonner
created: 2012-05-16T00:00:00+02:00
definition: Machine à façonner une masse solide ou pâteuse par déformation plastique sous contrainte, pour obtenir un produit de forme prédéfinie.
status: 1

marteau-pilon
type: SimpleNonPreferredTerm
modified: 2015-10-14T12:29:19+02:00
created: 2014-01-15T14:54:24+01:00
status: 1

plaque de prières
type: SimpleNonPreferredTerm
modified: 2014-01-10T00:00:00+01:00
created: 2014-01-15T14:54:24+01:00
status: 1

tableau de prières
type: PreferredTerm
modified: 2014-01-10T00:00:00+01:00
created: 2014-01-15T14:54:24+01:00
status: 1

objet lié à la prière
type: Concept
modified: 2014-01-10T00:00:00+01:00
in scheme: Thésaurus de la désignation des objets mobiliers
narrower: boîte à phylactères
narrower: étui pour versets de la Torah
narrower: tableau de prières
narrower: tableau pour indiquer l'est
broader: objet lié au culte domestique
created: 2012-05-16T00:00:00+02:00
status: 1

métier à ruban domestique
type: Concept
modified: 2014-10-17T12:15:50+02:00
in scheme: Thésaurus de la désignation des objets mobiliers
broader: objet ou matériel pour les ouvrages textiles
alternative label: passette à ruban
alternative label: métier à ruban à poser
alternative label: métier à ruban sur pieds
created: 2012-05-16T00:00:00+02:00
related: machine à tisser
definition: Instrument à usage domestique servant à fabriquer d’étroites bandes de tissu à vocation ornementale (rubans, bretelles, galons).
TermeAssocie: machine à tisser
status: 1
broad match: cb12009491v
broad match: http://vocab.getty.edu/aat/300023505
broad match: Rubanerie

machine à tisser
type: Concept
modified: 2015-10-08T14:00:23+02:00
in scheme: Thésaurus de la désignation des objets mobiliers
broader: machine à entrelacer
alternative label: machine à tisser les rubans
alternative label: machine à tisser les dentelles
alternative label: machine à tisser industrielle
created: 2012-05-16T00:00:00+02:00
related: métier à ruban domestique
related: objet ou matériel pour les ouvrages textiles
related: métier à dentelle domestique
related: T69-3449
definition: Machine à entrelacer, par croisement, des fils de trame et des fils de chaîne.
TermeAssocie: métier à ruban domestique
TermeAssocie: objet ou matériel pour les ouvrages textiles
TermeAssocie: métier à dentelle domestique
TermeAssocie: T69-3449
status: 1

métier à ruban domestique
type: PreferredTerm
modified: 2014-10-17T12:15:50+02:00
created: 2014-01-15T14:54:24+01:00
status: 1

métier à ruban à poser
type: SimpleNonPreferredTerm
modified: 2014-10-17T12:15:50+02:00
created: 2014-01-15T14:54:24+01:00
status: 1

objet ou matériel pour les ouvrages textiles
type: Concept
modified: 2014-10-17T11:52:42+02:00
in scheme: Thésaurus de la désignation des objets mobiliers
preferred label: textile working equipment @en-us
narrower: métier à ruban domestique
narrower: métier à dentelle domestique
narrower: matériel de préparation du fil
narrower: métier à broder domestique
narrower: dévidoir domestique
narrower: dé à coudre
narrower: crochet
narrower: ciseaux à ouvrage
narrower: matériel pour le filage
narrower: machine à coudre domestique
narrower: T69-3431
narrower: T69-4728
narrower: T69-4724
narrower: T69-3449
narrower: T69-3441
broader: objet civil domestique
alternative label: presse à paille
alternative label: mouille-doigts
alternative label: broche à tricoter
alternative label: taille-craie
alternative label: planchette de dentelle
alternative label: affiquet
alternative label: aiguille
alternative label: aiguille à piqueter
alternative label: boîte à pelote
alternative label: servante pour renvidoir
alternative label: plioir à dentelle
alternative label: passe-lacet
alternative label: boîte à fil
alternative label: boîte à laine
alternative label: boîte à ficelle
alternative label: bobine
alternative label: porte-bobine
alternative label: protège-pointe
alternative label: aiguille à tricoter
alternative label: œuf à repriser
alternative label: œuf à broder
alternative label: œuf à coudre
created: 2012-05-16T00:00:00+02:00
related: machine à tisser
related: machine liée à la production artisanale
related: table à ouvrage
definition: Objet lié à la préparation ou à la fabrication domestique des textiles, aux travaux de couture ou aux ouvrages de dames.
TermeAssocie: machine à tisser
TermeAssocie: machine liée à la production artisanale
TermeAssocie: table à ouvrage
status: 1

métier à ruban sur pieds
type: SimpleNonPreferredTerm
modified: 2014-10-17T12:15:50+02:00
created: 2014-01-15T14:54:24+01:00
status: 1

passette à ruban
type: SimpleNonPreferredTerm
modified: 2014-10-17T12:15:50+02:00
created: 2014-01-15T14:54:24+01:00
status: 1

tenture murale
type: PreferredTerm
modified: 2014-12-12T11:13:47+01:00
created: 2014-01-15T14:54:24+01:00
status: 1

socle d'architecture
type: Concept
modified: 2015-02-20T16:33:16+01:00
in scheme: Thésaurus de la désignation des objets mobiliers
preferred label: socles @en-us
broader: support vertical
created: 2012-05-16T00:00:00+02:00
related: socle d'oeuvre décorative
definition: Massif surélevant un support, un groupe de supports jumelés.
TermeAssocie: socle d'oeuvre décorative
status: 1

socle d'oeuvre décorative
type: Concept
modified: 2015-03-09T10:54:52+01:00
in scheme: Thésaurus de la désignation des objets mobiliers
broader: sculpture
alternative label: piédouche
alternative label: socle d'œuvre décorative
created: 2012-05-16T00:00:00+02:00
scope note: Préciser gaine en PDEN qui est un socle en forme de tronc de pyramide renversée.
related: socle d'architecture
related: piédestal
TermeAssocie: socle d'architecture
TermeAssocie: piédestal
status: 1

socle d'architecture
type: PreferredTerm
modified: 2015-02-20T16:33:16+01:00
created: 2014-01-15T14:54:24+01:00
status: 1

machine à percer
type: Concept
modified: 2015-10-14T14:27:33+02:00
in scheme: Thésaurus de la désignation des objets mobiliers
broader: machine à usiner par outil de coupe
alternative label: perceuse multibroches
alternative label: mortaiseuse
alternative label: perceuse
alternative label: perceuse radiale
alternative label: perceuse à colonne
created: 2012-05-16T00:00:00+02:00
definition: Machine à usiner par outil de coupe à pénétration hélicoïdale, pour façonner des trous de section circulaire ou conique.
status: 1
narrow match: Perceuse
narrow match: http://vocab.getty.edu/aat/300024679

perceuse multibroches
type: SimpleNonPreferredTerm
modified: 2015-10-14T14:27:33+02:00
created: 2014-01-15T14:54:24+01:00
status: 1

machine à usiner par outil de coupe
type: Concept
modified: 2015-08-31T15:36:52+02:00
in scheme: Thésaurus de la désignation des objets mobiliers
narrower: machine à percer
narrower: machine à limer
narrower: machine à fraiser
narrower: machine à brocher
narrower: machine à aléser
narrower: machine à toupiller
narrower: machine à raboter
narrower: machine à tourner
broader: machine à usiner
created: 2012-05-16T00:00:00+02:00
definition: Machine à usiner un produit par enlèvement de copeaux à l'aide d'un outil de coupe.
status: 1

mortaiseuse
type: SimpleNonPreferredTerm
modified: 2015-10-14T14:27:33+02:00
created: 2014-01-15T14:54:24+01:00
status: 1

machine à percer
type: PreferredTerm
modified: 2015-10-14T14:27:33+02:00
created: 2014-01-15T14:54:24+01:00
status: 1

perceuse à colonne
type: SimpleNonPreferredTerm
modified: 2015-10-14T14:27:33+02:00
created: 2014-01-15T14:54:24+01:00
status: 1

perceuse radiale
type: SimpleNonPreferredTerm
modified: 2015-10-14T14:27:33+02:00
created: 2014-01-15T14:54:24+01:00
status: 1

perceuse
type: SimpleNonPreferredTerm
modified: 2015-10-14T14:27:33+02:00
created: 2014-01-15T14:54:24+01:00
status: 1

balcon
type: Concept
modified: 2015-01-16T16:51:22+01:00
in scheme: Thésaurus de la désignation des objets mobiliers
preferred label: balconies @en-us
broader: divisions architecturales
created: 2012-05-16T00:00:00+02:00
scope note: Ne pas confondre avec coursière en surplomb, ni avec tribune découverte. Voir aussi le Thesaurus de la désignation des œuvres architecturales et des espaces aménagés.
related: garde-corps de balcon
definition: Élément d’élévation formé d’une étroite plate-forme à garde-corps, en surplomb devant une ou plusieurs baies.
TermeAssocie: garde-corps de balcon
status: 1

balcon
type: PreferredTerm
modified: 2015-01-16T16:51:22+01:00
created: 2014-01-15T14:54:24+01:00
status: 1

garde-corps de balcon
type: Concept
modified: 2015-01-30T12:44:49+01:00
in scheme: Thésaurus de la désignation des objets mobiliers
preferred label: balcony railings @en-us
broader: T69-132
alternative label: balconnet
created: 2012-05-16T00:00:00+02:00
related: balcon
definition: Ouvrage à hauteur d'appui formant protection devant un balcon.
TermeAssocie: balcon
status: 1

divisions architecturales
type: Concept
modified: 2014-09-08T14:36:22+02:00
in scheme: Thésaurus de la désignation des objets mobiliers
preferred label: building divisions @en-us
narrower: balcon
narrower: escalier
narrower: alcôve
narrower: tambour de porte
narrower: tribune
narrower: porche
broader: élément d'architecture
created: 2012-05-16T00:00:00+02:00
definition: Partie constituante d'un édifice.
status: 1

buffet
type: Concept
modified: 2014-12-04T15:43:46+01:00
in scheme: Thésaurus de la désignation des objets mobiliers
preferred label: sideboards (furniture) @en-us
narrower: buffet à confitures
broader: armoire
alternative label: buffet à œufs
created: 2012-05-16T00:00:00+02:00
related: vaisselier
definition: Armoire servant essentiellement à ranger la vaisselle et, parfois, à entreposer quelques aliments. Elle peut comporter une tablette tirante servant, à la découpe du pain ou des viandes ou utilisée comme desserte.
TermeAssocie: vaisselier
status: 1

armoire
type: Concept
modified: 2014-12-04T15:48:35+01:00
in scheme: Thésaurus de la désignation des objets mobiliers
preferred label: cupboards @en-us
narrower: armoire à fromage
narrower: buffet
narrower: armoire-verrier
narrower: armoire à archives
narrower: armoire à linge
narrower: armoire à pain
narrower: armoire garde-manger
narrower: armoire à musique
narrower: armoire coffre-fort
narrower: armoire-bibliothèque
narrower: armoire à lait
broader: meuble de rangement et d'exposition
alternative label: dressoir
alternative label: armoire porte-instruments de cuisine
alternative label: armoire à jeux
alternative label: armoire à liqueurs
alternative label: armoire à cartouches
alternative label: armoire à fusils
alternative label: armoire à cigares
alternative label: armoire-dressoir
alternative label: armoire à flèches
alternative label: armoire bout-de-bureau
created: 2012-05-16T00:00:00+02:00
definition: Meuble de rangement ou de conservation constitué d'un ou plusieurs corps fermés accessibles par un ou plusieurs battants, glissants ou rideaux, éventuellement juxtaposés et/ou superposés et comportant des tablettes ou des éléments de suspension intérieurs, parfois des tiroirs intérieurs ou extérieurs.
status: 1

buffet
type: PreferredTerm
modified: 2014-12-04T15:43:46+01:00
created: 2014-01-15T14:54:24+01:00
status: 1

buffet à œufs
type: SimpleNonPreferredTerm
modified: 2014-12-04T15:43:46+01:00
created: 2014-01-15T14:54:24+01:00
status: 1

vaisselier
type: Concept
modified: 2014-12-04T16:49:46+01:00
in scheme: Thésaurus de la désignation des objets mobiliers
preferred label: dressers (cupboards) @en-us
broader: étagère
created: 2012-05-16T00:00:00+02:00
related: buffet
definition: Etagère généralement peu profonde, servant à entreposer de la vaisselle utilisée ou, plus fréquemment, à exposer de la vaisselle décorative. Les rayons peuvent être de profondeur décroissante vers le haut. Les vaisseliers peuvent être spécifiques, c'est-à-dire utilisés, à l'origine, pour une certaine catégorie de vaisselle. Mais ni les formes ni les dimensions n'en sont vraiment caractéristiques.
TermeAssocie: buffet
status: 1

buffet à confitures
type: Concept
modified: 2014-12-04T15:35:54+01:00
in scheme: Thésaurus de la désignation des objets mobiliers
preferred label: jelly cupboards @en-us
broader: buffet
created: 2012-05-16T00:00:00+02:00
definition: Buffet bas, en général à un battant, servant à ranger les pots de confiture et accessoirement les bouteilles d'alcool dans la partie basse.
status: 1
broad match: http://data.bnf.fr/ark:/12148/cb13163363f

tamis
type: Concept
modified: 2014-12-05T16:35:30+01:00
in scheme: Thésaurus de la désignation des objets mobiliers
preferred label: sieves @en-us
broader: instrument pour la préparation - le service ou la consommation des aliments et des boissons
created: 2012-05-16T00:00:00+02:00
definition: Instrument constitué par un cadre maintenant une surface tendue ajourée (toile perforée, treillis métallique, etc.) servant à séparer des particules solides de tailles différentes ou à filtrer des liquides. Les tamis, utilisés par grosseur décroissante, permettent de calibrer un produit.
status: 1

tamis
type: PreferredTerm
modified: 2014-12-05T16:35:30+01:00
created: 2014-01-15T14:54:24+01:00
status: 1

bouilloire
type: Concept
modified: 2014-12-08T12:12:56+01:00
in scheme: Thésaurus de la désignation des objets mobiliers
preferred label: teakettles @en-us
broader: récipient pour la cuisson des aliments
alternative label: marabout
alternative label: coquemar
created: 2012-05-16T00:00:00+02:00
related: bouilloire de table
definition: Récipient verseur couvert, en métal, servant à faire chauffer de l'eau. Plus ou moins sphérique, à large fond plat et goulot latéral coudé, la bouilloire est munie sur le dessus d'une anse mobile ou fixe qui permet de la suspendre à la crémaillère.
TermeAssocie: bouilloire de table
status: 1

bouilloire à punch
type: SimpleNonPreferredTerm
modified: 2014-12-08T13:08:21+01:00
created: 2014-01-15T14:54:24+01:00
status: 1

bouilloire de table
type: PreferredTerm
modified: 2014-12-08T13:08:21+01:00
created: 2014-01-15T14:54:24+01:00
status: 1

tympan
type: Concept
modified: 2014-12-09T16:52:55+01:00
in scheme: Thésaurus de la désignation des objets mobiliers
preferred label: tympana @en-us
broader: remplage
created: 2012-05-16T00:00:00+02:00
definition: Paroi de remplage diminuant par le haut l'ouverture d'une baie. Le tympan est généralement plein et dans le même matériau que l'embrasure.
status: 1

tympan
type: PreferredTerm
modified: 2014-12-09T16:52:55+01:00
created: 2014-01-15T14:54:24+01:00
status: 1

faldistoire
type: Concept
modified: 2014-12-02T14:47:46+01:00
in scheme: Thésaurus de la désignation des objets mobiliers
preferred label: faldistories (bishops' chairs) @en-us
preferred label: faldistorio @it
preferred label: faldistório @pt
broader: siège et agenouilloir d'église du culte catholique
created: 2012-05-16T00:00:00+02:00
definition: Siège de chœur mobile, réservé à un évêque ou à un prélat de haut rang, utilisé en l'absence de trône pontifical ou à la place de celui-ci lors de cérémonies particulières. En usage, il est placé devant le degré d'autel du côté de l'Epître, recouvert d'une housse et accompagné d'un coussin qui sert d'agenouilloir. Avec des accotoirs et sans dossier, le faldistoire est en général en X et parfois pliant.
status: 1
broad match: http://data.bnf.fr/ark:/12148/cb131627639

faldistoire
type: PreferredTerm
modified: 2014-12-02T14:47:46+01:00
created: 2014-01-15T14:54:24+01:00
status: 1

bain de bras
type: PreferredTerm
modified: 2014-10-17T15:05:56+02:00
created: 2014-01-15T14:54:24+01:00
status: 1

meuble domestique
type: Concept
modified: 2014-10-10T14:51:43+02:00
in scheme: Thésaurus de la désignation des objets mobiliers
preferred label: furniture @en-us
narrower: siège
narrower: meuble de protection
narrower: luminaire
narrower: meuble de préparation culinaire
narrower: meuble annexe des sièges
narrower: meuble de rangement et d'exposition
narrower: billot
narrower: meuble à transformation
narrower: élément de meuble
narrower: glace
narrower: meuble pour animal familier
narrower: meuble de maintien pour enfant
narrower: pupitre
narrower: meuble d'élévation
narrower: meuble lié aux loisirs
narrower: meuble combiné
narrower: lit
narrower: meuble lié aux coutumes et cultes domestiques
narrower: meuble pour l'entretien du linge
narrower: secrétaire
narrower: meuble lié au chauffage
narrower: table
narrower: meuble cloison
narrower: meuble d'hygiène
narrower: meuble lié à l'alimentation
created: 2012-05-16T00:00:00+02:00
related: objet civil domestique
definition: Élément de mobilier garnissant un logement, nécessaire aux divers temps et besoins de la vie domestique.
TermeAssocie: objet civil domestique
status: 1

luminaire
type: Concept
modified: 2014-10-10T15:32:04+02:00
in scheme: Thésaurus de la désignation des objets mobiliers
preferred label: lighting fixtures @en-us
narrower: porte-luminaire
narrower: suspension
narrower: luminaire d'applique
narrower: lustre
narrower: T69-3162
broader: meuble domestique
created: 2012-05-16T00:00:00+02:00
definition: Structure équipée de sources de lumière destinées à l’éclairage.
status: 1

meuble de préparation culinaire
type: Concept
modified: 2014-10-10T16:43:30+02:00
in scheme: Thésaurus de la désignation des objets mobiliers
narrower: meuble pour farine ou pain
narrower: meuble pour lait ou fromage
narrower: meuble à préparations diverses
narrower: meuble à châtaignes
narrower: meuble pour préparer le cochon
broader: meuble domestique
created: 2012-05-16T00:00:00+02:00
related: récipient pour la préparation des aliments
definition: Meuble dont la forme peut être adaptée à une préparation alimentaire spécifique.
TermeAssocie: récipient pour la préparation des aliments
status: 1
broad match: Meuble

meuble annexe des sièges
type: Concept
modified: 2014-10-10T15:47:29+02:00
in scheme: Thésaurus de la désignation des objets mobiliers
narrower: tabouret de pied
narrower: chancelière
broader: meuble domestique
created: 2012-05-16T00:00:00+02:00
definition: Meuble d'accompagnement pour les sièges pouvant ou non leur être assortis.
status: 1
broad match: http://data.bnf.fr/ark:/12148/cb131627639
broad match: http://vocab.getty.edu/aat/300037769
broad match: Siège (meuble)

meuble de rangement et d'exposition
type: Concept
modified: 2014-10-13T10:16:05+02:00
in scheme: Thésaurus de la désignation des objets mobiliers
preferred label: storage and display furniture @en-us
narrower: meuble-support
narrower: meuble de collection spécifique
narrower: étagère
narrower: armoire
narrower: coffre
narrower: meuble-vestiaire
narrower: coffret
narrower: rangement lié aux activités de bureau et de loisirs
narrower: boîte
narrower: placard
narrower: support pour le bureau ou les loisirs
narrower: cabinet
narrower: rangement lié à l'alimentation
narrower: panier
narrower: égouttoir
narrower: commode
narrower: claie
narrower: corbeille
narrower: vitrine
broader: meuble domestique
alternative label: meuble d'exposition
alternative label: meuble-présentoir
created: 2012-05-16T00:00:00+02:00
definition: Meuble dont la forme est adaptée au rangement ou à l’exposition d’objets.
status: 1
narrow match: cb13562642r
broad match: Meuble

billot
type: Concept
modified: 2014-10-10T14:54:56+02:00
in scheme: Thésaurus de la désignation des objets mobiliers
preferred label: chopping blocks @en-us
broader: meuble domestique
alternative label: billot à fendre les bûches
alternative label: billot à découper
created: 2012-05-16T00:00:00+02:00
definition: Section de tronc d'arbre posée au sol ou montée sur pieds servant à couper le bois ou découper la viande et d’autres aliments.
status: 1
broad match: cb13162680m

meuble à transformation
type: Concept
modified: 2014-10-10T15:51:34+02:00
in scheme: Thésaurus de la désignation des objets mobiliers
preferred label: folding furniture @en-us
broader: meuble domestique
alternative label: siège à transformations
alternative label: table à transformations
created: 2012-05-16T00:00:00+02:00
definition: Meuble dont les différentes fonctions sont remplies alternativement par modification de la position des éléments.
status: 1
broad match: Meuble

élément de meuble
type: Concept
modified: 2014-10-10T14:55:41+02:00
in scheme: Thésaurus de la désignation des objets mobiliers
preferred label: furniture components @en-us
broader: meuble domestique
alternative label: battant
alternative label: tiroir
alternative label: bronze d'ameublement
created: 2013-01-21T00:00:00+01:00
definition: Partie constituante d'une meuble.
status: 1
broad match: cb13162680m
broad match: Meuble

glace
type: Concept
modified: 2014-12-04T11:10:25+01:00
in scheme: Thésaurus de la désignation des objets mobiliers
preferred label: mirrors @en-us
narrower: glace de trumeau
narrower: psyché
narrower: miroir peint
narrower: miroir de toilette
narrower: miroir d'applique
narrower: T69-3527
broader: meuble domestique
created: 2012-05-16T00:00:00+02:00
scope note: On réservera ce terme aux éléments directement liés à l'architecture, les autres étant appelés miroirs. On l'utilisera également pour les éléments d'un miroir constitué de plusieurs parties. Par ailleurs on emploiera le terme " morceaux " pour les éléments d'une glace situés dans un même cadre.
definition: Surface réfléchissant les images, montée dans un cadre ou une boiserie.
status: 1

meuble pour animal familier
type: Concept
modified: 2014-12-05T11:13:49+01:00
in scheme: Thésaurus de la désignation des objets mobiliers
preferred label: animal husbandry containers @en-us
broader: meuble domestique
alternative label: aquarium
alternative label: porte-aquarium
alternative label: perchoir d'intérieur
alternative label: porte-cage
alternative label: cage à oiseaux
alternative label: niche à chien
created: 2012-05-16T00:00:00+02:00
related: matériel pour l'élevage
definition: Abri, récipient, support, etc, propre à accueillir un animal familier dans l’espace domestique.
TermeAssocie: matériel pour l'élevage
status: 1

meuble de maintien pour enfant
type: Concept
modified: 2014-10-10T16:36:51+02:00
in scheme: Thésaurus de la désignation des objets mobiliers
narrower: T69-2720
narrower: T69-2722
narrower: T69-2718
narrower: T69-2715
broader: meuble domestique
created: 2012-05-16T00:00:00+02:00
definition: Meuble destiné à l’enfant, pour le promener, le garder ou encore lui apprendre à marcher.
status: 1
broad match: cb11980671p
broad match: Meuble

meuble domestique
type: PreferredTerm
modified: 2014-10-10T14:51:43+02:00
created: 2014-01-15T14:54:24+01:00
status: 1

pupitre
type: Concept
modified: 2014-12-05T11:40:04+01:00
in scheme: Thésaurus de la désignation des objets mobiliers
preferred label: stands (support furniture) @en-us
narrower: pupitre à musique
narrower: pupitre à lire
narrower: T69-2829
broader: meuble domestique
created: 2012-05-16T00:00:00+02:00
related: T69-726
definition: Meuble comportant un plan incliné à rebord inférieur. Le pupitre comporte parfois des bras porte-luminaire.
TermeAssocie: T69-726
status: 1

meuble d'élévation
type: Concept
modified: 2014-10-10T15:54:08+02:00
in scheme: Thésaurus de la désignation des objets mobiliers
narrower: escabeau à marches
narrower: T69-3232
narrower: T69-3222
broader: meuble domestique
created: 2012-05-16T00:00:00+02:00
definition: Dispositif servant d’escalier ou à la surélévation.
status: 1
broad match: cb13162680m
broad match: http://vocab.getty.edu/aat/300039337
broad match: Meuble

meuble lié aux loisirs
type: Concept
modified: 2014-10-13T13:42:01+02:00
in scheme: Thésaurus de la désignation des objets mobiliers
narrower: T69-3517
broader: meuble domestique
alternative label: meuble à phonographe
alternative label: meuble-récepteur
created: 2013-01-21T00:00:00+01:00
related: T69-2785
definition: Meuble lié à une activité de loisirs.
TermeAssocie: T69-2785
status: 1
broad match: http://vocab.getty.edu/aat/300037680

meuble combiné
type: Concept
modified: 2014-10-10T15:53:21+02:00
in scheme: Thésaurus de la désignation des objets mobiliers
preferred label: multipurpose furniture @en-us
broader: meuble domestique
created: 2012-05-16T00:00:00+02:00
definition: Meuble répondant à de grandes fonctions de type différent (ex. repos et rangement).
status: 1
broad match: Meuble

lit
type: Concept
modified: 2014-12-04T11:45:56+01:00
in scheme: Thésaurus de la désignation des objets mobiliers
preferred label: beds @en-us
narrower: dais de lit
narrower: lit de jour
narrower: lit d'enfant
broader: meuble domestique
alternative label: lit-alcôve
alternative label: lit-clos
created: 2012-05-16T00:00:00+02:00
related: garniture de lit
definition: Meuble de repos, nocturne le plus souvent, plus large que le lit de repos. Les garnitures sont conçues pour être amovibles. Il peut être monté sur rails ou sur pieds complétés de roulettes pour le déplacer. Il peut être pliant, clos, surmonté d’un dais de lit, etc.
TermeAssocie: garniture de lit
status: 1

meuble lié aux coutumes et cultes domestiques
type: Concept
modified: 2014-10-13T13:38:54+02:00
in scheme: Thésaurus de la désignation des objets mobiliers
narrower: chapelle à Vierge
narrower: globe de mariage
broader: meuble domestique
created: 2012-05-16T00:00:00+02:00
definition: Meuble lié à un objet de dévotion ou de vénération privée.
status: 1
broad match: cb13162680m
broad match: http://vocab.getty.edu/aat/300037680
broad match: Meuble

meuble pour l'entretien du linge
type: Concept
modified: 2014-10-13T14:18:30+02:00
in scheme: Thésaurus de la désignation des objets mobiliers
narrower: essoreuse domestique
narrower: T69-3389
narrower: T69-3406
narrower: T69-3385
narrower: T69-3379
broader: meuble domestique
alternative label: tréteau à linge
alternative label: machine à laver manuelle
alternative label: séchoir à linge
alternative label: placard à lessive
alternative label: lave-linge
alternative label: étendoir à linge
alternative label: porte-cuve à lessive
alternative label: planche porte-linge
alternative label: presse à linge
alternative label: planche à laver
alternative label: siège porte-fer à repasser
alternative label: chaudière à lessive
created: 2012-05-16T00:00:00+02:00
definition: Meuble servant au lavage, à l’essorage, au séchage ou au repassage du linge.
status: 1

secrétaire
type: Concept
modified: 2014-12-05T12:01:54+01:00
in scheme: Thésaurus de la désignation des objets mobiliers
preferred label: fall-front desks @en-us
narrower: T69-3560
narrower: T69-3562
narrower: T69-3566
narrower: T69-3568
broader: meuble domestique
alternative label: secrétaire à dessus brisé
created: 2012-05-16T00:00:00+02:00
related: bureau
related: table à écrire
definition: Meuble comportant un plan à écrire fermé à clef. Un secrétaire peut être en encoignure.
TermeAssocie: bureau
TermeAssocie: table à écrire
status: 1

objet civil domestique
type: Concept
modified: 2014-10-16T12:05:13+02:00
in scheme: Thésaurus de la désignation des objets mobiliers
preferred label: furnishings (artifacts) @en-us
narrower: objet d'âtre
narrower: objet pour écrire ou de bureau
narrower: objet lié aux aliments ou aux boissons
narrower: objet pour la toilette
narrower: objet ou matériel pour les ouvrages textiles
narrower: objet pour l'entretien de la maison
narrower: objet décoratif ou de rangement ou pour les plantes et les fleurs
narrower: instrument ou accessoire pour l'éclairage
narrower: objet d'âtre pour la cuisson
narrower: objet pour fumer et priser
narrower: objet pour le chauffage
narrower: objet ou matériel d'indication du temps
narrower: objet pour l'entretien du linge
created: 2012-05-16T00:00:00+02:00
related: meuble domestique
definition: Objet ou instrument garnissant un logement, nécessaire aux divers temps et besoins de la vie domestique.
TermeAssocie: meuble domestique
status: 1

meuble lié au chauffage
type: Concept
modified: 2014-10-17T15:30:20+02:00
in scheme: Thésaurus de la désignation des objets mobiliers
preferred label: heating equipment @en-us
narrower: placard chauffant
narrower: poêle de chauffage
narrower: radiateur
narrower: brasier
broader: meuble domestique
alternative label: barres à sécher les bûches
created: 2012-05-16T00:00:00+02:00
definition: Meuble ou appareil destiné à faire sécher du bois ou chauffer une pièce.
status: 1

table
type: Concept
modified: 2014-12-05T14:09:45+01:00
in scheme: Thésaurus de la désignation des objets mobiliers
preferred label: tables @en-us
narrower: table pour le bureau ou les loisirs
narrower: table pour l'alimentation
narrower: table d'applique
narrower: table à ouvrage
narrower: table pour l'hygiène ou le repos
broader: meuble domestique
created: 2012-05-16T00:00:00+02:00
definition: Meuble constitué essentiellement d'un plan horizontal rigide situé à hauteur d'appui ou plus bas, et servant à poser, provisoirement ou non, des objets divers ou à supporter un autre meuble. Elle peut comporter des parties de rangement.
status: 1

meuble cloison
type: Concept
modified: 2014-12-04T12:09:18+01:00
in scheme: Thésaurus de la désignation des objets mobiliers
broader: meuble domestique
created: 2012-05-16T00:00:00+02:00
definition: Meuble, parfois complété par une boiserie, destiné à séparer deux pièces ou deux parties d’une pièce. Dans ce dernier cas, il forme simplement refend sur une partie de la pièce ou il constitue une fermeture complète de la pièce.
status: 1

meuble d'hygiène
type: Concept
modified: 2014-10-10T16:02:54+02:00
in scheme: Thésaurus de la désignation des objets mobiliers
narrower: bidet
narrower: lavabo domestique
narrower: siège d'aisances
narrower: meuble brûle-parfum
narrower: meuble à clystère
narrower: T69-6889
narrower: T69-3126
narrower: T69-3156
narrower: T69-3158
narrower: T69-3117
narrower: T69-3114
broader: meuble domestique
alternative label: nécessaire d'aisances
alternative label: porte-nécessaire d'aisances
alternative label: porte-seau de toilette
alternative label: pied porte-coiffure
created: 2012-05-16T00:00:00+02:00
definition: Meuble lié à l’hygiène et aux soins du corps.
status: 1

meuble lié à l'alimentation
type: Concept
modified: 2014-10-13T13:05:23+02:00
in scheme: Thésaurus de la désignation des objets mobiliers
preferred label: kitchenware @en-us
narrower: meuble pour le feu ou le réchauffage
narrower: T69-3235
narrower: T69-3272
broader: meuble domestique
created: 2012-05-16T00:00:00+02:00
definition: Meuble employé pour la préparation, le service ou la consommation des aliments.
status: 1

meuble luminaire d'église
type: Concept
modified: 2014-12-02T12:24:16+01:00
in scheme: Thésaurus de la désignation des objets mobiliers
preferred label: furniture and furnishings for lighting @en-us
preferred label: arredi per l'illuminazione @it
preferred label: luminárias @pt
narrower: chandelier pascal
narrower: luminaire d'applique d'église
narrower: chandelier des Ténèbres
narrower: chandelier de choeur
narrower: lustre d'église
broader: meuble du culte catholique
created: 2012-05-16T00:00:00+02:00
definition: Elément d’éclairage de l’église ou destiné à un usage spécifique lors d’une célébration religieuse ; il est souvent monumental.
status: 1
broad match: http://vocab.getty.edu/aat/300037581

luminaire d'applique d'église
type: Concept
modified: 2014-12-02T12:35:48+01:00
in scheme: Thésaurus de la désignation des objets mobiliers
preferred label: lume da parete di chiesa @it
preferred label: church sconces @en-us
preferred label: candeeiro de parede @pt
broader: meuble luminaire d'église
alternative label: applique de lumière d'église
alternative label: chandelier d'applique d'église
alternative label: bras de lumière d'église
created: 2012-05-16T00:00:00+02:00
related: chandelier d'église
related: bras de lumière
related: luminaire d'applique
definition: Tout luminaire fixé au mur dans une église qu'il soit à une ou plusieurs branches ou constitué d'un support d'applique auquel est suspendue une lampe.
TermeAssocie: chandelier d'église
TermeAssocie: bras de lumière
TermeAssocie: luminaire d'applique
status: 1
broad match: http://vocab.getty.edu/aat/300037589

chandelier des Ténèbres
type: Concept
modified: 2014-12-02T12:29:17+01:00
in scheme: Thésaurus de la désignation des objets mobiliers
preferred label: saettia @it
preferred label: hearses (candelabras) @en-us
preferred label: candelabro de trevas @pt
broader: meuble luminaire d'église
created: 2012-05-16T00:00:00+02:00
related: chandelier d'église
definition: Grand chandelier composé d'un pied et d'une tige plus ou moins haute portant un élément triangulaire dont les pentes et le sommet sont dotés de treize ou quinze supports pour des cierges. Généralement posé au sol, près d'un autel ou parfois posé dessus, il sert pendant l'office des Ténèbres des Jeudi, Vendredi et Samedi saints.
TermeAssocie: chandelier d'église
status: 1
broad match: http://vocab.getty.edu/aat/300037584

meuble luminaire d'église
type: PreferredTerm
modified: 2014-12-02T12:24:16+01:00
created: 2014-01-15T14:54:24+01:00
status: 1

chandelier de choeur
type: Concept
modified: 2015-03-09T11:03:31+01:00
in scheme: Thésaurus de la désignation des objets mobiliers
preferred label: candelabro del coro @it
preferred label: sanctuary candlesticks @en-us
preferred label: tocheiro de coro @pt
broader: meuble luminaire d'église
alternative label: chandelier de chœur
alternative label: chandelier de sanctuaire
alternative label: chandelier de chœur à branches
alternative label: candélabre de chœur
created: 2012-05-16T00:00:00+02:00
related: chandelier d'église
TermeAssocie: chandelier d'église
status: 1

lustre d'église
type: Concept
modified: 2014-12-02T12:40:30+01:00
in scheme: Thésaurus de la désignation des objets mobiliers
preferred label: church chandeliers @en-us
preferred label: lampadario da chiesa @it
preferred label: lampadário @pt
narrower: couronne de lumières
broader: meuble luminaire d'église
created: 2012-05-16T00:00:00+02:00
related: suspension
related: lustre de synagogue
related: lustre
definition: Luminaire suspendu au plafond ou à la voûte d'une église. Le lustre d'église peut être utilisé comme support de lampes à huile, de bougies, etc et être décoré de motifs religieux.
TermeAssocie: suspension
TermeAssocie: lustre de synagogue
TermeAssocie: lustre
status: 1
broad match: http://vocab.getty.edu/aat/300037622

machine à gazéfier
type: Concept
modified: 2013-09-30T00:00:00+02:00
in scheme: Thésaurus de la désignation des objets mobiliers
broader: machine à changer d'état
created: 2012-05-16T00:00:00+02:00
definition: Machine à changer d'état un produit en le faisant passer de l'état liquide à l'état gazeux.
status: 1

machine à changer d'état
type: Concept
modified: 2014-01-10T00:00:00+01:00
in scheme: Thésaurus de la désignation des objets mobiliers
narrower: machine à gazéfier
narrower: machine à émulsionner
narrower: machine à fondre
narrower: machine à dissoudre
narrower: machine à pétrir
narrower: machine à solidifier
broader: machine à modifier l'état
created: 2012-05-16T00:00:00+02:00
definition: Machine à transformer un produit en en modifiant l'état physique (gaz, liquide ou solide).
status: 1

machine à gazéfier
type: PreferredTerm
modified: 2014-01-10T00:00:00+01:00
created: 2014-01-15T14:54:24+01:00
status: 1

gratte-pieds
type: Concept
modified: 2014-12-10T15:51:33+01:00
in scheme: Thésaurus de la désignation des objets mobiliers
preferred label: boot scrapers @en-us
broader: objet pour l'entretien de la maison
created: 2012-05-16T00:00:00+02:00
definition: Instrument en métal constitué généralement d'une épaisse barre en U fixée à un socle, sur laquelle on gratte les chaussures pour en ôter la boue.
status: 1
broad match: cb11981075n
broad match: Category:Cleaning tools

objet pour l'entretien de la maison
type: Concept
modified: 2014-10-17T13:48:46+02:00
in scheme: Thésaurus de la désignation des objets mobiliers
preferred label: housekeeping equipment @en-us
narrower: gratte-pieds
narrower: pince à couverture de lit
narrower: humidificateur
narrower: polissoir à couteaux
narrower: pot-pourri
narrower: brosse à meuble
narrower: brûle-parfum
narrower: goupillon domestique
narrower: T69-4343
narrower: T69-4345
narrower: T69-4371
narrower: T69-4349
broader: objet civil domestique
alternative label: protège-évier
alternative label: bâton à faire les lits
alternative label: tapette à insectes
alternative label: gobe-mouches
alternative label: chasse-mouches
created: 2012-05-16T00:00:00+02:00
definition: Ustensile destiné à l’hygiène d’un intérieur domestique.
status: 1

gratte-pieds
type: PreferredTerm
modified: 2014-12-10T15:51:33+01:00
created: 2014-01-15T14:54:24+01:00
status: 1

coquillier (meuble)
type: Concept
modified: 2014-12-04T16:51:42+01:00
in scheme: Thésaurus de la désignation des objets mobiliers
preferred label: coquilliers @en-us
broader: meuble de collection spécifique
created: 2012-05-16T00:00:00+02:00
definition: Meuble à tiroirs multiples, de hauteur variable, servant à disposer une collection de coquillages. Le coquillier peut comporter des battants.
status: 1

coquillier (meuble)
type: PreferredTerm
modified: 2014-12-04T16:51:42+01:00
created: 2014-01-15T14:54:24+01:00
status: 1

draisine à bras
type: Concept
modified: 2014-10-14T16:55:13+02:00
in scheme: Thésaurus de la désignation des objets mobiliers
preferred label: handcars @en-us
broader: véhicule ferroviaire spécialisé
created: 2013-11-04T00:00:00+01:00
definition: Véhicule ferroviaire autonome, mu manuellement par différents systèmes, destiné au transport sur un site de chantier.
status: 1
broad match: cb11938431s

draisine à bras
type: PreferredTerm
modified: 2014-10-14T16:55:13+02:00
created: 2014-01-15T14:54:24+01:00
status: 1

porte-fromages
type: Concept
modified: 2014-09-11T12:47:43+02:00
in scheme: Thésaurus de la désignation des objets mobiliers
broader: étagère
created: 2012-05-16T00:00:00+02:00
definition: Support en forme d’étagère de milieu ou d’applique, servant à entreposer les fromages et à les faire sécher en attendant leur consommation.
status: 1

porte-fromages
type: PreferredTerm
modified: 2014-09-11T12:47:43+02:00
created: 2014-01-15T14:54:24+01:00
status: 1

voiture amphibie
type: Concept
modified: 2014-10-16T11:28:36+02:00
in scheme: Thésaurus de la désignation des objets mobiliers
preferred label: amphibious vehicles @en-us
broader: véhicule routier motorisé spécialisé
created: 2013-11-06T00:00:00+01:00
definition: Voiture automobile apte à circuler sur des voies carrossables ou des plans d'eau.
status: 1

véhicule routier motorisé spécialisé
type: Concept
modified: 2014-10-16T11:22:17+02:00
in scheme: Thésaurus de la désignation des objets mobiliers
narrower: voiture amphibie
narrower: véhicule tout terrain
narrower: véhicule routier motorisé publicitaire
narrower: véhicule routier motorisé de travaux publics
narrower: engin motorisé agricole
broader: véhicule terrestre motorisé
created: 2013-11-06T00:00:00+01:00
definition: Véhicule motorisé qui est moins affecté à une mission de transport de marchandises ou de personnes qu'à une tâche spécifique en fonction de son type.
status: 1
broad match: http://data.bnf.fr/ark:/12148/cb11975775b
broad match: Véhicule

voiture amphibie
type: PreferredTerm
modified: 2014-10-16T11:28:36+02:00
created: 2014-01-15T14:54:24+01:00
status: 1

nappe d'autel
type: Concept
modified: 2014-12-02T16:02:19+01:00
in scheme: Thésaurus de la désignation des objets mobiliers
preferred label: tovaglia d'altare @it
preferred label: altar cloths @en-us
preferred label: toalha de altar @pt
broader: linge ou garniture liés à l'autel
created: 2012-05-16T00:00:00+02:00
definition: Linge bénit dont on recouvre la surface d'une table d'autel pour célébrer la messe. Les nappes doivent être au nombre de trois, en lin ou en chanvre et de couleur blanche. La nappe du dessus doit pendre de chaque côté de l'autel.
status: 1

linge ou garniture liés à l'autel
type: Concept
modified: 2014-12-02T15:54:08+01:00
in scheme: Thésaurus de la désignation des objets mobiliers
preferred label: lini e coperture d'altare @it
preferred label: linen and ornaments for the altar @en-us
preferred label: linhos e guarnições relacionados com o altar @pt
narrower: nappe d'autel
narrower: nappe de crédence
narrower: signet de livre liturgique
narrower: courtine d'autel
narrower: tapis d'autel
narrower: voile de pupitre d'autel
narrower: garniture de dais d'autel
narrower: chrémeau d'autel
narrower: coussin d'autel
narrower: tapis de choeur
narrower: tapis de dessus d'autel
narrower: tour d'autel
narrower: couverture de livre liturgique
broader: linge ou garniture du culte catholique
created: 2012-05-16T00:00:00+02:00
definition: Pièce textile destinée à protéger ou parer l’autel et son environnement.
status: 1

nappe d'autel
type: PreferredTerm
modified: 2014-12-02T16:02:19+01:00
created: 2014-01-15T14:54:24+01:00
status: 1

accessoire d'écriture
type: Concept
modified: 2014-12-10T15:07:24+01:00
in scheme: Thésaurus de la désignation des objets mobiliers
preferred label: writing instruments @en-us
broader: objet pour écrire ou de bureau
alternative label: grattoir
alternative label: taille-crayon
alternative label: plume
alternative label: taille-plume
alternative label: porte-crayon
alternative label: porte-plume
alternative label: tire-ligne
alternative label: porte-mine
alternative label: stylo
created: 2013-02-07T00:00:00+01:00
definition: Objet lié à l’activité d’écriture.
status: 1

porte-mine
type: SimpleNonPreferredTerm
modified: 2014-12-10T15:07:24+01:00
created: 2014-01-15T14:54:24+01:00
status: 1

taille-plume
type: SimpleNonPreferredTerm
modified: 2014-12-10T15:07:24+01:00
created: 2014-01-15T14:54:24+01:00
status: 1

stylo
type: SimpleNonPreferredTerm
modified: 2014-12-10T15:07:24+01:00
created: 2014-01-15T14:54:24+01:00
status: 1

porte-plume
type: SimpleNonPreferredTerm
modified: 2014-12-10T15:07:24+01:00
created: 2014-01-15T14:54:24+01:00
status: 1

plume
type: SimpleNonPreferredTerm
modified: 2014-12-10T15:07:24+01:00
created: 2014-01-15T14:54:24+01:00
status: 1

tire-ligne
type: SimpleNonPreferredTerm
modified: 2014-12-10T15:07:24+01:00
created: 2014-01-15T14:54:24+01:00
status: 1

grattoir
type: SimpleNonPreferredTerm
modified: 2014-12-10T15:07:24+01:00
created: 2014-01-15T14:54:24+01:00
status: 1

accessoire d'écriture
type: PreferredTerm
modified: 2014-12-10T15:07:24+01:00
created: 2014-01-15T14:54:24+01:00
status: 1

taille-crayon
type: SimpleNonPreferredTerm
modified: 2014-12-10T15:07:24+01:00
created: 2014-01-15T14:54:24+01:00
status: 1

porte-crayon
type: SimpleNonPreferredTerm
modified: 2014-12-10T15:07:24+01:00
created: 2014-01-15T14:54:24+01:00
status: 1

housse d'ostensoir
type: Concept
modified: 2014-12-02T16:36:41+01:00
in scheme: Thésaurus de la désignation des objets mobiliers
preferred label: fodera per ostensorio @it
preferred label: monstrance covers @en-us
preferred label: manga de ostensório @pt
broader: linge ou garniture liés à l'Eucharistie
alternative label: sac d'ostensoir
created: 2012-05-16T00:00:00+02:00
related: boîte d'ostensoir
related: ostensoir
definition: Enveloppe qui protège un ostensoir lorsqu'il n'est pas utilisé.
TermeAssocie: boîte d'ostensoir
TermeAssocie: ostensoir
status: 1

sac d'ostensoir
type: SimpleNonPreferredTerm
modified: 2014-12-02T16:36:41+01:00
created: 2014-01-15T14:54:24+01:00
status: 1

boîte d'ostensoir
type: Concept
modified: 2014-11-26T12:17:24+01:00
in scheme: Thésaurus de la désignation des objets mobiliers
preferred label: custodia di ostensorio @it
preferred label: monstrance cases @en-us
preferred label: estojo de ostensório @pt
broader: boîte et coffret pour le rangement des objets liturgiques
alternative label: boîte à ostensoir
alternative label: écrin d'ostensoir
alternative label: étui d'ostensoir
created: 2012-05-16T00:00:00+02:00
related: housse d'ostensoir
related: ostensoir
definition: Coffret utilisé pour ranger un ostensoir. Il est doublé à l'intérieur. L'extérieur peut être recouvert de cuir, de toile ou encore être peint.
TermeAssocie: housse d'ostensoir
TermeAssocie: ostensoir
status: 1
broad match: http://vocab.getty.edu/aat/300083005

ostensoir
type: Concept
modified: 2014-11-27T15:19:06+01:00
in scheme: Thésaurus de la désignation des objets mobiliers
preferred label: ostensorio @it
preferred label: monstrances @en-us
preferred label: ostensório @pt
narrower: couronne d'ostensoir
broader: objet lié à l'Eucharistie
alternative label: monstrance
alternative label: soleil
alternative label: ostensoir-soleil
alternative label: ostensoir-monstrance
created: 2012-05-16T00:00:00+02:00
related: housse d'ostensoir
related: boîte d'ostensoir
related: voile huméral
related: reliquaire-ostensoir
related: voile d'ostensoir
related: voile d'exposition du saint sacrement
related: reliquaire-monstrance
definition: Réceptacle utilisé lors de l'exposition du saint sacrement. Souvent en métal précieux, il est constitué par une boîte vitrée destinée à recevoir, pendant cette cérémonie, un croissant eucharistique ou une lunule, contenant l'hostie et placée au centre d'une monture souvent élaborée, surmontée d'une croix et portée par un pied et une tige. Il existe divers types d'ostensoir dont les plus fréquents sont l'ostensoir-soleil, dont la lunette est entourée d'une gloire, et l'ostensoir-monstrance, où la lunule est placée dans un cylindre vertical transparent.
TermeAssocie: housse d'ostensoir
TermeAssocie: boîte d'ostensoir
TermeAssocie: voile huméral
TermeAssocie: reliquaire-ostensoir
TermeAssocie: voile d'ostensoir
TermeAssocie: voile d'exposition du saint sacrement
TermeAssocie: reliquaire-monstrance
status: 1

housse d'ostensoir
type: PreferredTerm
modified: 2014-12-02T16:36:41+01:00
created: 2014-01-15T14:54:24+01:00
status: 1

nécessaire orthodoxe pour la communion des malades
type: Concept
modified: 2014-01-10T00:00:00+01:00
in scheme: Thésaurus de la désignation des objets mobiliers
broader: objet du culte orthodoxe
created: 2012-05-16T00:00:00+02:00
definition: Coffret porté au cou, contenant une boîte pour la sainte réserve, un calice, une cuiller, deux flacons : un pour l'eau, l'autre pour le vin. Il s'agit en fait d'un petit tabernacle ou petit artophorion.
status: 1

nécessaire orthodoxe pour la communion des malades
type: PreferredTerm
modified: 2014-01-10T00:00:00+01:00
created: 2014-01-15T14:54:24+01:00
status: 1

basson
type: Concept
modified: 2014-10-10T11:39:54+02:00
in scheme: Thésaurus de la désignation des objets mobiliers
preferred label: bassoons @en-us
broader: aérophone à anche vibrante double
alternative label: contrebasson
created: 2012-05-16T00:00:00+02:00
definition: Instrument à clés et à plusieurs corps (quatre en général) de grande dimension que le musicien tient sur son côté droit. L'anche est fixée au bout d'un tube de métal en forme de point d'interrogation (bocal ou cuivret).
status: 1

contrebasson
type: SimpleNonPreferredTerm
modified: 2014-10-10T11:39:54+02:00
created: 2014-01-15T14:54:24+01:00
status: 1

basson
type: PreferredTerm
modified: 2014-10-10T11:39:54+02:00
created: 2014-01-15T14:54:24+01:00
status: 1

instrument de mesure des volumes
type: Concept
modified: 2014-12-15T15:17:43+01:00
in scheme: Thésaurus de la désignation des objets mobiliers
preferred label: quantity measuring devices @en-us
broader: instrument de mesure
alternative label: volumètre
alternative label: pluviomètre
alternative label: udomètre
created: 2012-05-16T00:00:00+02:00
definition: Instrument de mesure de capacités de solides, y compris les solides meubles, liquides et gaz, pour connaître leurs volumes, en litres, mètres cubes ou autres unités.
status: 1
narrow match: Pluviomètre

pluviomètre
type: SimpleNonPreferredTerm
modified: 2014-12-15T15:17:43+01:00
created: 2014-01-15T14:54:24+01:00
status: 1

udomètre
type: SimpleNonPreferredTerm
modified: 2014-12-15T15:17:43+01:00
created: 2014-01-15T14:54:24+01:00
status: 1

instrument de mesure
type: Concept
modified: 2014-10-23T10:35:28+02:00
in scheme: Thésaurus de la désignation des objets mobiliers
preferred label: measuring devices (instruments) @en-us
narrower: instrument de mesure des volumes
narrower: instrument de mesure des densités
narrower: instrument de mesure du temps
narrower: instrument de mesure des masses
narrower: instrument de mesure des forces des poids ou des pressions
narrower: instrument de mesure de phénomènes ondulatoires
narrower: T69-5350
narrower: T69-5310
narrower: T69-5249
narrower: T69-5281
broader: instrument pédagogique ou scientifique
alternative label: podomètre
alternative label: tribomètre
created: 2012-05-16T00:00:00+02:00
related: outil servant à mesurer ou dessiner
definition: Instrument scientifique destiné à déterminer des valeurs de certaines grandeurs par comparaison avec des valeurs constantes de même espèce (étalon, unité) prises comme terme de référence.
TermeAssocie: outil servant à mesurer ou dessiner
status: 1

instrument de mesure des volumes
type: PreferredTerm
modified: 2014-12-15T15:17:43+01:00
created: 2014-01-15T14:54:24+01:00
status: 1

volumètre
type: SimpleNonPreferredTerm
modified: 2014-12-15T15:17:43+01:00
created: 2014-01-15T14:54:24+01:00
status: 1

machine à fractionner
type: Concept
modified: 2014-01-10T00:00:00+01:00
in scheme: Thésaurus de la désignation des objets mobiliers
narrower: machine à déchiqueter
narrower: machine à écraser
narrower: machine à débiter
broader: machine à dissocier
created: 2012-05-16T00:00:00+02:00
definition: Machine à dissocier des matériaux ou des produits en les fragmentant en éléments plus petits.
status: 1

machine à déchiqueter
type: Concept
modified: 2015-10-09T11:52:16+02:00
in scheme: Thésaurus de la désignation des objets mobiliers
broader: machine à fractionner
alternative label: effilocheuse
alternative label: déchiqueteuse
alternative label: déchiqueteur
created: 2012-05-16T00:00:00+02:00
definition: Machine à fractionner des matériaux ou des produits en les réduisant en menus morceaux par arrachement.
status: 1
narrow match: http://vocab.getty.edu/aat/300024460
narrow match: Déchiqueteuse
narrow match: cb13507137r

machine à dissocier
type: Concept
modified: 2015-10-08T16:17:36+02:00
in scheme: Thésaurus de la désignation des objets mobiliers
narrower: machine à désassembler
narrower: machine à fractionner
narrower: machine à creuser
narrower: machine à séparer
broader: machine liée à la production industrielle
created: 2012-05-16T00:00:00+02:00
definition: Machine à disjoindre, par séparation, extraction ou division, des matériaux ou des produits.
status: 1

machine à écraser
type: Concept
modified: 2014-01-10T00:00:00+01:00
in scheme: Thésaurus de la désignation des objets mobiliers
narrower: machine à broyer
narrower: T69-5535
broader: machine à fractionner
created: 2012-05-16T00:00:00+02:00
definition: Machine à fractionner un matériau soit par choc ou par pression soit par les deux procédés.
status: 1

machine à fractionner
type: PreferredTerm
modified: 2014-01-10T00:00:00+01:00
created: 2014-01-15T14:54:24+01:00
status: 1

machine à débiter
type: Concept
modified: 2015-10-08T17:46:16+02:00
in scheme: Thésaurus de la désignation des objets mobiliers
narrower: T69-5543
narrower: T69-5541
narrower: T69-5539
broader: machine à fractionner
alternative label: débiteuse à lames
created: 2012-05-16T00:00:00+02:00
definition: Machine à fractionner par coupe et découpe préparatoires.
status: 1

calice
type: Concept
modified: 2014-11-27T14:00:28+01:00
in scheme: Thésaurus de la désignation des objets mobiliers
preferred label: chalices (liturgical vessels) @en-us
preferred label: cálice @pt
narrower: calice papal
narrower: calice purificatoire
narrower: calice de séminariste
broader: objet lié à l'Eucharistie
alternative label: calice à clochettes
alternative label: calice à anses
alternative label: calice de voyage
created: 2012-05-16T00:00:00+02:00
related: chapelle de messe
related: boîte de calice
related: voile du Jeudi saint pour le calice
related: pale
related: voile huméral
related: housse de calice
related: voile de calice
related: purificatoire
definition: Vase sacré dans lequel le célébrant consacre le vin pendant la messe. Il a la forme d'une coupe sur pied avec une tige comportant en général un nœud médian. Rituellement, la coupe, au moins, est en matériau précieux et, si elle n'est pas en or, l'intérieur doit en être doré ; elle est souvent doublée extérieurement d'une fausse-coupe, ajourée et indépendante. Le calice forme souvent un ensemble avec une patène et parfois un ciboire. Il existe quelques types rares de calice à anses, à clochettes.
TermeAssocie: chapelle de messe
TermeAssocie: boîte de calice
TermeAssocie: voile du Jeudi saint pour le calice
TermeAssocie: pale
TermeAssocie: voile huméral
TermeAssocie: housse de calice
TermeAssocie: voile de calice
TermeAssocie: purificatoire
status: 1

boîte de calice
type: Concept
modified: 2014-11-26T12:23:44+01:00
in scheme: Thésaurus de la désignation des objets mobiliers
preferred label: custodia di calice @it
preferred label: chalice cases @en-us
preferred label: estojo de cálice @pt
broader: boîte et coffret pour le rangement des objets liturgiques
alternative label: étui de calice
alternative label: boîte à calice
alternative label: écrin de calice
created: 2012-05-16T00:00:00+02:00
related: calice
related: housse de calice
related: patène
definition: Coffret dans lequel sont rangés un calice et souvent une patène. Il doit être doublé à l'intérieur. L'extérieur peut être recouvert de cuir, de toile ou encore être peint.
TermeAssocie: calice
TermeAssocie: housse de calice
TermeAssocie: patène
status: 1
broad match: http://vocab.getty.edu/aat/300194762

calice papal
type: Concept
modified: 2014-11-27T14:02:29+01:00
in scheme: Thésaurus de la désignation des objets mobiliers
preferred label: calice papale @it
preferred label: papal chalices @en-us
preferred label: cálice papal @pt
broader: calice
created: 2012-05-16T00:00:00+02:00
definition: Rare type de calice réservé à la liturgie papale et caractérisé par la présence d'un couvercle.
status: 1
broad match: http://vocab.getty.edu/aat/300194762

voile du Jeudi saint pour le calice
type: Concept
modified: 2014-12-03T11:16:10+01:00
in scheme: Thésaurus de la désignation des objets mobiliers
preferred label: velo del calice del Giovedi Santo @it
preferred label: Holy Thursday chalice veils @en-us
preferred label: véu de cálice de Quinta-feira Santa @pt
broader: linge ou garniture liés aux temps de Carême
alternative label: tabernacle du Jeudi saint
alternative label: voile du Jeudi saint
created: 2012-05-16T00:00:00+02:00
related: calice
definition: Voile circulaire en soie blanche destiné à couvrir entièrement le calice que l'on place dans le tabernacle du Jeudi saint. Il est muni d'un lien de soie blanche destiné à l'attacher au nœud du calice et peut comporter un galon ou une frange d'or.
TermeAssocie: calice
status: 1
broad match: http://data.bnf.fr/ark:/12148/cb11979303b

pale
type: Concept
modified: 2014-12-02T16:49:00+01:00
in scheme: Thésaurus de la désignation des objets mobiliers
preferred label: palls (chalice covers) @en-us
preferred label: palla @it
preferred label: pala @pt
broader: linge ou garniture liés à l'Eucharistie
alternative label: palle
created: 2012-05-16T00:00:00+02:00
related: calice
related: voile de calice
related: patène
definition: Linge consacré, de forme carrée, qui sert à couvrir le calice et la patène utilisés pendant la messe. La pale est renforcée à l'intérieur par un carton. Le dessous doit être en tissu blanc, de lin ou de chanvre. Le dessus, plus richement décoré, est marqué d’un symbole christique.
TermeAssocie: calice
TermeAssocie: voile de calice
TermeAssocie: patène
status: 1
broad match: cb11936841q

calice à anses
type: SimpleNonPreferredTerm
modified: 2014-11-27T14:00:28+01:00
created: 2014-01-15T14:54:24+01:00
status: 1

voile huméral
type: Concept
modified: 2014-12-03T12:01:40+01:00
in scheme: Thésaurus de la désignation des objets mobiliers
preferred label: velo omerale @it
preferred label: humeral veils @en-us
preferred label: véu de ombros @pt
broader: accessoire du costume liturgique des clercs
alternative label: voile huméral du saint sacrement
alternative label: vimpa
alternative label: voile de crédence
alternative label: écharpe d'acolyte
alternative label: voile huméral d'acolyte
alternative label: écharpe pour les saintes huiles
alternative label: voile huméral pour les saintes huiles
alternative label: voile huméral du sous-diacre
alternative label: voile huméral pour un reliquaire de la Vraie Croix
created: 2012-05-16T00:00:00+02:00
related: ostensoir
related: calice
related: patène
related: réserves aux saintes huiles
related: ciboire
related: ornement liturgique catholique
related: mitre
related: bâton pastoral
related: bougeoir pontifical
related: reliquaire
related: colletin
related: ciboire des malades
definition: Longue bande de tissu que l'on place sur les épaules et qui sert à couvrir les mains, lorsque l'on tient un objet sacré. Il comporte parfois à ses extrémités un crochet, une agrafe ou des rubans, qui servent à le maintenir en place durant les cérémonies, lorsqu'il n'est pas utilisé.
TermeAssocie: ostensoir
TermeAssocie: calice
TermeAssocie: patène
TermeAssocie: réserves aux saintes huiles
TermeAssocie: ciboire
TermeAssocie: ornement liturgique catholique
TermeAssocie: mitre
TermeAssocie: bâton pastoral
TermeAssocie: bougeoir pontifical
TermeAssocie: reliquaire
TermeAssocie: colletin
TermeAssocie: ciboire des malades
status: 1

housse de calice
type: Concept
modified: 2014-12-02T16:37:51+01:00
in scheme: Thésaurus de la désignation des objets mobiliers
preferred label: sacchetto per calice @it
preferred label: chalice bags @en-us
preferred label: saco de cálice @pt
broader: linge ou garniture liés à l'Eucharistie
alternative label: sac de calice
created: 2012-05-16T00:00:00+02:00
related: calice
related: boîte de calice
definition: Enveloppe servant à protéger un calice lorsqu'il n'est pas utilisé.
TermeAssocie: calice
TermeAssocie: boîte de calice
status: 1

voile de calice
type: Concept
modified: 2014-12-02T17:04:05+01:00
in scheme: Thésaurus de la désignation des objets mobiliers
preferred label: chalice veils @en-us
preferred label: velo di calice @it
preferred label: véu de calice @pt
broader: linge ou garniture liés à l'Eucharistie
alternative label: voile du calice
created: 2012-05-16T00:00:00+02:00
related: calice
related: pale
related: patène
definition: Etoffe carrée suffisamment ample pour recouvrir entièrement un calice surmonté d'un purificatoire, d'une patène et d'une pale. Normalement en soie, il peut faire partie d'un ornement et y être assorti.
TermeAssocie: calice
TermeAssocie: pale
TermeAssocie: patène
status: 1
broad match: http://data.bnf.fr/ark:/12148/cb11979303b

calice purificatoire
type: Concept
modified: 2014-11-27T14:03:29+01:00
in scheme: Thésaurus de la désignation des objets mobiliers
preferred label: calice purificatorio @it
preferred label: purificatory chalices @en-us
preferred label: cálice ministerial @pt
broader: calice
created: 2012-05-16T00:00:00+02:00
definition: Calice utilisé autrefois pour administrer du vin non consacré aux fidèles qui avaient communié afin d'éviter que puissent demeurer, dans la bouche, des particules d'hostie. Le calice purificatoire était généralement réalisé en matériau non précieux et n'avait pas de réelle fonction eucharistique.
status: 1

calice
type: PreferredTerm
modified: 2014-11-27T14:00:28+01:00
created: 2014-01-15T14:54:24+01:00
status: 1

purificatoire
type: Concept
modified: 2014-12-02T16:53:35+01:00
in scheme: Thésaurus de la désignation des objets mobiliers
preferred label: purificatoio @it
preferred label: purificators @en-us
preferred label: sanguíneo @pt
broader: linge ou garniture liés à l'Eucharistie
created: 2012-05-16T00:00:00+02:00
related: calice
related: T69-1397
definition: Linge blanc, généralement rectangulaire, en lin ou en chanvre, destiné à essuyer le calice ainsi que les lèvres et les doigts du prêtre célébrant.
TermeAssocie: calice
TermeAssocie: T69-1397
status: 1
broad match: http://data.bnf.fr/ark:/12148/cb119669330

calice de voyage
type: SimpleNonPreferredTerm
modified: 2014-11-27T14:00:28+01:00
created: 2014-01-15T14:54:24+01:00
status: 1

calice de séminariste
type: Concept
modified: 2014-11-27T14:01:48+01:00
in scheme: Thésaurus de la désignation des objets mobiliers
preferred label: calice del seminarista @it
preferred label: seminarian's chalices @en-us
preferred label: cálice de seminarista @pt
broader: calice
created: 2012-05-16T00:00:00+02:00
definition: Calice généralement non consacré, utilisé par les séminaristes pour apprendre à dire la messe. Il est souvent en matériaux non précieux et l'intérieur de la coupe n'a pas besoin d'être doré.
status: 1
broad match: http://vocab.getty.edu/aat/300194762

calice à clochettes
type: SimpleNonPreferredTerm
modified: 2014-11-27T14:00:28+01:00
created: 2014-01-15T14:54:24+01:00
status: 1

fusil (arme)
type: Concept
modified: 2014-12-12T14:39:37+01:00
in scheme: Thésaurus de la désignation des objets mobiliers
preferred label: rifles (long guns) @en-us
broader: arme d'épaule
alternative label: fusil à la miquelet
alternative label: fusil à silex
alternative label: fusil de chasse
alternative label: fusil à aiguille
alternative label: fusil à mèche
alternative label: fusil à rouet
alternative label: fusil à percussion
created: 2013-11-12T00:00:00+01:00
definition: Arme à feu pourvu d'une crosse d'épaule et dont le canon long possède une âme lisse.
status: 1

fusil à silex
type: SimpleNonPreferredTerm
modified: 2014-12-12T14:39:37+01:00
created: 2014-01-15T14:54:24+01:00
status: 1

fusil à percussion
type: SimpleNonPreferredTerm
modified: 2014-12-12T14:39:37+01:00
created: 2014-01-15T14:54:24+01:00
status: 1

fusil à mèche
type: SimpleNonPreferredTerm
modified: 2014-12-12T14:39:37+01:00
created: 2014-01-15T14:54:24+01:00
status: 1

fusil à la miquelet
type: SimpleNonPreferredTerm
modified: 2014-12-12T14:39:37+01:00
created: 2014-01-15T14:54:24+01:00
status: 1

fusil à aiguille
type: SimpleNonPreferredTerm
modified: 2014-12-12T14:39:37+01:00
created: 2014-01-15T14:54:24+01:00
status: 1

fusil de chasse
type: SimpleNonPreferredTerm
modified: 2014-12-12T14:39:37+01:00
created: 2014-01-15T14:54:24+01:00
status: 1

arme d'épaule
type: Concept
modified: 2014-12-12T14:36:52+01:00
in scheme: Thésaurus de la désignation des objets mobiliers
preferred label: long guns @en-us
narrower: fusil (arme)
narrower: carabine
broader: arme à feu
alternative label: arquebuse
alternative label: pétrinal
alternative label: pistolet mitrailleur
alternative label: tromblon
alternative label: mousquet
alternative label: mitraillette
alternative label: mousqueton (arme)
alternative label: fusil mitrailleur
alternative label: espingole
created: 2013-11-12T00:00:00+01:00
definition: Arme à feu individuelle épaulée pour le tir. Elle est généralement plus précise et plus puissante que l'arme de poing.
status: 1
broad match: http://data.bnf.fr/ark:/12148/cb119309557

fusil (arme)
type: PreferredTerm
modified: 2014-12-12T14:39:37+01:00
created: 2014-01-15T14:54:24+01:00
status: 1

fusil à rouet
type: SimpleNonPreferredTerm
modified: 2014-12-12T14:39:37+01:00
created: 2014-01-15T14:54:24+01:00
status: 1

salière saupoudreuse
type: Concept
modified: 2014-10-17T11:37:04+02:00
in scheme: Thésaurus de la désignation des objets mobiliers
preferred label: saltshakers @en-us
broader: salière
alternative label: saupoudreuse à sel
created: 2012-05-16T00:00:00+02:00
definition: Petite saupoudreuse à sel, en bois, métal ou céramique, à haut couvercle percé d'un ou plusieurs trous. Elle est souvent assortie à une poivrière saupoudreuse.
status: 1

saupoudreuse à sel
type: SimpleNonPreferredTerm
modified: 2014-10-17T11:37:04+02:00
created: 2014-01-15T14:54:24+01:00
status: 1

salière saupoudreuse
type: PreferredTerm
modified: 2014-10-17T11:37:04+02:00
created: 2014-01-15T14:54:24+01:00
status: 1

salière
type: Concept
modified: 2014-12-10T13:05:16+01:00
in scheme: Thésaurus de la désignation des objets mobiliers
preferred label: salts (condiment vessels) @en-us
narrower: salière saupoudreuse
broader: récipient pour le service ou la consommation des aliments
alternative label: salière double
alternative label: salière triple
alternative label: salière-poivrière
created: 2012-05-16T00:00:00+02:00
related: surtout de table
related: cuiller
definition: Récipient en métal, verre ou céramique pour le service du sel, présentant un réceptacle circulaire ou ovale, couvert ou non et à fond arrondi, le saleron. La salière peut être double ou triple, pour le sel fin, le gros sel et le poivre ou accompagnée d'un deuxième saleron pour le poivre. Elle peut faire partie d'un surtout.
TermeAssocie: surtout de table
TermeAssocie: cuiller
status: 1

amplificateur
type: Concept
modified: 2015-08-03T15:26:21+02:00
in scheme: Thésaurus de la désignation des objets mobiliers
broader: machine énergétique
alternative label: klystron
alternative label: résonateur
created: 2012-05-16T00:00:00+02:00
definition: Appareil destiné à modifier l'amplitude d'une source énergétique, en fournissant une puissance utile de sortie différente de la puissance d'entrée.
status: 1

machine énergétique
type: Concept
modified: 2015-10-07T15:24:00+02:00
in scheme: Thésaurus de la désignation des objets mobiliers
narrower: amplificateur
narrower: générateur
narrower: convertisseur
narrower: système de transmission
narrower: moteur
narrower: régulateur
created: 2012-05-16T00:00:00+02:00
definition: Machine constituée d'un ensemble d'organes dont les fonctions peuvent être de modifier, d'adapter, de changer, de transformer ou de produire de l’énergie.
status: 1

amplificateur
type: PreferredTerm
modified: 2015-08-03T15:26:21+02:00
created: 2014-01-15T14:54:24+01:00
status: 1

résonateur
type: SimpleNonPreferredTerm
modified: 2015-08-03T15:26:21+02:00
created: 2014-01-15T14:54:24+01:00
status: 1

klystron
type: SimpleNonPreferredTerm
modified: 2015-08-03T15:26:21+02:00
created: 2014-01-15T14:54:24+01:00
status: 1

tapis de table
type: Concept
modified: 2014-12-12T12:28:55+01:00
in scheme: Thésaurus de la désignation des objets mobiliers
preferred label: table carpets @en-us
broader: garniture de meuble
created: 2012-05-16T00:00:00+02:00
definition: Pièce d'étoffe épaisse, souvent ornée de broderies, recouvrant largement le plateau d'une table dans un but purement décoratif.
status: 1

garniture de meuble
type: Concept
modified: 2014-12-12T12:20:07+01:00
in scheme: Thésaurus de la désignation des objets mobiliers
preferred label: coverings and hangings for furniture @en-us
narrower: tapis de table
narrower: garniture de lit
narrower: coussin
narrower: garniture de siège
broader: textile, garniture ou vêtement laïcs
alternative label: feuille
alternative label: garniture de paravent
alternative label: garniture d'écran
created: 2012-05-16T00:00:00+02:00
related: écran à feu
related: paravent
related: écran à main
definition: Ensemble des éléments essentiellement en tissu, mais également en métal, en cuir, ou en papier, qui ornent ou garnissent un meuble.
TermeAssocie: écran à feu
TermeAssocie: paravent
TermeAssocie: écran à main
status: 1

tapis de table
type: PreferredTerm
modified: 2014-12-12T12:28:55+01:00
created: 2014-01-15T14:54:24+01:00
status: 1

cordophone composite
type: Concept
modified: 2014-10-10T12:33:25+02:00
in scheme: Thésaurus de la désignation des objets mobiliers
narrower: harpe
narrower: cordophone composite à manche et cordes pincées
narrower: T69-5043
broader: T69-5014
created: 2012-05-16T00:00:00+02:00
definition: Instrument dont les cordes sont tendues entre le résonateur d'un côté et un support de l'autre. Le plan des cordes peut être parallèle (famille générique des luths) ou perpendiculaire (famille générique des harpes) à la table d'harmonie.
status: 1
broad match: http://vocab.getty.edu/aat/300041641
broad match: cb11981325x
broad match: Instrument à cordes

harpe arquée
type: SimpleNonPreferredTerm
modified: 2014-12-15T11:49:34+01:00
created: 2014-01-15T14:54:24+01:00
status: 1

harpe ditale
type: SimpleNonPreferredTerm
modified: 2014-12-15T11:49:34+01:00
created: 2014-01-15T14:54:24+01:00
status: 1

harpe portative
type: SimpleNonPreferredTerm
modified: 2014-12-15T11:49:34+01:00
created: 2014-01-15T14:54:24+01:00
status: 1

harpe triangulaire
type: SimpleNonPreferredTerm
modified: 2014-12-15T11:49:34+01:00
created: 2014-01-15T14:54:24+01:00
status: 1

harpe
type: PreferredTerm
modified: 2014-12-15T11:49:34+01:00
created: 2014-01-15T14:54:24+01:00
status: 1

harpe chromatique
type: Concept
modified: 2014-10-10T13:00:13+02:00
in scheme: Thésaurus de la désignation des objets mobiliers
preferred label: chromatic harps @en-us
broader: harpe
created: 2013-12-19T00:00:00+01:00
definition: La harpe chromatique comporte deux plans de cordes croisés : un plan de cordes pour les bécarres, un plan pour les bémols et dièses. Elle permet l'exécution de tous les traits chromatiques avec une grande vitesse, mais contrairement à la harpe diatonique à pédales, elle ne permet pas les glissandi dans tous les modes et tonalités.
status: 1
broad match: Harpe

fourche d'âtre
type: Concept
modified: 2014-12-05T14:44:04+01:00
in scheme: Thésaurus de la désignation des objets mobiliers
preferred label: fire rakes @en-us
broader: objet d'âtre
alternative label: fourche à foyer
alternative label: fourche à fagot
alternative label: fourche à feu
created: 2012-05-16T00:00:00+02:00
definition: Petite fourche en métal à deux ou trois dents, munie d'un manche, servant à manier les bûches ou les fagots et à remuer les cendres.
status: 1

fourche à foyer
type: SimpleNonPreferredTerm
modified: 2014-12-05T14:44:04+01:00
created: 2014-01-15T14:54:24+01:00
status: 1

fourche d'âtre
type: PreferredTerm
modified: 2014-12-05T14:44:04+01:00
created: 2014-01-15T14:54:24+01:00
status: 1

fourche à feu
type: SimpleNonPreferredTerm
modified: 2014-12-05T14:44:04+01:00
created: 2014-01-15T14:54:24+01:00
status: 1

fourche à fagot
type: SimpleNonPreferredTerm
modified: 2014-12-05T14:44:04+01:00
created: 2014-01-15T14:54:24+01:00
status: 1

dessous-de-bouteille
type: SimpleNonPreferredTerm
modified: 2014-10-16T15:07:52+02:00
created: 2014-01-15T14:54:24+01:00
status: 1

dessous-de-carafe
type: PreferredTerm
modified: 2014-10-16T15:07:52+02:00
created: 2014-01-15T14:54:24+01:00
status: 1

plaque de Torah
type: Concept
modified: 2014-01-10T00:00:00+01:00
in scheme: Thésaurus de la désignation des objets mobiliers
broader: objet lié à la Torah
alternative label: tass
created: 2012-05-16T00:00:00+02:00
definition: Plaque en argent richement ornée où sont indiqués le nom du donateur et le nom des fêtes.
status: 1

plaque de Torah
type: PreferredTerm
modified: 2014-01-10T00:00:00+01:00
created: 2014-01-15T14:54:24+01:00
status: 1

objet lié à la Torah
type: Concept
modified: 2014-01-10T00:00:00+01:00
in scheme: Thésaurus de la désignation des objets mobiliers
narrower: plaque de Torah
narrower: Torah
narrower: T69-1915
narrower: T69-1918
narrower: T69-1905
narrower: T69-1911
narrower: T69-1908
broader: objet lié au culte synagogal
created: 2012-05-16T00:00:00+02:00
status: 1

tass
type: SimpleNonPreferredTerm
modified: 2014-01-10T00:00:00+01:00
created: 2014-01-15T14:54:24+01:00
status: 1

cuiller
type: Concept
modified: 2014-12-05T16:09:38+01:00
in scheme: Thésaurus de la désignation des objets mobiliers
preferred label: spoons @en-us
broader: instrument pour la préparation - le service ou la consommation des aliments et des boissons
alternative label: poche à remuer
alternative label: cuiller à macérer
alternative label: cuiller à glace
alternative label: cuiller à entremets
alternative label: cuiller à compote dégraisser
alternative label: pince à salade
alternative label: cuiller à olives
alternative label: cuiller à salade
alternative label: cuiller à pot
alternative label: cuiller à sucre en poudre
alternative label: cuiller à sauce
alternative label: cuiller à café
alternative label: cuiller à thé
alternative label: cuiller à sel
alternative label: cuiller à feuilles de thé
alternative label: cuiller à puiser les œufs
alternative label: cuiller à fraises
alternative label: cuiller à soupe
alternative label: cuiller à servir
alternative label: cuiller de saucière
alternative label: cuiller à dessert
alternative label: cuiller à œuf
alternative label: cuiller à écrémer
alternative label: cuiller pliante
alternative label: cuiller-fourchette
alternative label: cuiller à absinthe
alternative label: cuiller à bouillie
alternative label: cuillère
alternative label: cuiller à moelle
alternative label: cuiller à fonde sauce
alternative label: cuiller à moutarde
alternative label: cuiller de verre d'eau
created: 2012-05-16T00:00:00+02:00
related: verre d'eau
related: salière
related: sucrier
related: boîte à thé ou à café
related: moutardier
definition: Instrument servant à préparer les aliments, à les porter à la bouche ou encore à les transvaser d'un récipient dans un autre. La cuiller est constituée par un réceptacle, à fond arrondi, le cuilleron, généralement prolongé par un manche.
TermeAssocie: verre d'eau
TermeAssocie: salière
TermeAssocie: sucrier
TermeAssocie: boîte à thé ou à café
TermeAssocie: moutardier
status: 1

salière triple
type: SimpleNonPreferredTerm
modified: 2014-12-10T13:05:16+01:00
created: 2014-01-15T14:54:24+01:00
status: 1

salière
type: PreferredTerm
modified: 2014-12-10T13:05:16+01:00
created: 2014-01-15T14:54:24+01:00
status: 1

salière-poivrière
type: SimpleNonPreferredTerm
modified: 2014-12-10T13:05:16+01:00
created: 2014-01-15T14:54:24+01:00
status: 1

salière double
type: SimpleNonPreferredTerm
modified: 2014-12-10T13:05:16+01:00
created: 2014-01-15T14:54:24+01:00
status: 1

colombe eucharistique orthodoxe
type: Concept
modified: 2014-01-10T00:00:00+01:00
in scheme: Thésaurus de la désignation des objets mobiliers
broader: objet du culte orthodoxe
created: 2012-05-16T00:00:00+02:00
definition: Vase sacré en forme de colombe, dans lequel étaient conservées les saintes espèces (ou les saint dons) . La colombe est suspendue par des chaînes au-dessus de l'autel ; elle est parfois sous un dais.
status: 1

colombe eucharistique orthodoxe
type: PreferredTerm
modified: 2014-01-10T00:00:00+01:00
created: 2014-01-15T14:54:24+01:00
status: 1

autel mobile
type: SimpleNonPreferredTerm
modified: 2014-11-27T12:02:12+01:00
created: 2014-01-15T14:54:24+01:00
status: 1

autel portatif
type: PreferredTerm
modified: 2014-11-27T12:02:12+01:00
created: 2014-01-15T14:54:24+01:00
status: 1

tableau de tapisserie
type: Concept
modified: 2014-12-03T16:39:03+01:00
in scheme: Thésaurus de la désignation des objets mobiliers
broader: tableau
created: 2012-05-16T00:00:00+02:00
related: pièce de broderie
definition: Œuvre constituée d'une pièce de tapisserie destinée à reproduire, dans le matériau et avec la technique qui lui sont propres, les effets du tableau de peinture.
TermeAssocie: pièce de broderie
status: 1
broad match: http://data.bnf.fr/ark:/12148/cb119336376

tableau de tapisserie
type: PreferredTerm
modified: 2014-12-03T16:39:03+01:00
created: 2014-01-15T14:54:24+01:00
status: 1

machine à déboulonner
type: Concept
modified: 2015-08-11T16:26:43+02:00
in scheme: Thésaurus de la désignation des objets mobiliers
broader: machine à désassembler
created: 2012-05-16T00:00:00+02:00
definition: Machine à détacher des éléments boulonnés.
status: 1

machine à déboulonner
type: PreferredTerm
modified: 2015-08-11T16:26:43+02:00
created: 2014-01-15T14:54:24+01:00
status: 1

barrière de lit
type: Concept
modified: 2014-12-04T15:12:19+01:00
in scheme: Thésaurus de la désignation des objets mobiliers
broader: meuble de protection
created: 2012-05-16T00:00:00+02:00
definition: Petite barrière mobile portée par deux montants que l'on glisse contre la façade d'un lit mi-clos, à l'intérieur, pour empêcher les enfants de tomber et la literie de se déplacer.
status: 1
broad match: http://data.bnf.fr/ark:/12148/cb131627263
broad match: http://vocab.getty.edu/aat/300005043

barrière de lit
type: PreferredTerm
modified: 2014-12-04T15:12:19+01:00
created: 2014-01-15T14:54:24+01:00
status: 1

véhicule tout terrain
type: Concept
modified: 2014-12-30T11:04:20+01:00
in scheme: Thésaurus de la désignation des objets mobiliers
preferred label: off-road vehicles @en-us
broader: véhicule routier motorisé spécialisé
alternative label: jeep
alternative label: quatre-quatre
alternative label: quad
alternative label: half-track
alternative label: autochenille
alternative label: chenillette
created: 2013-11-06T00:00:00+01:00
definition: Véhicule automobile dont les quatre roues sont motrices ou dont le roulement est assuré par des chenilles et qui peut circuler en dehors des chemins carrossables.
status: 1
broad match: http://vocab.getty.edu/aat/300227809

quad
type: SimpleNonPreferredTerm
modified: 2014-12-30T11:04:20+01:00
created: 2014-01-15T14:54:24+01:00
status: 1

half-track
type: SimpleNonPreferredTerm
modified: 2014-12-30T11:04:20+01:00
created: 2014-01-15T14:54:24+01:00
status: 1

quatre-quatre
type: SimpleNonPreferredTerm
modified: 2014-12-30T11:04:20+01:00
created: 2014-01-15T14:54:24+01:00
status: 1

chenillette
type: SimpleNonPreferredTerm
modified: 2014-12-30T11:04:20+01:00
created: 2014-01-15T14:54:24+01:00
status: 1

autochenille
type: SimpleNonPreferredTerm
modified: 2014-12-30T11:04:20+01:00
created: 2014-01-15T14:54:24+01:00
status: 1

véhicule tout terrain
type: PreferredTerm
modified: 2014-12-30T11:04:20+01:00
created: 2014-01-15T14:54:24+01:00
status: 1

jeep
type: SimpleNonPreferredTerm
modified: 2014-12-30T11:04:20+01:00
created: 2014-01-15T14:54:24+01:00
status: 1

réserve à cendres
type: Concept
modified: 2014-09-11T11:27:03+02:00
in scheme: Thésaurus de la désignation des objets mobiliers
broader: coffre
created: 2012-05-16T00:00:00+02:00
definition: Cavité située dans un mur de l'âtre ou sous le four, parfois fermée par un battant, dans laquelle on met les cendres froides qui servent à la lessive.
status: 1
broad match: http://vocab.getty.edu/aat/300038992

coffre
type: Concept
modified: 2014-12-04T16:22:33+01:00
in scheme: Thésaurus de la désignation des objets mobiliers
preferred label: chests (case furniture) @en-us
narrower: réserve à cendres
narrower: malle
narrower: coffre à bois
narrower: coffre à charbon
narrower: coffre-réserve
narrower: coffre de communauté laïque
narrower: coffre-fort
narrower: coffre à vêtements
broader: meuble de rangement et d'exposition
alternative label: coffre garde-manger
alternative label: coffre à linge sale
alternative label: coffret à jouets
created: 2012-05-16T00:00:00+02:00
definition: Meuble servant au rangement d'objets éventuellement spécifiques ou à la conservation d'aliments. Il est constitué d'un corps fermé accessible par un dessus ouvrant et peut être au sol ou monté sur un support.
status: 1

réserve à cendres
type: PreferredTerm
modified: 2014-09-11T11:27:03+02:00
created: 2014-01-15T14:54:24+01:00
status: 1

mesure
type: Concept
modified: 2014-01-10T00:00:00+01:00
in scheme: Thésaurus de la désignation des objets mobiliers
broader: outil servant à mesurer ou dessiner
alternative label: mesure à grains
alternative label: velte
alternative label: typomètre
alternative label: mesure à huile
created: 2013-12-16T00:00:00+01:00
related: mesure de référence
TermeAssocie: mesure de référence
status: 1

mesure de référence
type: PreferredTerm
modified: 2014-09-09T16:10:39+02:00
created: 2014-01-15T14:54:24+01:00
status: 1

masse marquée
type: Concept
modified: 2014-12-15T15:50:49+01:00
in scheme: Thésaurus de la désignation des objets mobiliers
preferred label: weights (scale components) @en-us
broader: mesure de référence
alternative label: pile de Charlemagne
alternative label: poids
created: 2013-12-16T00:00:00+01:00
related: balance
definition: Objet de masse déterminée, appelé dans le langage courant "poids", utilisé pour peser avec une balance à plateaux.
TermeAssocie: balance
status: 1

instrument pédagogique ou scientifique
type: Concept
modified: 2014-09-09T09:54:24+02:00
in scheme: Thésaurus de la désignation des objets mobiliers
preferred label: educational or scientific instruments @en-us
narrower: mesure de référence
narrower: instrument de mesure
narrower: instrument de mise en condition ou de préparation
narrower: instrument de calcul
narrower: instrument de démonstration de phénomènes physiques
narrower: instrument d'observation
broader: instrument ou objet pédagogique ou scientifique
created: 2012-05-16T00:00:00+02:00
definition: Instrument destiné à permettre l’observation, la mise en évidence, la mesure de phénomènes ou d’éléments physico-chimiques à des fins de recherche, d’expérimentation, d’enseignement ou de contrôle.
status: 1
narrow match: http://data.bnf.fr/ark:/12148/cb131627890

outil servant à mesurer ou dessiner
type: Concept
modified: 2014-01-10T00:00:00+01:00
in scheme: Thésaurus de la désignation des objets mobiliers
narrower: mesure
narrower: balance
narrower: équerre
narrower: T69-9663
narrower: T69-9660
broader: outil
alternative label: trusquin
created: 2013-12-16T00:00:00+01:00
related: mesure de référence
related: instrument de mesure
related: T69-5281
TermeAssocie: mesure de référence
TermeAssocie: instrument de mesure
TermeAssocie: T69-5281
status: 1

hautbois
type: Concept
modified: 2014-10-10T11:42:51+02:00
in scheme: Thésaurus de la désignation des objets mobiliers
preferred label: oboes @en-us
broader: aérophone à anche vibrante double
alternative label: cor anglais
alternative label: hautbois d'amour
alternative label: hautbois de chasse
created: 2012-05-16T00:00:00+02:00
definition: Instrument, de perce conique, composé d'un corps haut, d'un corps bas et d'un pavillon. En bois ou en ivoire, il peut avoir des clés. On distingue le hautbois d'amour (alto), le cor anglais (ténor) dont le pavillon est en forme de poire ou le hautbois de chasse, au pavillon évasé.
status: 1

cornemuse
type: Concept
modified: 2014-12-12T16:04:00+01:00
in scheme: Thésaurus de la désignation des objets mobiliers
preferred label: bagpipes @en-us
broader: aérophone à anche vibrante double
alternative label: musette de Bresse
alternative label: chabrette limousine
alternative label: cabrette auvergnate
alternative label: veuze de Vendée
alternative label: biniou
alternative label: musette de cour
created: 2012-05-16T00:00:00+02:00
definition: Instrument où l'air est insufflé par la bouche à l'aide d'un tuyau porte-vent (plus rarement par un soufflet) dans un sac de cuir. Il s'échappe ensuite de manière continu vers les tuyaux de bois. Certains ne sont pas percés de trous de jeu (bourdons) tandis que les trous du tuyau mélodique sont ouverts ou fermés par les doigts du musicien (parfois par des clés). Le biniou est une cornemuse bretonne.
status: 1

aérophone à anche vibrante double
type: PreferredTerm
modified: 2014-10-10T11:39:16+02:00
created: 2014-01-15T14:54:24+01:00
status: 1

sarrusophone
type: SimpleNonPreferredTerm
modified: 2014-10-10T11:39:16+02:00
created: 2014-01-15T14:54:24+01:00
status: 1

cromorne
type: Concept
modified: 2014-10-10T11:42:07+02:00
in scheme: Thésaurus de la désignation des objets mobiliers
preferred label: crumhorns @en-us
broader: aérophone à anche vibrante double
alternative label: tournebout
created: 2012-05-16T00:00:00+02:00
definition: Instrument en bois en forme de J, à huit trous sur l'avers et un au revers. L'anche est enfermée dans une sorte de capsule (cuivret) qui interdit le contact direct avec les lèvres.
status: 1

machine à laminer
type: Concept
modified: 2015-08-13T12:45:06+02:00
in scheme: Thésaurus de la désignation des objets mobiliers
broader: machine à allonger
alternative label: laminoir (machine)
created: 2012-05-16T00:00:00+02:00
scope note: Voir aussi le Thésaurus de la désignation des œuvres architecturales et des espaces aménagés (usine de transformation des métaux).
definition: Machine à allonger un matériau ou un produit par pression ou traction entre deux cylindres lisses ou cannelés en rotation.
status: 1
narrow match: http://vocab.getty.edu/aat/300006316

machine à allonger
type: Concept
modified: 2014-01-10T00:00:00+01:00
in scheme: Thésaurus de la désignation des objets mobiliers
narrower: machine à laminer
narrower: machine à marteler
narrower: machine à tréfiler
narrower: machine à extruder
broader: machine à modeler
created: 2012-05-16T00:00:00+02:00
definition: Machine à modeler un matériau ou un produit pour en augmenter la longueur.
status: 1

machine à laminer
type: PreferredTerm
modified: 2015-08-13T12:45:06+02:00
created: 2014-01-15T14:54:24+01:00
status: 1

laminoir (machine)
type: SimpleNonPreferredTerm
modified: 2015-08-13T12:45:06+02:00
created: 2014-01-15T14:54:24+01:00
status: 1

housse de calice
type: PreferredTerm
modified: 2014-12-02T16:37:51+01:00
created: 2014-01-15T14:54:24+01:00
status: 1

sac de calice
type: SimpleNonPreferredTerm
modified: 2014-12-02T16:37:51+01:00
created: 2014-01-15T14:54:24+01:00
status: 1

rideau de fond
type: SimpleNonPreferredTerm
modified: 2014-10-20T11:50:02+02:00
created: 2014-01-15T14:54:24+01:00
status: 1

toile de fond
type: PreferredTerm
modified: 2014-10-20T11:50:02+02:00
created: 2014-01-15T14:54:24+01:00
status: 1

décor de théâtre
type: SimpleNonPreferredTerm
modified: 2014-10-20T11:50:02+02:00
created: 2014-01-15T14:54:24+01:00
status: 1

matériel pour l'élevage
type: Concept
modified: 2014-01-10T00:00:00+01:00
in scheme: Thésaurus de la désignation des objets mobiliers
narrower: castelet
narrower: marque à bétail
narrower: collier d'animal
narrower: nichoir
narrower: auge-abreuvoir
narrower: ruche
narrower: bracelet d'animal
broader: matériel agricole
alternative label: redresse-cornes
alternative label: biberon d'animal
alternative label: cage à poule
alternative label: caisse de transport d'animaux
alternative label: entrave
created: 2013-12-16T00:00:00+01:00
related: meuble pour animal familier
related: harnachement ou attelage
related: sonnaille de troupeau
TermeAssocie: meuble pour animal familier
TermeAssocie: harnachement ou attelage
TermeAssocie: sonnaille de troupeau
status: 1

castelet
type: Concept
modified: 2014-01-10T00:00:00+01:00
in scheme: Thésaurus de la désignation des objets mobiliers
broader: matériel pour l'élevage
created: 2013-12-16T00:00:00+01:00
status: 1

marque à bétail
type: Concept
modified: 2014-01-10T00:00:00+01:00
in scheme: Thésaurus de la désignation des objets mobiliers
broader: matériel pour l'élevage
created: 2013-12-16T00:00:00+01:00
status: 1

collier d'animal
type: Concept
modified: 2014-01-10T00:00:00+01:00
in scheme: Thésaurus de la désignation des objets mobiliers
broader: matériel pour l'élevage
created: 2013-12-16T00:00:00+01:00
status: 1

biberon d'animal
type: SimpleNonPreferredTerm
modified: 2014-01-10T00:00:00+01:00
created: 2014-01-15T14:54:24+01:00
status: 1

nichoir
type: Concept
modified: 2014-01-10T00:00:00+01:00
in scheme: Thésaurus de la désignation des objets mobiliers
narrower: boulin
broader: matériel pour l'élevage
created: 2013-12-16T00:00:00+01:00
status: 1

harnachement ou attelage
type: Concept
modified: 2014-12-30T11:29:06+01:00
in scheme: Thésaurus de la désignation des objets mobiliers
preferred label: animal work equipment @en-us
narrower: bât ou ses accessoires
narrower: harnais ou ses accessoires
narrower: selle de cavalier ou ses accessoires
narrower: fouet
broader: véhicule à énergie animale
alternative label: palonnier
created: 2013-11-05T00:00:00+01:00
related: matériel pour l'élevage
related: protection d'animal
definition: Ensemble des éléments équipant les chevaux de selle et, par extension, tous les animaux de selle et de trait, et des éléments assurant la jonction avec le véhicule tracté.
TermeAssocie: matériel pour l'élevage
TermeAssocie: protection d'animal
status: 1

entrave
type: SimpleNonPreferredTerm
modified: 2014-01-10T00:00:00+01:00
created: 2014-01-15T14:54:24+01:00
status: 1

auge-abreuvoir
type: Concept
modified: 2014-01-10T00:00:00+01:00
in scheme: Thésaurus de la désignation des objets mobiliers
broader: matériel pour l'élevage
created: 2013-12-16T00:00:00+01:00
status: 1

cage à poule
type: SimpleNonPreferredTerm
modified: 2014-01-10T00:00:00+01:00
created: 2014-01-15T14:54:24+01:00
status: 1

matériel pour l'élevage
type: PreferredTerm
modified: 2014-01-10T00:00:00+01:00
created: 2014-01-15T14:54:24+01:00
status: 1

sonnaille de troupeau
type: Concept
modified: 2014-12-15T12:49:33+01:00
in scheme: Thésaurus de la désignation des objets mobiliers
preferred label: cowbells @en-us
broader: idiophone à émission par percussion indirecte (secouement ou raclement)
created: 2012-05-16T00:00:00+02:00
related: matériel pour l'élevage
definition: Cloche en métal attachée au cou des bestiaux. Suspendue à un collier de bois souvent décoré, sa forme varie selon le type d'animal et son rôle dans le troupeau.
TermeAssocie: matériel pour l'élevage
status: 1

ruche
type: Concept
modified: 2014-01-10T00:00:00+01:00
in scheme: Thésaurus de la désignation des objets mobiliers
broader: matériel pour l'élevage
created: 2013-12-16T00:00:00+01:00
status: 1

caisse de transport d'animaux
type: SimpleNonPreferredTerm
modified: 2014-01-10T00:00:00+01:00
created: 2014-01-15T14:54:24+01:00
status: 1

redresse-cornes
type: SimpleNonPreferredTerm
modified: 2014-01-10T00:00:00+01:00
created: 2014-01-15T14:54:24+01:00
status: 1

bracelet d'animal
type: Concept
modified: 2014-01-10T00:00:00+01:00
in scheme: Thésaurus de la désignation des objets mobiliers
broader: matériel pour l'élevage
created: 2013-12-16T00:00:00+01:00
status: 1

matériel agricole
type: Concept
modified: 2014-01-10T00:00:00+01:00
in scheme: Thésaurus de la désignation des objets mobiliers
narrower: matériel pour l'élevage
narrower: matériel pour la culture et l'horticulture
broader: matériel agricole, professionnel et artisanal
created: 2013-12-16T00:00:00+01:00
status: 1

machine à mettre en boîte
type: Concept
modified: 2015-10-14T16:07:39+02:00
in scheme: Thésaurus de la désignation des objets mobiliers
broader: machine à conditionner
created: 2012-05-16T00:00:00+02:00
definition: Machine à conditionner un produit dans une boîte.
status: 1
broad match: cb12011474j

machine à mettre en boîte
type: PreferredTerm
modified: 2015-10-14T16:07:39+02:00
created: 2014-01-15T14:54:24+01:00
status: 1

soutanelle de confrérie
type: Concept
modified: 2014-12-03T12:44:46+01:00
in scheme: Thésaurus de la désignation des objets mobiliers
preferred label: confraternity habits @en-us
preferred label: veste di confraternita @it
preferred label: opa de confraria @pt
broader: autre vêtement catholique
created: 2012-05-16T00:00:00+02:00
scope note: Vêtement de dessus généralement noir avec un décor de galon au bas des manches, semblable à une soutane courte et utilisé par les membres d'une confrérie.
related: soutane
TermeAssocie: soutane
status: 1

soutane
type: Concept
modified: 2014-12-03T14:28:28+01:00
in scheme: Thésaurus de la désignation des objets mobiliers
preferred label: cassocks @en-us
preferred label: veste talare @it
preferred label: sotaina @pt
broader: vêtement liturgique de dessous
alternative label: soutane prélatice
created: 2012-05-16T00:00:00+02:00
related: calotte
related: soutanelle de confrérie
related: ceinture de vêtement liturgique
related: rabat
definition: Robe boutonnée sur le devant, portée sous les vêtements liturgiques, et souvent avec une ceinture, dans le chœur, par tous les clercs, les enfants de chœur et parfois par certains chantres laïcs et bedeaux, lors des offices. La soutane est aussi portée par les clercs, en dehors des églises, comme vêtement ordinaire de dessus. La soutane prélatice est munie d’une traîne et portée par les prélats.
TermeAssocie: calotte
TermeAssocie: soutanelle de confrérie
TermeAssocie: ceinture de vêtement liturgique
TermeAssocie: rabat
status: 1
broad match: cb11941484w

autre vêtement catholique
type: Concept
modified: 2014-10-22T12:09:07+02:00
in scheme: Thésaurus de la désignation des objets mobiliers
preferred label: particolari paramenti de chiesa @it
preferred label: other church vestments @en-us
narrower: soutanelle de confrérie
narrower: robe de baptême de cloche
narrower: rabat de confrérie
narrower: dalmatique de confrérie
narrower: costume de suisse
narrower: costume de pénitent
narrower: collet de confrérie
narrower: costume de communion
narrower: camail de confrérie
narrower: aube de confrérie
narrower: costume de bedeau
narrower: T69-6840
narrower: T69-2595
narrower: T69-2597
narrower: T69-2601
narrower: T69-7371
broader: vêtement du culte catholique
created: 2012-05-16T00:00:00+02:00
definition: Vêtement ou accessoire destiné aux membres laïques de la communauté religieuse et, par extension, à certains objets lors de célébrations.
status: 1

soutanelle de confrérie
type: PreferredTerm
modified: 2014-12-03T12:44:46+01:00
created: 2014-01-15T14:54:24+01:00
status: 1

traverse
type: Concept
modified: 2014-10-15T13:21:22+02:00
in scheme: Thésaurus de la désignation des objets mobiliers
preferred label: transoms @en-us
broader: remplage
created: 2012-05-16T00:00:00+02:00
definition: Elément horizontal d'un remplage de fenêtre, réalisé dans le même matériau que l'embrasure.
status: 1
broad match: http://data.bnf.fr/ark:/12148/cb125704047

traverse
type: PreferredTerm
modified: 2014-10-15T13:21:22+02:00
created: 2014-01-15T14:54:24+01:00
status: 1

porte-écuelles
type: Concept
modified: 2014-10-13T12:34:19+02:00
in scheme: Thésaurus de la désignation des objets mobiliers
broader: meuble-support
created: 2012-05-16T00:00:00+02:00
related: écuelle
definition: Ensemble de tablettes superposées à trous de la dimension d'écuelles, servant à les garder près du feu une fois pleines ou à les transporter aux champs, grâce à une large poignée. Le porte-écuelles peut comporter un porte-couverts.
TermeAssocie: écuelle
status: 1
broad match: http://vocab.getty.edu/aat/300039337
broad match: cb13562642r

porte-écuelles
type: PreferredTerm
modified: 2014-10-13T12:34:19+02:00
created: 2014-01-15T14:54:24+01:00
status: 1

écuelle
type: Concept
modified: 2014-12-08T16:39:05+01:00
in scheme: Thésaurus de la désignation des objets mobiliers
preferred label: écuelles @en-us
broader: récipient pour le service ou la consommation des aliments
alternative label: écuelle de fiançailles
alternative label: écuelle à compartiments
alternative label: écuelle de mariage
created: 2012-05-16T00:00:00+02:00
related: soucoupe
related: porte-écuelles
related: T69-3922
definition: Récipient individuel généralement couvert, en bois, céramique ou métal, servant à consommer des aliments chauds. L'écuelle est circulaire, à fond plat et parois évasées et à deux oreilles ou deux anses. Le couvercle peut servir de saleron ou d’assiette une fois retourné.
TermeAssocie: soucoupe
TermeAssocie: porte-écuelles
TermeAssocie: T69-3922
status: 1
broad match: http://data.bnf.fr/ark:/12148/cb11978277c

armoire-verrier
type: Concept
modified: 2014-10-13T10:31:56+02:00
in scheme: Thésaurus de la désignation des objets mobiliers
broader: armoire
created: 2012-05-16T00:00:00+02:00
definition: Petite armoire, souvent vitrée, servant à ranger des verres.
status: 1
broad match: http://vocab.getty.edu/aat/300039183
broad match: Armoire

armoire-verrier
type: PreferredTerm
modified: 2014-10-13T10:31:56+02:00
created: 2014-01-15T14:54:24+01:00
status: 1

reposoir
type: Concept
modified: 2014-12-02T10:22:46+01:00
in scheme: Thésaurus de la désignation des objets mobiliers
preferred label: altare stazionale @it
preferred label: reposoirs @en-us
preferred label: repositório @pt
broader: meuble lié à la procession et à la dévotion
created: 2012-05-16T00:00:00+02:00
definition: Edicule ou meuble en forme d'autel sur lequel on dépose le saint sacrement, une statue ou tout autre objet sacré lors d'une station de procession. Le reposoir peut être situé dans une église ou à l'extérieur.
status: 1
broad match: cb11943953g
broad match: http://vocab.getty.edu/aat/300003725

reposoir
type: PreferredTerm
modified: 2014-12-02T10:22:46+01:00
created: 2014-01-15T14:54:24+01:00
status: 1

pilier
type: Concept
modified: 2015-02-20T12:57:15+01:00
in scheme: Thésaurus de la désignation des objets mobiliers
preferred label: pillars @en-us
broader: support vertical
created: 2012-05-16T00:00:00+02:00
definition: Support vertical pouvant avoir une base, un chapiteau et un fût, dont le corps a un plan massé quelconque, à l'exclusion de celui de la colonne.
status: 1

pilier
type: PreferredTerm
modified: 2015-02-20T12:57:15+01:00
created: 2014-01-15T14:54:24+01:00
status: 1

machine à limer
type: Concept
modified: 2015-10-14T14:25:07+02:00
in scheme: Thésaurus de la désignation des objets mobiliers
broader: machine à usiner par outil de coupe
created: 2012-05-16T00:00:00+02:00
definition: Machine à usiner par outil de coupe à lame couverte de stries dentées et animées d'un mouvement alternatif, pour réaliser des travaux d'ébauche.
status: 1
broad match: Limage

machine à limer
type: PreferredTerm
modified: 2015-10-14T14:25:07+02:00
created: 2014-01-15T14:54:24+01:00
status: 1

chaise de lecteur
type: Concept
modified: 2014-12-02T14:46:35+01:00
in scheme: Thésaurus de la désignation des objets mobiliers
preferred label: sedia del lettore @it
preferred label: reader's chairs @en-us
preferred label: cadeira de leitor @pt
broader: siège et agenouilloir d'église du culte catholique
created: 2012-05-16T00:00:00+02:00
related: chaise de temple
definition: Chaise réservée à un lecteur ou à un chantre durant les offices. Elle comporte un siège surélevé et incliné pour paraître debout tout en étant assis.
TermeAssocie: chaise de temple
status: 1
broad match: http://vocab.getty.edu/aat/300037772

chaise de temple
type: Concept
modified: 2014-01-10T00:00:00+01:00
in scheme: Thésaurus de la désignation des objets mobiliers
broader: siège liturgique protestant
created: 2012-05-16T00:00:00+02:00
scope note: Préciser la fonction secondaire exacte dans le champ PDEN.
related: chaise de lecteur
definition: Il peut s'agir d'une chaise de fidèle protestant, d'une chaise de chantre ou d'une chaise de lecteur, chaise réservée à un lecteur ou à un chantre durant les offices et qui comporte un siège surélevé et incliné pour que l'on puisse paraître debout tout en étant assis.
TermeAssocie: chaise de lecteur
status: 1

chaise de lecteur
type: PreferredTerm
modified: 2014-12-02T14:46:35+01:00
created: 2014-01-15T14:54:24+01:00
status: 1

véhicule routier motorisé publicitaire
type: Concept
modified: 2014-10-16T11:25:36+02:00
in scheme: Thésaurus de la désignation des objets mobiliers
broader: véhicule routier motorisé spécialisé
created: 2013-11-06T00:00:00+01:00
definition: Véhicule motorisé doté d'un système d'affichage publicitaire ou d'éléments publicitaires tridimensionnels. Il comporte souvent un éclairage et une sonorisation.
status: 1
broad match: http://vocab.getty.edu/aat/300249572
broad match: Affichage mobile

véhicule routier motorisé publicitaire
type: PreferredTerm
modified: 2014-10-16T11:25:36+02:00
created: 2014-01-15T14:54:24+01:00
status: 1

trône épiscopal
type: Concept
modified: 2014-12-02T15:26:06+01:00
in scheme: Thésaurus de la désignation des objets mobiliers
preferred label: cattedra episcopale @it
preferred label: cathedrae (bishop's chairs) @en-us
preferred label: cátedra episcopal @pt
broader: trône pontifical
alternative label: siège épiscopal
alternative label: cathèdre
created: 2012-05-16T00:00:00+02:00
scope note: Il peut y en avoir deux : l’un du côté de l'Evangile pour l'évêque et l’autre du côté de l'Epître pour l'archevêque.
related: tenture de trône pontifical
related: armoiries d'évêque
related: tapis de trône pontifical
definition: Siège de chœur de taille importante réservé à un évêque ou à un archevêque dans son diocèse, placé, sur une estrade à trois marches et souvent surmonté d'un dais. Fixe dans les cathédrales, il est, dans les autres édifices, dressé pour les messes pontificales.
TermeAssocie: tenture de trône pontifical
TermeAssocie: armoiries d'évêque
TermeAssocie: tapis de trône pontifical
status: 1

tenture de trône pontifical
type: Concept
modified: 2014-12-03T11:09:13+01:00
in scheme: Thésaurus de la désignation des objets mobiliers
preferred label: copertura della cattedra pontificale @it
preferred label: pontifical throne covers @en-us
preferred label: cobertura de trono pontifical @pt
broader: linge ou garniture liés aux sièges
alternative label: tenture de la chaire épiscopale
created: 2012-05-16T00:00:00+02:00
related: trône pontifical
related: trône épiscopal
definition: Etoffe rectangulaire utilisée pour recouvrir un trône papal, épiscopal ou abbatial, lors des messes pontificales. Suivant les cérémonies, elle est de la couleur du temps liturgique ou de celle correspondant à la dignité de son destinataire.
TermeAssocie: trône pontifical
TermeAssocie: trône épiscopal
status: 1

armoiries d'évêque
type: Concept
modified: 2014-11-26T12:41:38+01:00
in scheme: Thésaurus de la désignation des objets mobiliers
preferred label: bishop's coat of arms @en-us
preferred label: arme episcopale @it
preferred label: armas episcopais @pt
broader: insigne ecclésiastique
created: 2012-05-16T00:00:00+02:00
related: trône épiscopal
definition: Armoiries d'un évêque peintes ou sculptées sur un support et placées, lors des cérémonies solennelles, sur son siège ou à proximité ou encore sur la porte d'une église.
TermeAssocie: trône épiscopal
status: 1

tapis de trône pontifical
type: Concept
modified: 2014-12-03T11:08:19+01:00
in scheme: Thésaurus de la désignation des objets mobiliers
preferred label: pontifical throne carpets @en-us
preferred label: tappeto della cattedra pontificale @it
preferred label: tapete de trono pontifical @pt
broader: linge ou garniture liés aux sièges
created: 2012-05-16T00:00:00+02:00
related: trône pontifical
related: trône épiscopal
definition: Tapis couvrant les degrés et la plate-forme d'un trône pontifical.
TermeAssocie: trône pontifical
TermeAssocie: trône épiscopal
status: 1

cathèdre
type: SimpleNonPreferredTerm
modified: 2014-12-02T15:26:06+01:00
created: 2014-01-15T14:54:24+01:00
status: 1

siège épiscopal
type: SimpleNonPreferredTerm
modified: 2014-12-02T15:26:06+01:00
created: 2014-01-15T14:54:24+01:00
status: 1

trône épiscopal
type: PreferredTerm
modified: 2014-12-02T15:26:06+01:00
created: 2014-01-15T14:54:24+01:00
status: 1

médaillier
type: Concept
modified: 2014-12-04T16:53:05+01:00
in scheme: Thésaurus de la désignation des objets mobiliers
preferred label: coin cabinets @en-us
broader: meuble de collection spécifique
created: 2012-05-16T00:00:00+02:00
definition: Meuble à tiroirs multiples, de faible hauteur, chaque tiroir comportant une doublure amovible, réservant des creux circulaires servant à déposer des monnaies et/ou des médailles. Les tiroirs peuvent être cachés par des battants.
status: 1
broad match: http://vocab.getty.edu/aat/300038888

médaillier
type: PreferredTerm
modified: 2014-12-04T16:53:05+01:00
created: 2014-01-15T14:54:24+01:00
status: 1

robe de baptême de cloche
type: Concept
modified: 2014-10-02T08:58:29+02:00
in scheme: Thésaurus de la désignation des objets mobiliers
broader: autre vêtement catholique
created: 2012-05-16T00:00:00+02:00
definition: Vêtement, brodé et en dentelle, enveloppant la cloche des anses à la pince lors de sa bénédiction.
status: 1

robe de baptême de cloche
type: PreferredTerm
modified: 2014-10-02T08:58:29+02:00
created: 2014-01-15T14:54:24+01:00
status: 1

écran pare-étincelles
type: Concept
modified: 2014-10-10T17:12:20+02:00
in scheme: Thésaurus de la désignation des objets mobiliers
preferred label: fire screens (equipment) @en-us
broader: meuble de protection
alternative label: pare-feu
alternative label: garde-feu
created: 2012-05-16T00:00:00+02:00
definition: Meuble constitué d'un ou plusieurs plans articulés, en métal finement ajouré ou en verre, placé devant la cheminée pour protéger la pièce des flammèches.
status: 1

écran à feu
type: Concept
modified: 2014-12-04T15:15:33+01:00
in scheme: Thésaurus de la désignation des objets mobiliers
preferred label: fire screens (furniture) @en-us
broader: meuble de protection
created: 2012-05-16T00:00:00+02:00
related: garniture de meuble
related: écran à main
definition: Meuble constitué d'un plan vertical en osier, en bois plein ou gainé de tissu, le plus souvent posé au sol, servant à protéger de la trop forte chaleur du feu.
TermeAssocie: garniture de meuble
TermeAssocie: écran à main
status: 1

devant de cheminée
type: Concept
modified: 2014-12-04T15:14:31+01:00
in scheme: Thésaurus de la désignation des objets mobiliers
broader: meuble de protection
alternative label: devant de feu
created: 2012-05-16T00:00:00+02:00
definition: Plaque de bois ou châssis garni de tissu, de cuir ou de papier (brodé, peint, etc.) servant à boucher la cheminée lorsqu'elle n'est pas en fonctionnement, c'est-à-dire l'été.
status: 1
broad match: cb11931172v
broad match: http://vocab.getty.edu/aat/300052273

meuble de protection
type: PreferredTerm
modified: 2014-10-10T17:03:34+02:00
created: 2014-01-15T14:54:24+01:00
status: 1

parc d'enfant
type: Concept
modified: 2014-10-10T17:16:14+02:00
in scheme: Thésaurus de la désignation des objets mobiliers
preferred label: playpens @en-us
broader: meuble de protection
created: 2012-05-16T00:00:00+02:00
definition: Clôture à barreaux de plan carré ou circulaire servant à limiter les déplacements d'un enfant.
status: 1

clôture de lit
type: Concept
modified: 2014-10-10T17:08:11+02:00
in scheme: Thésaurus de la désignation des objets mobiliers
broader: meuble de protection
created: 2012-05-16T00:00:00+02:00
definition: Balustrade fixe, avec passage, entourant un lit ou barrant une partie d'une pièce ou d'une alcôve, de façon à en limiter l'accès.
status: 1
broad match: http://data.bnf.fr/ark:/12148/cb131627263
broad match: http://vocab.getty.edu/aat/300005044

parasol
type: Concept
modified: 2014-12-04T15:17:27+01:00
in scheme: Thésaurus de la désignation des objets mobiliers
preferred label: sunshades @en-us
broader: meuble de protection
created: 2012-05-16T00:00:00+02:00
definition: Tige verticale surmontée d'une toile tendue en demi-sphère servant à protéger du soleil.
status: 1
broad match: http://vocab.getty.edu/aat/300165810

paravent
type: Concept
modified: 2014-12-04T15:18:51+01:00
in scheme: Thésaurus de la désignation des objets mobiliers
preferred label: screens (furniture) @en-us
broader: meuble de protection
created: 2012-05-16T00:00:00+02:00
related: garniture de meuble
definition: Meuble composé de plans verticaux ou feuilles articulés, pouvant aller de deux à douze, parfois portés par des patins, servant à protéger des courants d'air, de la vue, du feu ou à diviser une pièce.
TermeAssocie: garniture de meuble
status: 1

nappe de crédence
type: Concept
modified: 2014-12-02T16:03:17+01:00
in scheme: Thésaurus de la désignation des objets mobiliers
preferred label: credence cloths @en-us
preferred label: tovaglia da credenza @it
preferred label: toalha de credência @pt
broader: linge ou garniture liés à l'autel
created: 2012-05-16T00:00:00+02:00
related: crédence
definition: Nappe blanche, en lin ou en chanvre, que l'on étend sur une crédence et dont les bords peuvent porter un décor de dentelle ou de broderie.
TermeAssocie: crédence
status: 1
broad match: http://data.bnf.fr/ark:/12148/cb124087407

crédence
type: Concept
modified: 2014-12-01T12:15:38+01:00
in scheme: Thésaurus de la désignation des objets mobiliers
preferred label: credences (tables) @en-us
preferred label: abaco @it
preferred label: ábaco @pt
narrower: niche-crédence
broader: autel et son environnement
created: 2012-05-16T00:00:00+02:00
scope note: Ne pas confondre avec la console d'architecture.
related: service décoratif de crédence
related: nappe de crédence
related: table de prothèse
definition: Tablette ou table, le plus souvent d'applique, placée près d'un autel et sur laquelle on dépose les burettes et divers autres objets servant à la célébration de la messe ou au décor.
TermeAssocie: service décoratif de crédence
TermeAssocie: nappe de crédence
TermeAssocie: table de prothèse
status: 1
broad match: cb11943953g

nappe de crédence
type: PreferredTerm
modified: 2014-12-02T16:03:17+01:00
created: 2014-01-15T14:54:24+01:00
status: 1

lambris de couvrement
type: Concept
modified: 2015-01-07T12:18:56+01:00
in scheme: Thésaurus de la désignation des objets mobiliers
broader: couvrement
alternative label: lambris en berceau
alternative label: lambris en coupole
alternative label: lambris à cantons
alternative label: lambris à quartiers
alternative label: lambris en cul-de-four
created: 2012-05-16T00:00:00+02:00
scope note: Voir aussi le Thesaurus de la désignation des œuvres architecturales et des espaces aménagés.
related: lambris de revêtement
definition: Revêtement intérieur, généralement en bois, d'une charpente de toit. Le lambris de couvrement n'est pas une voûte, laquelle est maçonnée.
TermeAssocie: lambris de revêtement
status: 1
broad match: cb12505322n

lambris en coupole
type: SimpleNonPreferredTerm
modified: 2015-01-07T12:18:56+01:00
created: 2014-01-15T14:54:24+01:00
status: 1

lambris en cul-de-four
type: SimpleNonPreferredTerm
modified: 2015-01-07T12:18:56+01:00
created: 2014-01-15T14:54:24+01:00
status: 1

lambris à cantons
type: SimpleNonPreferredTerm
modified: 2015-01-07T12:18:56+01:00
created: 2014-01-15T14:54:24+01:00
status: 1

lambris en berceau
type: SimpleNonPreferredTerm
modified: 2015-01-07T12:18:56+01:00
created: 2014-01-15T14:54:24+01:00
status: 1

lambris de couvrement
type: PreferredTerm
modified: 2015-01-07T12:18:56+01:00
created: 2014-01-15T14:54:24+01:00
status: 1

lambris à quartiers
type: SimpleNonPreferredTerm
modified: 2015-01-07T12:18:56+01:00
created: 2014-01-15T14:54:24+01:00
status: 1

fruitier
type: Concept
modified: 2014-10-13T11:25:23+02:00
in scheme: Thésaurus de la désignation des objets mobiliers
broader: étagère
created: 2012-05-16T00:00:00+02:00
definition: Etagère au sol comportant des plateaux ou des claies fixes ou tirantes, ou étagère suspendue à claies superposées, servant à faire sécher des fruits.
status: 1

fruitier
type: PreferredTerm
modified: 2014-10-13T11:25:23+02:00
created: 2014-01-15T14:54:24+01:00
status: 1

métier à dentelle domestique
type: Concept
modified: 2014-12-10T15:04:19+01:00
in scheme: Thésaurus de la désignation des objets mobiliers
broader: objet ou matériel pour les ouvrages textiles
alternative label: navette à filet
alternative label: coussin à macramé
alternative label: métier à macramé
alternative label: porte-tambour de dentellière
alternative label: carreau de dentellière
alternative label: navette à frivolité
alternative label: tambour à dentelle
alternative label: carré de dentellière
created: 2012-05-16T00:00:00+02:00
related: machine à tisser
definition: Support, appelé tambour, pour fabriquer de la dentelle, composé d’une surface rembourrée piquée d’épingles autour desquelles on noue les fils. Ce coussin est placé sur les genoux ou sur un support à pied spécifique, le porte-tambour.
TermeAssocie: machine à tisser
status: 1
broad match: http://vocab.getty.edu/aat/300163224
broad match: cb11946868z
broad match: Dentelle

métier à dentelle domestique
type: PreferredTerm
modified: 2014-12-10T15:04:19+01:00
created: 2014-01-15T14:54:24+01:00
status: 1

navette à filet
type: SimpleNonPreferredTerm
modified: 2014-12-10T15:04:19+01:00
created: 2014-01-15T14:54:24+01:00
status: 1

navette à frivolité
type: SimpleNonPreferredTerm
modified: 2014-12-10T15:04:19+01:00
created: 2014-01-15T14:54:24+01:00
status: 1

carré de dentellière
type: SimpleNonPreferredTerm
modified: 2014-12-10T15:04:19+01:00
created: 2014-01-15T14:54:24+01:00
status: 1

métier à macramé
type: SimpleNonPreferredTerm
modified: 2014-12-10T15:04:19+01:00
created: 2014-01-15T14:54:24+01:00
status: 1

tambour à dentelle
type: SimpleNonPreferredTerm
modified: 2014-12-10T15:04:19+01:00
created: 2014-01-15T14:54:24+01:00
status: 1

coussin à macramé
type: SimpleNonPreferredTerm
modified: 2014-12-10T15:04:19+01:00
created: 2014-01-15T14:54:24+01:00
status: 1

porte-tambour de dentellière
type: SimpleNonPreferredTerm
modified: 2014-12-10T15:04:19+01:00
created: 2014-01-15T14:54:24+01:00
status: 1

carreau de dentellière
type: SimpleNonPreferredTerm
modified: 2014-12-10T15:04:19+01:00
created: 2014-01-15T14:54:24+01:00
status: 1

hache (outil)
type: Concept
modified: 2014-01-10T00:00:00+01:00
in scheme: Thésaurus de la désignation des objets mobiliers
broader: outil servant à découper
alternative label: herminette
alternative label: hachette
alternative label: cognée
created: 2013-12-16T00:00:00+01:00
status: 1

herminette
type: SimpleNonPreferredTerm
modified: 2014-01-10T00:00:00+01:00
created: 2014-01-15T14:54:24+01:00
status: 1

hache (outil)
type: PreferredTerm
modified: 2014-01-10T00:00:00+01:00
created: 2014-01-15T14:54:24+01:00
status: 1

outil servant à découper
type: Concept
modified: 2014-01-10T00:00:00+01:00
in scheme: Thésaurus de la désignation des objets mobiliers
narrower: hache (outil)
narrower: T69-9697
narrower: T69-9699
narrower: T69-9695
broader: outil
created: 2013-12-16T00:00:00+01:00
status: 1

hachette
type: SimpleNonPreferredTerm
modified: 2014-01-10T00:00:00+01:00
created: 2014-01-15T14:54:24+01:00
status: 1

cognée
type: SimpleNonPreferredTerm
modified: 2014-01-10T00:00:00+01:00
created: 2014-01-15T14:54:24+01:00
status: 1

malle
type: Concept
modified: 2014-12-04T16:17:38+01:00
in scheme: Thésaurus de la désignation des objets mobiliers
preferred label: trunks (containers) @en-us
broader: coffre
created: 2012-05-16T00:00:00+02:00
definition: Coffre sans pieds, à poignées, servant à transporter des objets ou des vêtements. Il peut être en osier, en cuir ou en bois et doublé à l'intérieur et à l’extérieur.
status: 1

malle
type: PreferredTerm
modified: 2014-12-04T16:17:38+01:00
created: 2014-01-15T14:54:24+01:00
status: 1

matrice de sceau ecclésiastique
type: Concept
modified: 2014-11-26T14:09:21+01:00
in scheme: Thésaurus de la désignation des objets mobiliers
preferred label: matrice di sigillo ecclesiastico @it
preferred label: ecclesiastical seal molds @en-us
preferred label: matriz sigilar eclesiástica @pt
broader: insigne ecclésiastique
alternative label: bague-sceau ecclésiastique
created: 2012-05-16T00:00:00+02:00
related: matrice de sceau
related: sceau ecclésiastique
definition: Matrice, généralement en métal, servant à imprimer un sceau ecclésiastique pouvant faire partie d'un anneau pastoral (bague-sceau ecclésiastique).
TermeAssocie: matrice de sceau
TermeAssocie: sceau ecclésiastique
status: 1

bague-sceau ecclésiastique
type: SimpleNonPreferredTerm
modified: 2014-11-26T14:09:21+01:00
created: 2014-01-15T14:54:24+01:00
status: 1

matrice de sceau ecclésiastique
type: PreferredTerm
modified: 2014-11-26T14:09:21+01:00
created: 2014-01-15T14:54:24+01:00
status: 1

matrice de sceau
type: Concept
modified: 2014-12-30T12:50:21+01:00
in scheme: Thésaurus de la désignation des objets mobiliers
broader: marque d'appartenance ou d'autorité
created: 2013-03-21T00:00:00+01:00
related: matrice de sceau ecclésiastique
related: outil servant à marquer
related: cachet
definition: ​Cachet où sont gravés en creux des signes propres à une autorité souveraine, à un corps constitué ou à un simple particulier, et qu'on applique sur une matière molle (cire ou plomb) afin que l'empreinte en relief ainsi réalisée atteste l'authenticité, l'autorité, la validité des documents sur lesquels il est apposé, ou les close afin d'en tenir caché le contenu
TermeAssocie: matrice de sceau ecclésiastique
TermeAssocie: outil servant à marquer
TermeAssocie: cachet
status: 1

sceau ecclésiastique
type: Concept
modified: 2014-11-26T14:12:46+01:00
in scheme: Thésaurus de la désignation des objets mobiliers
preferred label: sigillo ecclesiastico @it
preferred label: ecclesiastical seals @en-us
preferred label: selo eclesiástico @pt
broader: insigne ecclésiastique
created: 2012-05-16T00:00:00+02:00
related: matrice de sceau ecclésiastique
related: empreinte de sceau
definition: Sceau utilisé, dans le cadre de ses fonctions, par un dignitaire ecclésiastique (ou son mandataire) et portant ses armoiries personnelles. On distingue les sceaux pendants, appelés bulles lorsqu’ils sont en métal (dotés d’un recto et d’un verso et maintenus au document par des fils ou rubans de papier) et les sceaux adhérents, essentiellement en cire.
TermeAssocie: matrice de sceau ecclésiastique
TermeAssocie: empreinte de sceau
status: 1

matériel agricole
type: PreferredTerm
modified: 2014-01-10T00:00:00+01:00
created: 2014-01-15T14:54:24+01:00
status: 1

matériel pour la culture et l'horticulture
type: Concept
modified: 2014-01-10T00:00:00+01:00
in scheme: Thésaurus de la désignation des objets mobiliers
narrower: pressoir à fruits
narrower: T69-9613
narrower: T69-9596
narrower: T69-9606
narrower: T69-9597
narrower: T69-9603
narrower: T69-9601
narrower: T69-9609
narrower: T69-9598
narrower: T69-9602
narrower: T69-9610
narrower: T69-9595
narrower: T69-9608
narrower: T69-9605
broader: matériel agricole
alternative label: pince à fagot
alternative label: tassoir à chaume
alternative label: faucille
alternative label: houe
alternative label: bêche
alternative label: plantoir
alternative label: béchard
alternative label: van (panier)
alternative label: batte à semis
alternative label: serfouette
alternative label: binette
alternative label: sarcloir
created: 2013-12-16T00:00:00+01:00
status: 1

matériel agricole, professionnel et artisanal
type: Concept
modified: 2013-12-16T00:00:00+01:00
in scheme: Thésaurus de la désignation des objets mobiliers
narrower: matériel agricole
narrower: matériel médical
narrower: matériel artisanal
narrower: meuble ou aménagement professionnel
broader: dénomination provisoire
created: 2013-07-22T00:00:00+02:00
status: 1

monnaie
type: Concept
modified: 2014-12-30T12:37:52+01:00
in scheme: Thésaurus de la désignation des objets mobiliers
preferred label: coins (money) @en-us
broader: élément de numismatique
created: 2013-07-19T00:00:00+02:00
related: relief
definition: Pièce de titre, forme et poids caractéristiques, frappée d'une particulière, garantie par l'autorité d'émission comme moyen légal d'échange, de paiement et d'épargne.
TermeAssocie: relief
status: 1

monnaie
type: PreferredTerm
modified: 2014-12-30T12:37:52+01:00
created: 2014-01-15T14:54:24+01:00
status: 1

relief
type: Concept
modified: 2014-12-03T16:49:45+01:00
in scheme: Thésaurus de la désignation des objets mobiliers
preferred label: reliefs (sculptures) @en-us
narrower: demi-relief
narrower: masque sculpté
narrower: haut-relief
narrower: relief gravé
narrower: camée
narrower: intaille
narrower: bas-relief
narrower: mascaron
broader: sculpture
created: 2012-05-16T00:00:00+02:00
scope note: Préciser en PDEN relief pictural qui combine les différents types de reliefs et présente des lignes de fuite pour produire un effet pittoresque ou pictural de perspective.
related: monnaie
related: polyptyque
related: médaille
related: tableautin d'autel
related: objet de représentation d'un organisme vivant
related: tableau d'autel
related: retable
definition: Sculpture dont les différentes formes représentées ont moins des trois quarts du volume réel d'un corps ou d'un objet. Ces formes adhèrent à un fond plat sur lequel elles se détachent. Le fond peut être rapporté (relief d'applique).
TermeAssocie: monnaie
TermeAssocie: polyptyque
TermeAssocie: médaille
TermeAssocie: tableautin d'autel
TermeAssocie: objet de représentation d'un organisme vivant
TermeAssocie: tableau d'autel
TermeAssocie: retable
status: 1

élément de numismatique
type: Concept
modified: 2014-12-30T12:39:17+01:00
in scheme: Thésaurus de la désignation des objets mobiliers
narrower: monnaie
narrower: jeton
narrower: médaille
broader: bijouterie et orfèvrerie civiles, monnaie, médaille
created: 2013-11-29T00:00:00+01:00
definition: <!--[if gte mso 9]> <o:OfficeDocumentSettings> <o:AllowPNG/> </o:OfficeDocumentSettings> <![endif]-->Monnaie ou médaille formée d'une pièce de métal ou d'alliage, généralement circulaire, fondue ou frappée sur l'avers et le revers d'une empreinte.<!--[if gte mso 9]> <w:WordDocument> <w:View>Normal</w:View> <w:Zoom>0</w:Zoom> <w:TrackMoves/> <w:TrackFormatting/> <w:HyphenationZone>21</w:HyphenationZone> <w:PunctuationKerning/> <w:ValidateAgainstSchemas/> <w:SaveIfXMLInvalid>false</w:SaveIfXMLInvalid> <w:IgnoreMixedContent>false</w:IgnoreMixedContent> <w:AlwaysShowPlaceholderText>false</w:AlwaysShowPlaceholderText> <w:DoNotPromoteQF/> <w:LidThemeOther>FR</w:LidThemeOther> <w:LidThemeAsian>X-NONE</w:LidThemeAsian> <w:LidThemeComplexScript>X-NONE</w:LidThemeComplexScript> <w:Compatibility> <w:BreakWrappedTables/> <w:SnapToGridInCell/> <w:WrapTextWithPunct/> <w:UseAsianBreakRules/> <w:DontGrowAutofit/> <w:SplitPgBreakAndParaMark/> <w:EnableOpenTypeKerning/> <w:DontFlipMirrorIndents/> <w:OverrideTableStyleHps/> </w:Compatibility> <m:mathFont m:val="Cambria Math"/> <m:brkBin m:val="before"/> <m:brkBinSub m:val="--"/> <m:smallFrac m:val="off"/> <m:dispDef/> <m:lMargin m:val="0"/> <m:rMargin m:val="0"/> <m:defJc m:val="centerGroup"/> <m:wrapIndent m:val="1440"/> <m:intLim m:val="subSup"/> <m:naryLim m:val="undOvr"/> </w:WordDocument> <![endif]--><!--[if gte mso 9]> <w:LatentStyles DefLockedState="false" DefUnhideWhenUsed="false" DefSemiHidden="false" DefQFormat="false" DefPriority="99" LatentStyleCount="371"> <w:LsdException Locked="false" Priority="0" QFormat="true" Name="Normal"/> <w:LsdException Locked="false" Priority="9" QFormat="true" Name="heading 1"/> <w:LsdException Locked="false" Priority="9" SemiHidden="true" UnhideWhenUsed="true" QFormat="true" Name="heading 2"/> <w:LsdException Locked="false" Priority="9" SemiHidden="true" UnhideWhenUsed="true" QFormat="true" Name="heading 3"/> <w:LsdException Locked="false" Priority="9" SemiHidden="true" UnhideWhenUsed="true" Q…
status: 1
broad match: http://vocab.getty.edu/aat/300054419

patène orthodoxe
type: Concept
modified: 2014-01-10T00:00:00+01:00
in scheme: Thésaurus de la désignation des objets mobiliers
broader: objet du culte orthodoxe
alternative label: diskos
alternative label: disque
created: 2012-05-16T00:00:00+02:00
related: patène
definition: Petit plat circulaire dont l'intérieur au moins est toujours doré, destiné à mettre le pain qui doit être consacré. Dans le culte orthodoxe russe, la patène avec marli et sans rebord, est montée sur un pied central. Dans le rite grec, le disque sans pied comporte un haut rebord vertical. La patène est recouverte comme le calice par les voiles.
TermeAssocie: patène
status: 1

patène orthodoxe
type: PreferredTerm
modified: 2014-01-10T00:00:00+01:00
created: 2014-01-15T14:54:24+01:00
status: 1

diskos
type: SimpleNonPreferredTerm
modified: 2014-01-10T00:00:00+01:00
created: 2014-01-15T14:54:24+01:00
status: 1

patène
type: Concept
modified: 2014-11-27T15:24:31+01:00
in scheme: Thésaurus de la désignation des objets mobiliers
preferred label: patens (liturgical vessels) @en-us
preferred label: patena @it
broader: objet lié à l'Eucharistie
alternative label: patène de viatique
created: 2012-05-16T00:00:00+02:00
related: chapelle de messe
related: boîte de calice
related: pale
related: voile huméral
related: voile de calice
related: patène orthodoxe
related: astérisque
related: patène funéraire
related: boîte de patène
definition: Petit plat consacré, utilisé par le célébrant durant la messe, pour poser l'hostie avant et après la consécration ou pour en recueillir les parcelles. La patène, généralement en métal précieux, toujours dorée à l'intérieur, est de forme circulaire, avec un large marli ou un fond polylobé. Elle est souvent décorée, au revers, d'une représentation religieuse, d'une inscription ou de symboles eucharistiques. Le diamètre de son fond doit être, en principe, le même que celui de la coupe du calice avec lequel elle forme généralement un ensemble.
TermeAssocie: chapelle de messe
TermeAssocie: boîte de calice
TermeAssocie: pale
TermeAssocie: voile huméral
TermeAssocie: voile de calice
TermeAssocie: patène orthodoxe
TermeAssocie: astérisque
TermeAssocie: patène funéraire
TermeAssocie: boîte de patène
status: 1

disque
type: SimpleNonPreferredTerm
modified: 2014-01-10T00:00:00+01:00
created: 2014-01-15T14:54:24+01:00
status: 1

instrument ou matériel de chirurgie
type: Concept
modified: 2014-01-10T00:00:00+01:00
in scheme: Thésaurus de la désignation des objets mobiliers
narrower: trousse de chirurgie
broader: matériel médical
alternative label: écarteur
alternative label: bistouri
alternative label: trépan de chirurgie
alternative label: catheter
alternative label: érigne
alternative label: rugine
alternative label: trocart
created: 2013-12-10T00:00:00+01:00
status: 1

trousse de chirurgie
type: Concept
modified: 2014-01-10T00:00:00+01:00
in scheme: Thésaurus de la désignation des objets mobiliers
broader: instrument ou matériel de chirurgie
created: 2013-12-10T00:00:00+01:00
status: 1

érigne
type: SimpleNonPreferredTerm
modified: 2014-01-10T00:00:00+01:00
created: 2014-01-15T14:54:24+01:00
status: 1

écarteur
type: SimpleNonPreferredTerm
modified: 2014-01-10T00:00:00+01:00
created: 2014-01-15T14:54:24+01:00
status: 1

rugine
type: SimpleNonPreferredTerm
modified: 2014-01-10T00:00:00+01:00
created: 2014-01-15T14:54:24+01:00
status: 1

catheter
type: SimpleNonPreferredTerm
modified: 2014-01-10T00:00:00+01:00
created: 2014-01-15T14:54:24+01:00
status: 1

instrument ou matériel de chirurgie
type: PreferredTerm
modified: 2014-01-10T00:00:00+01:00
created: 2014-01-15T14:54:24+01:00
status: 1

trépan de chirurgie
type: SimpleNonPreferredTerm
modified: 2014-01-10T00:00:00+01:00
created: 2014-01-15T14:54:24+01:00
status: 1

matériel médical
type: Concept
modified: 2014-01-10T00:00:00+01:00
in scheme: Thésaurus de la désignation des objets mobiliers
narrower: instrument ou matériel de pharmacie
narrower: instrument ou matériel de chirurgie
narrower: instrument ou matériel médical
narrower: mobilier médical
narrower: instrument ou matériel d'ophtalmologie
narrower: accessoire d'aide au malade
narrower: T69-9562
narrower: T69-9508
broader: matériel agricole, professionnel et artisanal
created: 2013-12-10T00:00:00+01:00
status: 1

bistouri
type: SimpleNonPreferredTerm
modified: 2014-01-10T00:00:00+01:00
created: 2014-01-15T14:54:24+01:00
status: 1

trocart
type: SimpleNonPreferredTerm
modified: 2014-01-10T00:00:00+01:00
created: 2014-01-15T14:54:24+01:00
status: 1

porte-manteaux
type: Concept
modified: 2014-12-04T16:59:32+01:00
in scheme: Thésaurus de la désignation des objets mobiliers
preferred label: coatracks @en-us
broader: meuble-vestiaire
alternative label: patère
created: 2012-05-16T00:00:00+02:00
definition: Meuble au sol ou d’applique servant à suspendre des vêtements. Il s’agit d'une simple barre horizontale ou d’une structure comportant des patères.
status: 1

patère
type: SimpleNonPreferredTerm
modified: 2014-12-04T16:59:32+01:00
created: 2014-01-15T14:54:24+01:00
status: 1

meuble-vestiaire
type: Concept
modified: 2014-10-13T12:38:30+02:00
in scheme: Thésaurus de la désignation des objets mobiliers
narrower: porte-manteaux
broader: meuble de rangement et d'exposition
alternative label: porte-cannes
alternative label: porte-chapeaux
alternative label: porte-bottes
created: 2012-07-19T00:00:00+02:00
definition: Meuble conçu pour déposer les vêtements d’extérieurs et certains accessoires de la garde-robe (parapluie, chapeau, canne, etc).
status: 1
broad match: http://vocab.getty.edu/aat/300039767

porte-manteaux
type: PreferredTerm
modified: 2014-12-04T16:59:32+01:00
created: 2014-01-15T14:54:24+01:00
status: 1

porte-reliquaire de procession
type: Concept
modified: 2014-12-02T10:20:40+01:00
in scheme: Thésaurus de la désignation des objets mobiliers
preferred label: espositorio processionale @it
preferred label: processional reliquary stands @en-us
preferred label: porta-relicário processional @pt
broader: meuble lié à la procession et à la dévotion
created: 2012-05-16T00:00:00+02:00
definition: Support spécifique permettant de porter en procession un reliquaire sur un brancard de procession et parfois de l'exposer à demeure dans une église.
status: 1
broad match: Reliquaire

porte-reliquaire de procession
type: PreferredTerm
modified: 2014-12-02T10:20:40+01:00
created: 2014-01-15T14:54:24+01:00
status: 1

instrument de mesure des densités
type: Concept
modified: 2014-12-15T15:06:03+01:00
in scheme: Thésaurus de la désignation des objets mobiliers
preferred label: densimeters @en-us
broader: instrument de mesure
alternative label: pèse-lait
alternative label: lactomètre
alternative label: aéromètre
alternative label: densimètre
alternative label: pèse-alcool
alternative label: alcoomètre
alternative label: pèse-esprits
alternative label: pèse-acide
created: 2012-05-16T00:00:00+02:00
definition: Instrument de mesure des densités ou masses volumiques des fluides, de la concentration ou teneur d'un produit dans un mélange, au moyen d'instruments gradués ou non. Unités: degrés Gay-Lussac, Réaumur, centésimal.
status: 1

pèse-alcool
type: SimpleNonPreferredTerm
modified: 2014-12-15T15:06:03+01:00
created: 2014-01-15T14:54:24+01:00
status: 1

pèse-esprits
type: SimpleNonPreferredTerm
modified: 2014-12-15T15:06:03+01:00
created: 2014-01-15T14:54:24+01:00
status: 1

lactomètre
type: SimpleNonPreferredTerm
modified: 2014-12-15T15:06:03+01:00
created: 2014-01-15T14:54:24+01:00
status: 1

aéromètre
type: SimpleNonPreferredTerm
modified: 2014-12-15T15:06:03+01:00
created: 2014-01-15T14:54:24+01:00
status: 1

pèse-acide
type: SimpleNonPreferredTerm
modified: 2014-12-15T15:06:03+01:00
created: 2014-01-15T14:54:24+01:00
status: 1

alcoomètre
type: SimpleNonPreferredTerm
modified: 2014-12-15T15:06:03+01:00
created: 2014-01-15T14:54:24+01:00
status: 1

densimètre
type: SimpleNonPreferredTerm
modified: 2014-12-15T15:06:03+01:00
created: 2014-01-15T14:54:24+01:00
status: 1

instrument de mesure des densités
type: PreferredTerm
modified: 2014-12-15T15:06:03+01:00
created: 2014-01-15T14:54:24+01:00
status: 1

pèse-lait
type: SimpleNonPreferredTerm
modified: 2014-12-15T15:06:03+01:00
created: 2014-01-15T14:54:24+01:00
status: 1

képi
type: Concept
modified: 2014-10-20T10:22:10+02:00
in scheme: Thésaurus de la désignation des objets mobiliers
preferred label: kepis @en-us
broader: chapeau ou coiffure
created: 2012-05-16T00:00:00+02:00
definition: Coiffure rigide ou semi-rigide en drap, de forme cylindrique, à fond plat et surélevé, munie d'une visière, portée en France par les officiers et sous-officiers de certaines armes, par certains fonctionnaires et employés et, anciennement, par les écoliers de certains établissements publics.
status: 1

chapeau ou coiffure
type: Concept
modified: 2014-12-10T18:06:10+01:00
in scheme: Thésaurus de la désignation des objets mobiliers
preferred label: headgear @en-us
narrower: képi
narrower: coiffe
narrower: bicorne
narrower: casque
narrower: voilette
narrower: T69-6528
broader: costume civil, professionnel ou militaire
alternative label: casquette
alternative label: mouchoir-fichu
alternative label: capeline
alternative label: toque
alternative label: canotier
alternative label: tricorne
alternative label: turban
alternative label: perruque
alternative label: capuche
alternative label: cagoule
alternative label: calot
alternative label: couvre-chef
alternative label: béret
alternative label: chapeau-melon
alternative label: haut-de-forme
created: 2012-05-16T00:00:00+02:00
related: coiffure liturgique
definition: Pièce du vêtement de forme extrêmement variée, destinée à couvrir la tête, le plus souvent pour sortir.
TermeAssocie: coiffure liturgique
status: 1

képi
type: PreferredTerm
modified: 2014-10-20T10:22:10+02:00
created: 2014-01-15T14:54:24+01:00
status: 1

garniture de dais de procession
type: Concept
modified: 2014-12-03T10:37:40+01:00
in scheme: Thésaurus de la désignation des objets mobiliers
preferred label: processional canopy hangings @en-us
preferred label: guarnizione del baldacchino processionale @it
preferred label: ornamento de pálio processional @pt
broader: linge ou garniture liés à la procession
alternative label: pente de dais de procession
alternative label: tenture du dais du saint sacrement
alternative label: rideau de dais de procession
alternative label: ciel de dais de procession
created: 2012-05-16T00:00:00+02:00
related: dais de procession
definition: Garnitures et décors d'amortissement d'un dais de procession : pentes, bandes de tissu à franges et pompons, éventuellement ciel de dais de procession et rideaux placés le long des supports du dais. Les décors consistent le plus souvent en boules, en panaches, etc., parfois montés sur des supports indépendants en bois ou en métal.
TermeAssocie: dais de procession
status: 1
broad match: http://vocab.getty.edu/aat/300298963

dais de procession
type: Concept
modified: 2014-12-02T10:14:53+01:00
in scheme: Thésaurus de la désignation des objets mobiliers
preferred label: baldacchino processionale @it
preferred label: processional canopies @en-us
preferred label: pálio processional @pt
broader: meuble lié à la procession et à la dévotion
created: 2012-05-16T00:00:00+02:00
related: garniture de dais de procession
definition: Dais mobile utilisé pour les processions et pouvant abriter le saint sacrement, les saintes huiles le Jeudi saint, des reliques, une statue ou un haut dignitaire de l'Eglise. Il est souvent constitué d'une armature portée par des hampes à laquelle est suspendue une garniture de dais de procession.
TermeAssocie: garniture de dais de procession
status: 1
broad match: Baldachin

pente de dais de procession
type: SimpleNonPreferredTerm
modified: 2014-12-03T10:37:40+01:00
created: 2014-01-15T14:54:24+01:00
status: 1

rideau de dais de procession
type: SimpleNonPreferredTerm
modified: 2014-12-03T10:37:40+01:00
created: 2014-01-15T14:54:24+01:00
status: 1

tenture du dais du saint sacrement
type: SimpleNonPreferredTerm
modified: 2014-12-03T10:37:40+01:00
created: 2014-01-15T14:54:24+01:00
status: 1

garniture de dais de procession
type: PreferredTerm
modified: 2014-12-03T10:37:40+01:00
created: 2014-01-15T14:54:24+01:00
status: 1

linge ou garniture liés à la procession
type: Concept
modified: 2014-12-03T10:28:25+01:00
in scheme: Thésaurus de la désignation des objets mobiliers
preferred label: lini e coperture per la processione @it
preferred label: linen and ornaments for processions @en-us
preferred label: guarnições relacionadas com as procissões @pt
narrower: garniture de dais de procession
narrower: écharpe de croix de confrérie
narrower: draperie de brancard de procession
broader: linge ou garniture du culte catholique
created: 2012-05-16T00:00:00+02:00
related: objet lié à la procession
definition: Pièce textile utilisée pour orner le mobilier de procession.
TermeAssocie: objet lié à la procession
status: 1

ciel de dais de procession
type: SimpleNonPreferredTerm
modified: 2014-12-03T10:37:40+01:00
created: 2014-01-15T14:54:24+01:00
status: 1

chapeau de cardinal
type: Concept
modified: 2014-12-10T18:03:49+01:00
in scheme: Thésaurus de la désignation des objets mobiliers
preferred label: cardinal's hats @en-us
preferred label: cappello cardinalizio @it
preferred label: chapéu cardinalício @pt
broader: coiffure liturgique
alternative label: chapeau pontifical cardinalice
created: 2012-05-16T00:00:00+02:00
definition: Chapeau à larges bords, en feutre rouge, agrémenté d'un cordon terminé par des houppes, donné par le pape à chaque cardinal lors de sa nomination. Après sa mort, ce chapeau est placé sur son tombeau ou suspendu au-dessus.
status: 1

chapeau de cardinal
type: PreferredTerm
modified: 2014-12-10T18:03:49+01:00
created: 2014-01-15T14:54:24+01:00
status: 1

chapeau pontifical cardinalice
type: SimpleNonPreferredTerm
modified: 2014-12-10T18:03:49+01:00
created: 2014-01-15T14:54:24+01:00
status: 1

coiffure liturgique
type: Concept
modified: 2014-12-03T12:49:26+01:00
in scheme: Thésaurus de la désignation des objets mobiliers
preferred label: liturgical headdresses @en-us
preferred label: copricapi liturgici @it
preferred label: coberturas litúrgicas para a cabeça @pt
narrower: calotte
narrower: chapeau de cardinal
narrower: mitre
narrower: tiare
narrower: T69-2519
broader: vêtement du culte catholique
created: 2012-05-16T00:00:00+02:00
related: chapeau ou coiffure
definition: Élément d’habillement, plus ou moins précieux, servant à couvrir ou orner la tête du clerc.
TermeAssocie: chapeau ou coiffure
status: 1
broad match: Costume ecclésiastique

crête de toit
type: Concept
modified: 2014-12-15T17:16:24+01:00
in scheme: Thésaurus de la désignation des objets mobiliers
preferred label: roof cresting @en-us
broader: couverture ou accessoire du toit
created: 2012-05-16T00:00:00+02:00
definition: Ornement en métal ou en terre cuite qui court sur le faîte du toit.
status: 1
broad match: cb11933612v
broad match: Couverture (construction)

couverture ou accessoire du toit
type: Concept
modified: 2015-02-20T17:21:43+01:00
in scheme: Thésaurus de la désignation des objets mobiliers
preferred label: roofs or roof components @en-us
narrower: crête de toit
narrower: campanile
narrower: souche de cheminée
narrower: bordure de toit
narrower: antéfixe
narrower: auvent
narrower: élément d'évacuation des eaux
narrower: épi de faîtage
narrower: devant de lucarne
narrower: dais d'architecture
narrower: girouette
broader: élément d'architecture
created: 2012-05-16T00:00:00+02:00
definition: Ouvrage couvrant extérieurement une construction ou complémentaire de la toiture.
status: 1

crête de toit
type: PreferredTerm
modified: 2014-12-15T17:16:24+01:00
created: 2014-01-15T14:54:24+01:00
status: 1

instrument de mise en condition ou de préparation
type: Concept
modified: 2014-12-15T15:45:59+01:00
in scheme: Thésaurus de la désignation des objets mobiliers
broader: instrument pédagogique ou scientifique
alternative label: spectroscope
alternative label: centrifugeuse
alternative label: microtome
alternative label: banc d'optique
alternative label: héliostat
alternative label: sidérostat
alternative label: horizon artificiel
alternative label: collimateur
created: 2012-05-16T00:00:00+02:00
definition: Instrument nécessaire pour la préparation ou la mise en condition d'expérience, accessoire indispensable à la réalisation d'expériences, d'observations, de démonstrations scientifiques, de manipulations ou de mesures.
status: 1
broad match: http://data.bnf.fr/ark:/12148/cb131627890
broad match: http://vocab.getty.edu/aat/300122283
broad match: Instrument scientifique

instrument de calcul
type: Concept
modified: 2014-12-15T14:07:27+01:00
in scheme: Thésaurus de la désignation des objets mobiliers
preferred label: calculators @en-us
narrower: T69-5203
narrower: T69-5205
broader: instrument pédagogique ou scientifique
alternative label: machine à calculer
created: 2012-05-16T00:00:00+02:00
related: T69-5477
definition: Instrument donnant rapidement le résultat d'un calcul par une manipulation simple, ou faisant automatiquement des calculs par voie mécanique, électromécanique ou électronique.
TermeAssocie: T69-5477
status: 1

instrument ou objet pédagogique ou scientifique
type: Concept
modified: 2014-10-23T10:29:00+02:00
in scheme: Thésaurus de la désignation des objets mobiliers
preferred label: equipment for education and science @en-us
narrower: instrument pédagogique ou scientifique
narrower: objet pédagogique ou scientifique
created: 2013-12-18T00:00:00+01:00
definition: Objet ou instrument destiné à permettre l’observation, la mise en évidence, la mesure de phénomènes ou d’éléments physico-chimiques à des fins de recherche, d’expérimentation, d’enseignement ou de contrôle.
status: 1

instrument pédagogique ou scientifique
type: PreferredTerm
modified: 2014-09-09T09:54:24+02:00
created: 2014-01-15T14:54:24+01:00
status: 1

instrument de démonstration de phénomènes physiques
type: Concept
modified: 2014-10-23T15:38:02+02:00
in scheme: Thésaurus de la désignation des objets mobiliers
narrower: instrument de démonstration en mécanique
narrower: instrument de démonstration en acoustique
narrower: instrument de démonstration en électrostatique
narrower: instrument de démonstration en optique
narrower: T69-5211
narrower: T69-5219
broader: instrument pédagogique ou scientifique
created: 2012-05-16T00:00:00+02:00
definition: Instrument scientifique destiné à la vérification ou à la mise en évidence de phénomènes physiques, dans le cadre de cours ou d'enseignements individuels ou collectifs.
status: 1

instrument d'observation
type: Concept
modified: 2014-12-15T13:47:33+01:00
in scheme: Thésaurus de la désignation des objets mobiliers
narrower: télescope
narrower: lunette optique
narrower: microscope optique
narrower: T69-5366
broader: instrument pédagogique ou scientifique
alternative label: loupe
created: 2012-05-16T00:00:00+02:00
definition: Instrument scientifique (le plus souvent d'optique) destiné à rendre visible ou concevable un sujet impossible à étudier directement, et vu comme outil de travail pour l'expérimentateur en laboratoire ou en observatoire.
status: 1
broad match: Instrument scientifique

élément textile ou de garniture
type: Concept
modified: 2014-10-20T11:31:50+02:00
in scheme: Thésaurus de la désignation des objets mobiliers
narrower: canevas
narrower: pièce de broderie
narrower: pièce de tissu
narrower: échantillon présenté
narrower: pièce de passementerie
narrower: bande textile
broader: textile, garniture ou vêtement laïcs
created: 2012-05-16T00:00:00+02:00
definition: Élément de tissu, de cuir, etc. sans fonction précise ou constituant le fragment d'un élément non identifié.
status: 1
broad match: cb11933606x
broad match: http://vocab.getty.edu/aat/300231565
broad match: Textile

échantillon présenté
type: Concept
modified: 2014-12-12T10:55:17+01:00
in scheme: Thésaurus de la désignation des objets mobiliers
broader: élément textile ou de garniture
created: 2012-05-16T00:00:00+02:00
definition: Papier, tissu, cuir (lé, bande ou morceau) ayant reçu une présentation à but commercial : regroupement en livret, découpure particulière des bords, surfilage.
status: 1

pièce de passementerie
type: Concept
modified: 2014-12-12T11:01:45+01:00
in scheme: Thésaurus de la désignation des objets mobiliers
preferred label: passementerie @en-us
broader: élément textile ou de garniture
created: 2012-05-16T00:00:00+02:00
definition: Ouvrage de fils de coton, de soie ou de laine, parfois mélangés d'acier, de verroterie ou d'or destiné à l'ornement des vêtements et des meubles, etc. La passementerie se présente sous la forme des résilles, franges, ganses, galons, rubans, cordons, boutons, brandebourgs pour l'habillement et sous celle des embrasses, cordons de sonnette, cordons de tirage, etc. pour l'ameublement.
status: 1

bande textile
type: Concept
modified: 2014-10-20T11:33:22+02:00
in scheme: Thésaurus de la désignation des objets mobiliers
broader: élément textile ou de garniture
alternative label: ruban
created: 2012-05-16T00:00:00+02:00
definition: Tissu tissé en faible largeur (moins de 25 cm).
status: 1

élément textile ou de garniture
type: PreferredTerm
modified: 2014-10-20T11:31:50+02:00
created: 2014-01-15T14:54:24+01:00
status: 1

miroir à main
type: Concept
modified: 2014-12-10T16:22:59+01:00
in scheme: Thésaurus de la désignation des objets mobiliers
preferred label: hand mirrors @en-us
broader: instrument ou accessoire pour la toilette
alternative label: miroir de poche
created: 2012-05-16T00:00:00+02:00
definition: Petite surface réfléchissante pour se regarder, montée dans un cadre et munie d'un manche. Les plus petits miroirs, généralement sans manche, sont parfois dotés d’un couvercle plat ou placés dans un étui.
status: 1

miroir de poche
type: SimpleNonPreferredTerm
modified: 2014-12-10T16:22:59+01:00
created: 2014-01-15T14:54:24+01:00
status: 1

miroir à main
type: PreferredTerm
modified: 2014-12-10T16:22:59+01:00
created: 2014-01-15T14:54:24+01:00
status: 1

instrument ou accessoire pour la toilette
type: Concept
modified: 2014-10-17T14:29:05+02:00
in scheme: Thésaurus de la désignation des objets mobiliers
narrower: miroir à main
narrower: baguier
narrower: rasoir
narrower: tire-botte
narrower: lime à ongles
narrower: cure-dents
narrower: crochet à bottines
narrower: repoussoir à peaux
narrower: pince à ouvrir les gants
narrower: peigne
narrower: chausse-pied
narrower: brosse de toilette
narrower: cure-oreilles
narrower: pince à épiler
narrower: retire-botte
narrower: gratte-dos
narrower: ustensile de maquillage
narrower: fer à cheveux
narrower: porte-coiffure
narrower: ciseaux à ongles
narrower: bâton à boucles
narrower: polissoir à ongles
broader: objet pour la toilette
alternative label: entonnoir à parfum
alternative label: couteau de toilette
alternative label: strigile
alternative label: cure-langue
alternative label: gratte-langue
alternative label: réchaud à fer à friser
alternative label: réchaud à fer à cheveux
created: 2012-05-16T00:00:00+02:00
definition: Ustensile servant pour l’hygiène et les soins du corps.
status: 1
broad match: http://vocab.getty.edu/aat/300236656

éventail liturgique
type: Concept
modified: 2014-11-26T14:07:37+01:00
in scheme: Thésaurus de la désignation des objets mobiliers
preferred label: flabello @it
preferred label: flabelli @en-us
preferred label: flabelo @pt
broader: insigne ecclésiastique
alternative label: flabellum
created: 2012-05-16T00:00:00+02:00
related: éventail du culte
definition: Eventail utilisé au cours de certaines cérémonies liturgiques. A l'origine, il était destiné à atténuer la chaleur et éloigner les insectes des saintes Espèces, puis il devint insigne de dignité, spécialement pour le pape.
TermeAssocie: éventail du culte
status: 1

éventail du culte
type: Concept
modified: 2014-01-10T00:00:00+01:00
in scheme: Thésaurus de la désignation des objets mobiliers
broader: objet du culte orthodoxe
alternative label: rhipidia
alternative label: flabella
alternative label: hexaptéryges
created: 2012-05-16T00:00:00+02:00
related: éventail liturgique
definition: Paire d'éventails circulaires en bois ou en métal, montés sur une hampe, sur lesquels sont représentés des séraphins peints ou repoussés, destinés à être portés pendant la procession de la "grande entrée" (transports des saints, dons, de la table de prothèse à la table d'autel). D'une utilisation peu fréquente à l'heure actuelle.
TermeAssocie: éventail liturgique
status: 1

éventail liturgique
type: PreferredTerm
modified: 2014-11-26T14:07:37+01:00
created: 2014-01-15T14:54:24+01:00
status: 1

flabellum
type: SimpleNonPreferredTerm
modified: 2014-11-26T14:07:37+01:00
created: 2014-01-15T14:54:24+01:00
status: 1

instrument de démonstration en dynamique des solides
type: Concept
modified: 2014-12-15T14:19:19+01:00
in scheme: Thésaurus de la désignation des objets mobiliers
broader: instrument de démonstration en mécanique des solides
alternative label: machine d'Atwood
alternative label: appareil des forces centrifuges
created: 2012-05-16T00:00:00+02:00
definition: Instrument de mise en évidence et d'étude du mouvement considéré dans ses rapports avec les forces qui en sont les causes (chute des corps principalement).
status: 1
narrow match: Machine d'Atwood
broad match: http://data.bnf.fr/ark:/12148/cb15577164c
broad match: http://vocab.getty.edu/aat/300122283

instrument de démonstration en dynamique des solides
type: PreferredTerm
modified: 2014-12-15T14:19:19+01:00
created: 2014-01-15T14:54:24+01:00
status: 1

machine d'Atwood
type: SimpleNonPreferredTerm
modified: 2014-12-15T14:19:19+01:00
created: 2014-01-15T14:54:24+01:00
status: 1

instrument de démonstration en mécanique des solides
type: Concept
modified: 2014-10-23T16:05:31+02:00
in scheme: Thésaurus de la désignation des objets mobiliers
narrower: instrument de démonstration en dynamique des solides
narrower: instrument de démonstration en statique des solides
broader: instrument de démonstration en mécanique
created: 2012-05-16T00:00:00+02:00
definition: Instrument de mise en évidence et d'étude des phénomènes liés à la statique et à la dynamique.
status: 1
broad match: http://vocab.getty.edu/aat/300122283

appareil des forces centrifuges
type: SimpleNonPreferredTerm
modified: 2014-12-15T14:19:19+01:00
created: 2014-01-15T14:54:24+01:00
status: 1

bateau de lamanage
type: Concept
modified: 2014-12-19T12:23:29+01:00
in scheme: Thésaurus de la désignation des objets mobiliers
preferred label: pilot boats @en-us
broader: bateau de servitude
alternative label: bateau pilote
created: 2012-05-16T00:00:00+02:00
definition: Bateau utilisé pour les opérations d'amarrage ou de désamarrage des navires et d'assistance aux manœuvres à l'entrée des ports.
status: 1

bateau de lamanage
type: PreferredTerm
modified: 2014-12-19T12:23:29+01:00
created: 2014-01-15T14:54:24+01:00
status: 1

bateau de servitude
type: Concept
modified: 2014-10-16T09:59:46+02:00
in scheme: Thésaurus de la désignation des objets mobiliers
narrower: bateau de lamanage
narrower: bateau pousseur
narrower: toueur
narrower: remorqueur
broader: bateau de service
created: 2012-05-16T00:00:00+02:00
definition: Petit bateau aisément manœuvrable, servant à guider, tirer, pousser de grosses unités en zone portuaire ou fluviale.
status: 1
broad match: http://vocab.getty.edu/aat/300232858
broad match: Navire de services

bateau pilote
type: SimpleNonPreferredTerm
modified: 2014-12-19T12:23:29+01:00
created: 2014-01-15T14:54:24+01:00
status: 1

strigile
type: SimpleNonPreferredTerm
modified: 2014-10-17T14:29:05+02:00
created: 2014-01-15T14:54:24+01:00
status: 1

baguier
type: Concept
modified: 2014-10-17T14:24:22+02:00
in scheme: Thésaurus de la désignation des objets mobiliers
broader: instrument ou accessoire pour la toilette
created: 2012-05-16T00:00:00+02:00
related: porte-montre
definition: Tige verticale fixée sur un support et munie de crochets auxquels on suspend les bagues, ou bien tige tronconique, fixée au centre d'un réceptacle, sur laquelle on enfile les bagues.
TermeAssocie: porte-montre
status: 1
broad match: cb11948388p
broad match: http://vocab.getty.edu/aat/300046012
broad match: Bague

rasoir
type: Concept
modified: 2014-12-10T16:29:47+01:00
in scheme: Thésaurus de la désignation des objets mobiliers
preferred label: razors @en-us
broader: instrument ou accessoire pour la toilette
alternative label: rasoir à rabot
alternative label: coupe-chou
created: 2012-05-16T00:00:00+02:00
related: boîte à rasoirs
definition: Couteau à lame très affûtée prolongée par un manche, pour raser la barbe. Il est souvent complété d’une pierre à huile ou d’une bande de cuir servant à l’aiguiser, et d’un essuie-rasoir (petit récipient circulaire creux).
TermeAssocie: boîte à rasoirs
status: 1

tire-botte
type: Concept
modified: 2014-09-24T14:27:17+02:00
in scheme: Thésaurus de la désignation des objets mobiliers
preferred label: boot hooks @en-us
broader: instrument ou accessoire pour la toilette
created: 2012-05-16T00:00:00+02:00
definition: Instrument servant à enfiler une botte, se présentant comme un long manche muni d'un crochet que l'on passe dans la bride fixée en haut de la botte, à l'arrière.
status: 1
broad match: cb11960065p

lime à ongles
type: Concept
modified: 2014-10-17T14:48:48+02:00
in scheme: Thésaurus de la désignation des objets mobiliers
preferred label: nail files @en-us
broader: instrument ou accessoire pour la toilette
created: 2012-05-16T00:00:00+02:00
definition: Lame de métal étroite, munie de fines aspérités ou de rainures parallèles, montée ou non dans un petit manche, qui sert à entretenir les ongles.
status: 1

cure-dents
type: Concept
modified: 2014-10-17T14:43:53+02:00
in scheme: Thésaurus de la désignation des objets mobiliers
preferred label: toothpicks @en-us
broader: instrument ou accessoire pour la toilette
created: 2012-05-16T00:00:00+02:00
definition: Petite tige dont une extrémité est taillée en pointe ou en biseau, pour nettoyer les dents.
status: 1
broad match: http://data.bnf.fr/ark:/12148/cb121299131

cure-langue
type: SimpleNonPreferredTerm
modified: 2014-10-17T14:29:05+02:00
created: 2014-01-15T14:54:24+01:00
status: 1

crochet à bottines
type: Concept
modified: 2014-10-17T14:43:15+02:00
in scheme: Thésaurus de la désignation des objets mobiliers
preferred label: buttonhooks @en-us
broader: instrument ou accessoire pour la toilette
alternative label: crochet à gants
alternative label: tire-bouton
created: 2012-05-16T00:00:00+02:00
definition: Tige métallique terminée par un crochet et fixée dans un manche, qui permet de passer les boutons des bottines ou des gants dans les boutonnières.
status: 1
broad match: cb11967748q

entonnoir à parfum
type: SimpleNonPreferredTerm
modified: 2014-10-17T14:29:05+02:00
created: 2014-01-15T14:54:24+01:00
status: 1

repoussoir à peaux
type: Concept
modified: 2014-10-17T14:57:49+02:00
in scheme: Thésaurus de la désignation des objets mobiliers
broader: instrument ou accessoire pour la toilette
created: 2012-05-16T00:00:00+02:00
definition: Instrument constitué par un manche et une tige terminée par une spatule bombée et arrondie, servant à repousser les peaux qui entourent les ongles.
status: 1
broad match: http://data.bnf.fr/ark:/12148/cb121299131
broad match: http://vocab.getty.edu/aat/300236656
broad match: Catégorie:Matériel de soin du corps

réchaud à fer à cheveux
type: SimpleNonPreferredTerm
modified: 2014-10-17T14:29:05+02:00
created: 2014-01-15T14:54:24+01:00
status: 1

pince à ouvrir les gants
type: Concept
modified: 2014-10-17T14:53:52+02:00
in scheme: Thésaurus de la désignation des objets mobiliers
preferred label: glove stretchers @en-us
broader: instrument ou accessoire pour la toilette
created: 2012-05-16T00:00:00+02:00
definition: Pince en bois dont les branches fermées, de la grosseur d'un doigt, sont enfilées dans chacun des doigts d'un gant pour le détendre.
status: 1
broad match: http://data.bnf.fr/ark:/12148/cb121299131

peigne
type: Concept
modified: 2014-12-10T16:26:04+01:00
in scheme: Thésaurus de la désignation des objets mobiliers
preferred label: combs (grooming tools) @en-us
broader: instrument ou accessoire pour la toilette
alternative label: délenteur
alternative label: brochette à cheveux
created: 2012-05-16T00:00:00+02:00
definition: Plaque dont le bord est découpé en dents serrées, de grosseur variable, servant à démêler et lisser les cheveux. Le peigne peut comporter un manche latéral, articulé ou non.
status: 1

chausse-pied
type: Concept
modified: 2014-10-17T14:31:04+02:00
in scheme: Thésaurus de la désignation des objets mobiliers
preferred label: shoehorns @en-us
broader: instrument ou accessoire pour la toilette
created: 2012-05-16T00:00:00+02:00
definition: Spatule allongée et incurvée, adaptée à la forme du talon et munie d'un manche plus ou moins long, qui permet de faciliter la pénétration du talon dans la chaussure.
status: 1
broad match: cb11955690j

brosse de toilette
type: Concept
modified: 2014-12-10T16:16:41+01:00
in scheme: Thésaurus de la désignation des objets mobiliers
preferred label: brushes : personal use @en-us
broader: instrument ou accessoire pour la toilette
alternative label: brosse à peignes
alternative label: brosse à habits
alternative label: brosse à chapeau
alternative label: brosse à cheveux
alternative label: brosse à reluire
alternative label: brosse à brillantine
alternative label: brosse à ongles
alternative label: brosse à dents
alternative label: brosse à cou
alternative label: brosse à chaussure
alternative label: vergette
alternative label: brosse à poudre
alternative label: blaireau
alternative label: brosse à sourcils
alternative label: brosse à moustache
created: 2012-05-16T00:00:00+02:00
related: porte-brosses de toilette
definition: Instrument formé de fibres plus ou moins souples, de même longueur et ajustées dans une monture, prolongée ou non par un manche axial ou perpendiculaire. La brosse sert à nettoyer, frotter, coiffer, etc. selon sa destination précise.
TermeAssocie: porte-brosses de toilette
status: 1

cure-oreilles
type: Concept
modified: 2014-10-17T14:45:03+02:00
in scheme: Thésaurus de la désignation des objets mobiliers
broader: instrument ou accessoire pour la toilette
created: 2012-05-16T00:00:00+02:00
definition: Petite tige pointue à une extrémité et formant une spatule à l'autre, pour nettoyer les oreilles. Le cure-oreilles est associé généralement à un autre instrument de toilette.
status: 1
broad match: http://data.bnf.fr/ark:/12148/cb121299131
broad match: http://vocab.getty.edu/aat/300236656
broad match: Catégorie:Matériel de soin du corps

pince à épiler
type: Concept
modified: 2014-10-17T14:51:32+02:00
in scheme: Thésaurus de la désignation des objets mobiliers
broader: instrument ou accessoire pour la toilette
created: 2012-05-16T00:00:00+02:00
definition: Petite pince en métal pour arracher les poils, le duvet ou les cheveux superflus.
status: 1
broad match: http://data.bnf.fr/ark:/12148/cb121299131

retire-botte
type: Concept
modified: 2014-10-17T15:00:05+02:00
in scheme: Thésaurus de la désignation des objets mobiliers
preferred label: bootjacks @en-us
broader: instrument ou accessoire pour la toilette
alternative label: retire-bottes d'appui
created: 2012-05-16T00:00:00+02:00
definition: Instrument présentant une encoche ou une plaque horizontale avec une ouverture, permettant d'y coincer le talon de la botte à retirer. Il peut être muni d'un long manche vertical articulé sur lequel on prend appui.
status: 1
broad match: cb11960065p

gratte-dos
type: Concept
modified: 2014-10-17T14:47:31+02:00
in scheme: Thésaurus de la désignation des objets mobiliers
preferred label: backscratchers @en-us
broader: instrument ou accessoire pour la toilette
created: 2012-05-16T00:00:00+02:00
definition: Tige munie à une extrémité de petites griffes ou d'une petite main, pour se gratter le dos.
status: 1
broad match: http://data.bnf.fr/ark:/12148/cb121299131

ustensile de maquillage
type: Concept
modified: 2014-10-17T15:02:31+02:00
in scheme: Thésaurus de la désignation des objets mobiliers
broader: instrument ou accessoire pour la toilette
alternative label: spatule à fard
created: 2013-01-15T00:00:00+01:00
definition: Instrument permettant d’appliquer sur le visage des produits de beauté ou de soin (crèmes, fards., etc).
status: 1
narrow match: http://vocab.getty.edu/aat/300375704
broad match: Maquillage

fer à cheveux
type: Concept
modified: 2014-10-17T14:46:13+02:00
in scheme: Thésaurus de la désignation des objets mobiliers
preferred label: curling irons @en-us
broader: instrument ou accessoire pour la toilette
alternative label: fer à friser les cheveux
alternative label: fer à friser les moustaches
alternative label: fer à creuser les crans
alternative label: fer à onduler les cheveux
alternative label: fer à papillotes
created: 2012-05-16T00:00:00+02:00
definition: Instrument en métal, généralement une pince, pour mettre en forme, à chaud, les cheveux ou la moustache.
status: 1
broad match: cb11967147q

réchaud à fer à friser
type: SimpleNonPreferredTerm
modified: 2014-10-17T14:29:05+02:00
created: 2014-01-15T14:54:24+01:00
status: 1

gratte-langue
type: SimpleNonPreferredTerm
modified: 2014-10-17T14:29:05+02:00
created: 2014-01-15T14:54:24+01:00
status: 1

porte-coiffure
type: Concept
modified: 2014-12-10T16:28:20+01:00
in scheme: Thésaurus de la désignation des objets mobiliers
preferred label: wig stands @en-us
broader: instrument ou accessoire pour la toilette
alternative label: porte-perruque
alternative label: tête de perruque
alternative label: marotte
alternative label: porte-coiffe
alternative label: boule à perruque
created: 2012-05-16T00:00:00+02:00
definition: Support en forme de tête humaine sur lequel on dispose les coiffes, perruques ou chapeaux pour les mettre en forme et les monter ou lorsqu'ils ne sont pas utilisés. Le porte-coiffe comporte parfois, à l'intérieur de la base, une cavité où l'on range les instruments et les épingles nécessaires à la confection des coiffes. Le porte-chapeau se présente comme un simple champignon monté sur une tige verticale.
status: 1
broad match: cb11967147q

instrument ou accessoire pour la toilette
type: PreferredTerm
modified: 2014-10-17T14:29:05+02:00
created: 2014-01-15T14:54:24+01:00
status: 1

ciseaux à ongles
type: Concept
modified: 2014-10-17T14:41:33+02:00
in scheme: Thésaurus de la désignation des objets mobiliers
preferred label: manicure scissors @en-us
broader: instrument ou accessoire pour la toilette
alternative label: coupe-corps
alternative label: coupe-peaux
created: 2012-05-16T00:00:00+02:00
definition: Ciseaux à courtes lames arrondies pour couper les ongles.
status: 1

bâton à boucles
type: Concept
modified: 2014-10-17T14:25:14+02:00
in scheme: Thésaurus de la désignation des objets mobiliers
preferred label: curlers @en-us
broader: instrument ou accessoire pour la toilette
alternative label: bigoudis
created: 2012-05-16T00:00:00+02:00
definition: Tige en bois de section circulaire, amincie et arrondie à une extrémité et munie d'un court élément de prise à l'autre, autour de laquelle on enroule les cheveux pour former une boucle.
status: 1
broad match: cb11967147q

couteau de toilette
type: SimpleNonPreferredTerm
modified: 2014-10-17T14:29:05+02:00
created: 2014-01-15T14:54:24+01:00
status: 1

polissoir à ongles
type: Concept
modified: 2014-10-17T14:55:08+02:00
in scheme: Thésaurus de la désignation des objets mobiliers
preferred label: nail buffers @en-us
broader: instrument ou accessoire pour la toilette
created: 2012-05-16T00:00:00+02:00
definition: Instrument allongé et étroit, présentant une surface rembourrée garnie de peau, fixée dans une monture, servant à frotter les ongles pour les polir.
status: 1

pince à couverture de lit
type: Concept
modified: 2014-12-10T15:53:00+01:00
in scheme: Thésaurus de la désignation des objets mobiliers
broader: objet pour l'entretien de la maison
created: 2012-05-16T00:00:00+02:00
definition: Pince en bois pour fixer les couvertures sous le matelas.
status: 1

pince à couverture de lit
type: PreferredTerm
modified: 2014-12-10T15:53:00+01:00
created: 2014-01-15T14:54:24+01:00
status: 1

nappe de communion
type: Concept
modified: 2014-12-02T16:42:25+01:00
in scheme: Thésaurus de la désignation des objets mobiliers
preferred label: tovaglia da comunione @it
preferred label: houseling cloths @en-us
preferred label: toalha de comunhão @pt
broader: linge ou garniture liés à l'Eucharistie
created: 2012-05-16T00:00:00+02:00
related: plateau de communion
definition: Linge blanc, rectangulaire, en lin, en chanvre ou en coton, qui doit être placé ou tenu devant les communiants pour recevoir les fragments d'hostie consacrée qui pourraient tomber à terre.
TermeAssocie: plateau de communion
status: 1

nappe de communion
type: PreferredTerm
modified: 2014-12-02T16:42:25+01:00
created: 2014-01-15T14:54:24+01:00
status: 1

plateau de communion
type: Concept
modified: 2014-11-27T15:31:41+01:00
in scheme: Thésaurus de la désignation des objets mobiliers
preferred label: communion plates @en-us
preferred label: piattino da comunione @it
preferred label: salva de comunhão @pt
broader: objet lié à l'Eucharistie
alternative label: patène de communion
created: 2012-05-16T00:00:00+02:00
related: nappe de communion
related: récipient pour les cendres
definition: Petit plat en argent ou en métal doré, souvent ovale, parfois rectangulaire ou en croissant, utilisé pour recueillir les parcelles d'hostie lors de la communion des fidèles. Il peut être muni d'une anse ou d'un manche.
TermeAssocie: nappe de communion
TermeAssocie: récipient pour les cendres
status: 1
broad match: Objets du culte catholique

carrelage mural
type: Concept
modified: 2015-01-15T17:17:45+01:00
in scheme: Thésaurus de la désignation des objets mobiliers
preferred label: wall tile @en-us
narrower: carreau de poêle
broader: revêtement
created: 2012-05-16T00:00:00+02:00
definition: Revêtement mural, intérieur le plus souvent, formé de plaques carrées, rectangulaires ou hexagonales en céramique appelées carreaux.
status: 1

carrelage mural
type: PreferredTerm
modified: 2015-01-15T17:17:45+01:00
created: 2014-01-15T14:54:24+01:00
status: 1

carreau de poêle
type: Concept
modified: 2015-01-15T17:21:37+01:00
in scheme: Thésaurus de la désignation des objets mobiliers
broader: carrelage mural
created: 2012-05-16T00:00:00+02:00
related: poêle de chauffage
definition: Carreau de céramique de grand format, décoré le plus souvent et utilisé pour le revêtement des grands poêles intérieurs, en particulier dans les régions de l'Est.
TermeAssocie: poêle de chauffage
status: 1
broad match: cb11977297r

cierge de communion
type: Concept
modified: 2014-11-27T14:53:12+01:00
in scheme: Thésaurus de la désignation des objets mobiliers
preferred label: communion candles @en-us
preferred label: cero della comunione @it
preferred label: vela de comunhão @pt
broader: objet lié à l'Eucharistie
created: 2012-05-16T00:00:00+02:00
related: cierge
definition: Cierge, parfois décoré, porté lors de sa communion solennelle par un enfant ou par son parrain.
TermeAssocie: cierge
status: 1
broad match: http://vocab.getty.edu/aat/300037654

cierge de communion
type: PreferredTerm
modified: 2014-11-27T14:53:12+01:00
created: 2014-01-15T14:54:24+01:00
status: 1

coffret
type: Concept
modified: 2014-12-04T16:29:55+01:00
in scheme: Thésaurus de la désignation des objets mobiliers
preferred label: caskets (personal gear) @en-us
narrower: coffret porte-couverts
narrower: coffret de toilette
narrower: corbeille à linge
narrower: coffret de voyage
broader: meuble de rangement et d'exposition
alternative label: boîte à coiffe
alternative label: coffret à chapeau
created: 2012-05-16T00:00:00+02:00
definition: Petit coffre ou petite malle de moins d'un mètre de largeur.
status: 1

boîte à coiffe
type: SimpleNonPreferredTerm
modified: 2014-12-04T16:29:55+01:00
created: 2014-01-15T14:54:24+01:00
status: 1

coffret porte-couverts
type: Concept
modified: 2014-10-13T11:06:19+02:00
in scheme: Thésaurus de la désignation des objets mobiliers
preferred label: flatware cases @en-us
broader: coffret
created: 2012-05-16T00:00:00+02:00
definition: Coffret portatif comportant des compartiments ou des tiroirs à doublures intérieures spécifiques, modelées pour recevoir des couverts.
status: 1

coffret à chapeau
type: SimpleNonPreferredTerm
modified: 2014-12-04T16:29:55+01:00
created: 2014-01-15T14:54:24+01:00
status: 1

coffret de toilette
type: Concept
modified: 2014-12-04T16:24:51+01:00
in scheme: Thésaurus de la désignation des objets mobiliers
preferred label: toilet caskets @en-us
broader: coffret
alternative label: coffret à nécessaire de toilette
alternative label: coffret monté
created: 2012-05-16T00:00:00+02:00
definition: Coffret monté sur un support, qui servait à l'origine, à contenir les récipients et instruments nécessaires aux soins du corps, quelques bijoux et éventuellement les vêtements de nuit. Il est à décor soigné ou précieux et doublé à l'intérieur et parfois à l'extérieur. Il peut comporter des cases à récipients divers pour la toilette.
status: 1
broad match: cb13162914n
broad match: Coffret

corbeille à linge
type: Concept
modified: 2014-12-04T16:26:29+01:00
in scheme: Thésaurus de la désignation des objets mobiliers
preferred label: laundry baskets @en-us
broader: coffret
created: 2012-05-16T00:00:00+02:00
definition: Coffre ou coffret évasé, en bois couvert de tissu ou en osier, monté sur un support, servant à placer les objets de nuit et de toilette.
status: 1
broad match: cb13162914n

coffret de voyage
type: Concept
modified: 2014-12-04T16:25:02+01:00
in scheme: Thésaurus de la désignation des objets mobiliers
preferred label: trussing coffers @en-us
broader: coffret
created: 2012-05-16T00:00:00+02:00
definition: Coffret de bois blanc peint à la détrempe qui pouvait contenir tous objets de petite taille, éventuellement précieux, utilisé par des catégories très diverses de personnes et principalement par celles qui avaient à se déplacer.
status: 1
broad match: cb13162914n

coffret
type: PreferredTerm
modified: 2014-12-04T16:29:55+01:00
created: 2014-01-15T14:54:24+01:00
status: 1

générateur de particules
type: Concept
modified: 2015-08-05T11:14:13+02:00
in scheme: Thésaurus de la désignation des objets mobiliers
broader: générateur
alternative label: synchrotron
alternative label: accélérateur de particules
alternative label: cyclotron
created: 2012-05-16T00:00:00+02:00
definition: Générateur utilisant des champs magnétiques ou électriques pour amener des particules élémentaires à des vitesses très élevées.
status: 1
narrow match: Accélérateur de particules
narrow match: cb11966497v
narrow match: http://vocab.getty.edu/aat/300120666

générateur de particules
type: PreferredTerm
modified: 2015-08-05T11:14:13+02:00
created: 2014-01-15T14:54:24+01:00
status: 1

générateur
type: Concept
modified: 2015-10-07T15:28:11+02:00
in scheme: Thésaurus de la désignation des objets mobiliers
narrower: générateur de particules
narrower: générateur d'ondes électromagnétiques
narrower: générateur d'ondes mécaniques
narrower: générateur électrique
narrower: T69-6068
narrower: T69-6066
narrower: T69-6060
broader: machine énergétique
created: 2012-05-16T00:00:00+02:00
definition: Machine énergétique produisant de l’énergie.
status: 1

accélérateur de particules
type: SimpleNonPreferredTerm
modified: 2015-08-05T11:14:13+02:00
created: 2014-01-15T14:54:24+01:00
status: 1

cyclotron
type: SimpleNonPreferredTerm
modified: 2015-08-05T11:14:13+02:00
created: 2014-01-15T14:54:24+01:00
status: 1

synchrotron
type: SimpleNonPreferredTerm
modified: 2015-08-05T11:14:13+02:00
created: 2014-01-15T14:54:24+01:00
status: 1

serviette de baptême
type: Concept
modified: 2014-12-03T11:01:37+01:00
in scheme: Thésaurus de la désignation des objets mobiliers
preferred label: baptismal towels @en-us
preferred label: salvietta battesimale @it
preferred label: toalha baptismal @pt
broader: linge ou garniture liés aux sacrements autres que l'Eucharistie
created: 2012-05-16T00:00:00+02:00
definition: Serviette utilisée pour essuyer le nouveau baptisé.
status: 1
broad match: http://vocab.getty.edu/aat/300216632
broad match: cb11945312q

linge ou garniture liés aux sacrements autres que l'Eucharistie
type: Concept
modified: 2014-12-03T10:54:02+01:00
in scheme: Thésaurus de la désignation des objets mobiliers
preferred label: line e coperture per gli altri Sacramenti @it
preferred label: linen and ornaments for the other sacraments @en-us
preferred label: linhos e guarnições relacionados com os sacramentos @pt
narrower: serviette de baptême
narrower: voile de mariage
narrower: parement des fonts baptismaux
narrower: chrémeau
narrower: T69-2256
broader: linge ou garniture du culte catholique
created: 2012-05-16T00:00:00+02:00
definition: Pièce textile généralement à l’usage de l’officiant, liée à la préparation et à l’administration des autres sacrements (baptême, confirmation, réconciliation ou pénitence, onction des malades, mariage, ordre).
status: 1
broad match: Catégorie:Linge liturgique

serviette de baptême
type: PreferredTerm
modified: 2014-12-03T11:01:37+01:00
created: 2014-01-15T14:54:24+01:00
status: 1

bateau brise-glace
type: Concept
modified: 2014-12-19T12:14:33+01:00
in scheme: Thésaurus de la désignation des objets mobiliers
preferred label: icebreakers @en-us
broader: bateau de génie civil
created: 2012-05-16T00:00:00+02:00
definition: Bateau conçu pour ouvrir un chenal navigable dans les eaux prises par les glaces.
status: 1

bateau de génie civil
type: Concept
modified: 2014-10-16T09:54:47+02:00
in scheme: Thésaurus de la désignation des objets mobiliers
narrower: bateau brise-glace
narrower: bateau drague
narrower: bateau chaland à clapets
broader: bateau de service
alternative label: bateau de manutention d'ancrages
alternative label: baliseur
alternative label: bateau pour travaux sous-marins
alternative label: bateau de signalisation
alternative label: câblier
created: 2012-05-16T00:00:00+02:00
definition: Bateau destiné à la construction ou l'entretien des infrastructures et installations liées à la navigation.
status: 1
broad match: cb11953087h
broad match: Navire de services

bateau brise-glace
type: PreferredTerm
modified: 2014-12-19T12:14:33+01:00
created: 2014-01-15T14:54:24+01:00
status: 1

siège d'une place
type: Concept
modified: 2014-10-14T12:17:14+02:00
in scheme: Thésaurus de la désignation des objets mobiliers
preferred label: single seating furniture @en-us
narrower: fauteuil
narrower: escabeau
narrower: tabouret
narrower: selle
narrower: voyeuse
narrower: pouf
narrower: fumeuse
narrower: chaise
broader: siège
created: 2012-07-17T00:00:00+02:00
definition: Meuble de repos servant à asseoir une personne.
status: 1
broad match: http://data.bnf.fr/ark:/12148/cb131627639
broad match: Siège (meuble)

fauteuil
type: Concept
modified: 2014-12-05T12:34:06+01:00
in scheme: Thésaurus de la désignation des objets mobiliers
preferred label: armchairs @en-us
broader: siège d'une place
alternative label: fauteuil sans accotoirs
created: 2012-05-16T00:00:00+02:00
definition: Siège d'une place à dossier et accotoirs.
status: 1

escabeau
type: Concept
modified: 2014-12-05T12:26:48+01:00
in scheme: Thésaurus de la désignation des objets mobiliers
preferred label: wooden stools @en-us
broader: siège d'une place
created: 2012-05-16T00:00:00+02:00
related: escabeau à marches
definition: Siège d'une place sans dossier dont le dessus est en bois plein. Il est monté sur pieds ou sur panneaux verticaux et affecte des formes diverses.
TermeAssocie: escabeau à marches
status: 1
broad match: http://data.bnf.fr/ark:/12148/cb131627639

tabouret
type: Concept
modified: 2014-12-05T13:02:31+01:00
in scheme: Thésaurus de la désignation des objets mobiliers
preferred label: stools (seating furniture) @en-us
broader: siège d'une place
alternative label: pliant
created: 2012-05-16T00:00:00+02:00
definition: Siège d'une place, sans dossier, garni ou non. Le tabouret d’encoignure comprend un angle droit.
status: 1

selle
type: Concept
modified: 2014-12-05T12:59:49+01:00
in scheme: Thésaurus de la désignation des objets mobiliers
preferred label: milking stool @en-us
broader: siège d'une place
alternative label: selle à traire
created: 2012-05-16T00:00:00+02:00
definition: Siège en bois, d'une place et souvent assez bas, que l'on fiche en terre. Elle peut être monopode ou bipode et servir particulièrement pour la traite.
status: 1
broad match: http://data.bnf.fr/ark:/12148/cb131627639

voyeuse
type: Concept
modified: 2014-12-05T13:03:15+01:00
in scheme: Thésaurus de la désignation des objets mobiliers
preferred label: voyeuses @en-us
broader: siège d'une place
alternative label: voyeuse à genoux
alternative label: voyeuse assise
alternative label: ponteuse
created: 2012-05-16T00:00:00+02:00
definition: Meuble en forme de chaise dont le « dossier » comporte un accoudoir ou un enroulement supérieur garni. L’usager est assis face à ce « dossier » sur lequel il s’appuie pour observer le jeu.
status: 1
broad match: http://data.bnf.fr/ark:/12148/cb131627639
broad match: Siège (meuble)

pouf
type: Concept
modified: 2014-12-05T12:58:05+01:00
in scheme: Thésaurus de la désignation des objets mobiliers
preferred label: hassocks @en-us
broader: siège d'une place
created: 2012-05-16T00:00:00+02:00
definition: Tabouret rembourré sans accotoirs et sans pieds visibles.
status: 1
broad match: http://data.bnf.fr/ark:/12148/cb131627639

fumeuse
type: Concept
modified: 2014-12-05T12:57:22+01:00
in scheme: Thésaurus de la désignation des objets mobiliers
preferred label: smoking chairs (chairs for smoking) @en-us
broader: siège d'une place
alternative label: fumeuse à dossier
alternative label: fumeuse à pupitre
created: 2012-05-16T00:00:00+02:00
definition: Siège sur lequel on s'assoit à califourchon pour fumer, à fond un peu plus bas que celui de la voyeuse assise. La fumeuse comporte parfois, comme la ponteuse, une boîte sous l'accoudoir, où se place le cas échéant le matériel de fumeur.
status: 1
broad match: Siège (meuble)

siège d'une place
type: PreferredTerm
modified: 2014-10-14T12:17:14+02:00
created: 2014-01-15T14:54:24+01:00
status: 1

chaise
type: Concept
modified: 2014-12-05T12:23:01+01:00
in scheme: Thésaurus de la désignation des objets mobiliers
preferred label: side chairs @en-us
broader: siège d'une place
alternative label: chaise pour l'habit
created: 2012-05-16T00:00:00+02:00
definition: Siège d'une place, à dossier, sans accotoirs.
status: 1

véhicule routier motorisé de travaux publics
type: Concept
modified: 2014-12-30T11:00:37+01:00
in scheme: Thésaurus de la désignation des objets mobiliers
broader: véhicule routier motorisé spécialisé
alternative label: bulldozer
alternative label: camion-nacelle
alternative label: tractopelle
alternative label: camion-grue
alternative label: rouleau compresseur
created: 2013-11-06T00:00:00+01:00
definition: Véhicule motorisé équipé des outils ou machines nécessaires à la réalisation de travaux publics ou de génie civil.
status: 1
broad match: http://vocab.getty.edu/aat/300022242

camion-grue
type: SimpleNonPreferredTerm
modified: 2014-12-30T11:00:37+01:00
created: 2014-01-15T14:54:24+01:00
status: 1

camion-nacelle
type: SimpleNonPreferredTerm
modified: 2014-12-30T11:00:37+01:00
created: 2014-01-15T14:54:24+01:00
status: 1

bulldozer
type: SimpleNonPreferredTerm
modified: 2014-12-30T11:00:37+01:00
created: 2014-01-15T14:54:24+01:00
status: 1

rouleau compresseur
type: SimpleNonPreferredTerm
modified: 2014-12-30T11:00:37+01:00
created: 2014-01-15T14:54:24+01:00
status: 1

tractopelle
type: SimpleNonPreferredTerm
modified: 2014-12-30T11:00:37+01:00
created: 2014-01-15T14:54:24+01:00
status: 1

véhicule routier motorisé de travaux publics
type: PreferredTerm
modified: 2014-12-30T11:00:37+01:00
created: 2014-01-15T14:54:24+01:00
status: 1

étagère porte-récipients
type: Concept
modified: 2014-10-13T11:22:02+02:00
in scheme: Thésaurus de la désignation des objets mobiliers
broader: étagère
created: 2012-05-16T00:00:00+02:00
definition: Meuble suspendu servant à ranger des moules à gâteaux, des chaudrons, etc.
status: 1
broad match: http://vocab.getty.edu/aat/300165847

étagère porte-récipients
type: PreferredTerm
modified: 2014-10-13T11:22:02+02:00
created: 2014-01-15T14:54:24+01:00
status: 1

mandore
type: Concept
modified: 2014-10-10T12:56:26+02:00
in scheme: Thésaurus de la désignation des objets mobiliers
preferred label: mandores @en-us
broader: cordophone composite à manche et cordes pincées
created: 2012-05-16T00:00:00+02:00
definition: Instrument, ancêtre de la mandoline, à cordes doubles, composé d'une petite caisse bombée et d'un manche, en général fretté. Le son en est plus aigu que celui du luth.
status: 1

cordophone composite à manche et cordes pincées
type: Concept
modified: 2014-10-10T12:47:10+02:00
in scheme: Thésaurus de la désignation des objets mobiliers
preferred label: lutelike chordophones : plucked @en-us
narrower: mandore
narrower: mandoline
narrower: guitare
narrower: luth
narrower: T69-5067
narrower: T69-5069
broader: cordophone composite
alternative label: théorbe
alternative label: bissex
alternative label: archiluth
created: 2012-05-16T00:00:00+02:00
definition: Instrument constitué d'une caisse de résonance et d'un manche. Les cordes, tendues parallèlement à ce dernier sont, le plus souvent, pincées.
status: 1

mandore
type: PreferredTerm
modified: 2014-10-10T12:56:26+02:00
created: 2014-01-15T14:54:24+01:00
status: 1

décor d'architecture
type: Concept
modified: 2014-10-15T14:41:02+02:00
in scheme: Thésaurus de la désignation des objets mobiliers
preferred label: architectural ornaments @en-us
narrower: revêtement
narrower: fronton
narrower: cheminée
narrower: gâble
narrower: devanture
narrower: entablement
narrower: imposte
narrower: lambrequin d'architecture
narrower: dessus-de-baie
narrower: enseigne professionnelle
narrower: pinacle
narrower: acrotère
broader: élément d'architecture
created: 2012-05-16T00:00:00+02:00
definition: Elément porté par une œuvre d’architecture, participant à son effet d’ensemble, mais ne contribuant ni à sa structure ni à sa fonction.
status: 1
broad match: http://vocab.getty.edu/aat/300000885

fronton
type: Concept
modified: 2015-01-15T16:17:48+01:00
in scheme: Thésaurus de la désignation des objets mobiliers
preferred label: pediments @en-us
broader: décor d'architecture
created: 2012-05-16T00:00:00+02:00
related: sculpture
definition: Couronnement pyramidé à tympan et cadre mouluré.
TermeAssocie: sculpture
status: 1

cheminée
type: Concept
modified: 2015-02-25T10:06:58+01:00
in scheme: Thésaurus de la désignation des objets mobiliers
preferred label: fireplaces & chimneys @en-us
narrower: manteau de cheminée
narrower: hotte de cheminée
broader: décor d'architecture
created: 2012-05-16T00:00:00+02:00
scope note: Voir aussi le Thesaurus de la désignation des œuvres architecturales et des espaces aménagés.
related: poêle de chauffage
related: souche de cheminée
definition: Ouvrage de maçonnerie pour le chauffage, formé d'un foyer ouvert et d'un conduit pour l'évacuation de la fumée.
TermeAssocie: poêle de chauffage
TermeAssocie: souche de cheminée
status: 1

gâble
type: Concept
modified: 2015-01-15T16:34:32+01:00
in scheme: Thésaurus de la désignation des objets mobiliers
preferred label: gables @en-us
broader: décor d'architecture
created: 2012-05-16T00:00:00+02:00
definition: Couronnement pyramidé coiffant l'arc de couvrement d'une baie ou l'arc de front d'une voûte.
status: 1

élément d'architecture
type: Concept
modified: 2014-10-15T15:53:19+02:00
in scheme: Thésaurus de la désignation des objets mobiliers
preferred label: architectural elements @en-us
narrower: couvrement
narrower: divisions architecturales
narrower: couverture ou accessoire du toit
narrower: décor d'architecture
narrower: élément de serrurerie
narrower: matériau de construction
narrower: support ou organe de stabilité
narrower: fondations et sols
narrower: baie
narrower: charpente
narrower: mur - garde-corps - clôture
created: 2012-05-16T00:00:00+02:00
definition: Partie constituante d’un d’édifice.
status: 1

devanture
type: Concept
modified: 2015-01-08T14:37:11+01:00
in scheme: Thésaurus de la désignation des objets mobiliers
preferred label: storefronts @en-us
broader: décor d'architecture
alternative label: devanture de boutique
created: 2012-06-07T00:00:00+02:00
scope note: Voir aussi le Thesaurus de la désignation des œuvres architecturales et des espaces aménagés.
definition: Revêtement de la façade d'une boutique.
status: 1

entablement
type: Concept
modified: 2015-01-08T15:00:15+01:00
in scheme: Thésaurus de la désignation des objets mobiliers
preferred label: entablatures @en-us
narrower: T69-339
narrower: T69-337
broader: décor d'architecture
created: 2012-05-16T00:00:00+02:00
definition: Couronnement horizontal d'une ordonnance d'architecture comprenant une corniche qui couronne elle-même une frise et/ou une architrave.
status: 1

imposte
type: Concept
modified: 2015-01-15T16:58:21+01:00
in scheme: Thésaurus de la désignation des objets mobiliers
preferred label: imposts @en-us
broader: décor d'architecture
created: 2012-05-16T00:00:00+02:00
scope note: Utiliser le terme châssis de tympan pour l'imposte de menuiserie.
definition: Dans l'architecture classique, corps de moulures couronnant un piédroit ou un support vertical sans chapiteau et recevant la retombée d'un arc.
status: 1

lambrequin d'architecture
type: Concept
modified: 2015-01-15T17:04:40+01:00
in scheme: Thésaurus de la désignation des objets mobiliers
broader: décor d'architecture
alternative label: lambrequin de toit
alternative label: lambrequin de fenêtre
created: 2012-06-07T00:00:00+02:00
definition: Bordure en bois, tôle découpée, etc., pendant aux bords d’un toit, d’un auvent ou d’une fenêtre.
status: 1
broad match: cb11948511n

dessus-de-baie
type: Concept
modified: 2015-01-07T16:27:24+01:00
in scheme: Thésaurus de la désignation des objets mobiliers
narrower: dessus-de-fenêtre
narrower: dessus-de-porte
broader: décor d'architecture
created: 2012-05-16T00:00:00+02:00
related: sculpture
related: peinture
definition: Couronnement (élément décoratif, tableau, relief) placé au-dessus d'une baie.
TermeAssocie: sculpture
TermeAssocie: peinture
status: 1
narrow match: http://vocab.getty.edu/aat/300002911
broad match: http://data.bnf.fr/ark:/12148/cb125704047
broad match: Baie (architecture)

enseigne professionnelle
type: Concept
modified: 2015-01-08T14:52:49+01:00
in scheme: Thésaurus de la désignation des objets mobiliers
narrower: T69-333
broader: décor d'architecture
alternative label: plaque professionnelle
created: 2012-05-16T00:00:00+02:00
related: plaque décorative
definition: Panneau portant un emblème, une inscription ou un objet symbolique, placé à la façade d'un établissement professionnel, qu'il soit commercial, artisanal, libéral, industriel ou autre pour en signaler l'existence au public.
TermeAssocie: plaque décorative
status: 1
broad match: http://vocab.getty.edu/aat/300211861

pinacle
type: Concept
modified: 2015-01-15T17:09:44+01:00
in scheme: Thésaurus de la désignation des objets mobiliers
preferred label: pinnacles @en-us
broader: décor d'architecture
created: 2012-05-16T00:00:00+02:00
definition: Amortissement élancé, de plan carré ou polygonal, terminé en pyramide ou en cône effilé.
status: 1

acrotère
type: Concept
modified: 2015-01-07T15:13:45+01:00
in scheme: Thésaurus de la désignation des objets mobiliers
preferred label: acroteria @en-us
broader: décor d'architecture
created: 2012-05-16T00:00:00+02:00
definition: Amortissement placé à la naissance et au faîte des rampants d'un fronton ou d'un pignon, généralement formé d'un socle et d'un motif ornemental.
status: 1

décor d'architecture
type: PreferredTerm
modified: 2014-10-15T14:41:02+02:00
created: 2014-01-15T14:54:24+01:00
status: 1

machine à écorcer
type: Concept
modified: 2015-08-12T15:03:46+02:00
in scheme: Thésaurus de la désignation des objets mobiliers
broader: machine à séparer des solides
created: 2012-05-16T00:00:00+02:00
definition: Machine à dégarnir un tronc d'arbre ou des rondins de bois de leur écorce.
status: 1

machine à séparer des solides
type: Concept
modified: 2015-08-12T12:46:02+02:00
in scheme: Thésaurus de la désignation des objets mobiliers
narrower: machine à écorcer
narrower: machine à dépouiller
narrower: machine à décortiquer
narrower: machine à éplucher
narrower: machine à désagréger
broader: machine à séparer
created: 2012-05-16T00:00:00+02:00
definition: Machine à séparer différents composants solides naturellement liés.
status: 1

machine à écorcer
type: PreferredTerm
modified: 2015-08-12T15:03:46+02:00
created: 2014-01-15T14:54:24+01:00
status: 1

véhicule routier motorisé léger
type: Concept
modified: 2014-10-16T11:07:11+02:00
in scheme: Thésaurus de la désignation des objets mobiliers
preferred label: light vehicles @en-us
narrower: voiture automobile
narrower: véhicule motorisé à deux ou trois roues
broader: véhicule terrestre motorisé
created: 2013-11-06T00:00:00+01:00
definition: Véhicule routier, de faible poids et de petit volume, faisant appl à l'énergie mécanique pour sa propulsion.
status: 1
broad match: cb11942167q
broad match: http://vocab.getty.edu/aat/300042934
broad match: Véhicule

voiture automobile
type: Concept
modified: 2014-12-30T10:38:30+01:00
in scheme: Thésaurus de la désignation des objets mobiliers
preferred label: automobiles @en-us
narrower: décapotable
narrower: camping-car
narrower: camionnette
narrower: berline
narrower: coupé automobile
narrower: voiture de compétition
narrower: monospace
broader: véhicule routier motorisé léger
alternative label: véhicule motorisé léger à quatre roues
alternative label: voiturette
created: 2013-11-06T00:00:00+01:00
definition: Véhicule routier motorisé léger à quatre roues.
status: 1

véhicule motorisé à deux ou trois roues
type: Concept
modified: 2014-12-30T10:26:19+01:00
in scheme: Thésaurus de la désignation des objets mobiliers
preferred label: motorcycles @en-us
broader: véhicule routier motorisé léger
alternative label: motocyclette
alternative label: scooter
alternative label: cyclomoteur
created: 2013-11-06T00:00:00+01:00
definition: Véhicule automobile motorisé léger à deux ou trois roues.
status: 1
narrow match: http://data.bnf.fr/ark:/12148/cb11932539c

véhicule routier motorisé léger
type: PreferredTerm
modified: 2014-10-16T11:07:11+02:00
created: 2014-01-15T14:54:24+01:00
status: 1

véhicule terrestre motorisé
type: Concept
modified: 2014-10-16T11:04:49+02:00
in scheme: Thésaurus de la désignation des objets mobiliers
preferred label: motor vehicles @en-us
narrower: véhicule routier motorisé spécialisé
narrower: véhicule routier motorisé léger
narrower: véhicule routier motorisé militaire
narrower: véhicule routier motorisé lourd
broader: matériel de transport terrestre
created: 2013-11-05T00:00:00+01:00
definition: Véhicule routier faisant appel à l'énergie mécanique pour sa propulsion.
status: 1

bande textile
type: PreferredTerm
modified: 2014-10-20T11:33:22+02:00
created: 2014-01-15T14:54:24+01:00
status: 1

ruban
type: SimpleNonPreferredTerm
modified: 2014-10-20T11:33:22+02:00
created: 2014-01-15T14:54:24+01:00
status: 1

artisanat de tranchée
type: Concept
modified: 2014-10-09T12:08:07+02:00
in scheme: Thésaurus de la désignation des objets mobiliers
preferred label: trench art @en-us
broader: armement
alternative label: artisanat du poilu
created: 2013-12-10T00:00:00+01:00
definition: Tout objet fabriqué par un soldat à partir d'éléments d'équipement militaire ou d'armement, le plus fréquemment, des douilles d'obus ou de balles.
status: 1

artisanat de tranchée
type: PreferredTerm
modified: 2014-10-09T12:08:07+02:00
created: 2014-01-15T14:54:24+01:00
status: 1

artisanat du poilu
type: SimpleNonPreferredTerm
modified: 2014-10-09T12:08:07+02:00
created: 2014-01-15T14:54:24+01:00
status: 1

armement
type: Concept
modified: 2014-11-24T12:04:16+01:00
in scheme: Thésaurus de la désignation des objets mobiliers
preferred label: Weapons and Ammunition @en-us
narrower: artisanat de tranchée
narrower: arme défensive
narrower: arme offensive
narrower: piège
created: 2013-09-18T00:00:00+02:00
related: vêtement spécifique de militaire
related: navire de guerre
related: véhicule routier motorisé militaire
related: avion militaire
definition: Instrument ou équipement permettant d'attaquer (moyens offensifs) ou de se défendre (moyens défensifs).
TermeAssocie: vêtement spécifique de militaire
TermeAssocie: navire de guerre
TermeAssocie: véhicule routier motorisé militaire
TermeAssocie: avion militaire
status: 1

gong
type: Concept
modified: 2014-12-15T12:32:00+01:00
in scheme: Thésaurus de la désignation des objets mobiliers
preferred label: gongs @en-us
broader: idiophone à émission par percussion directe
created: 2012-05-16T00:00:00+02:00
related: baguette
definition: Instrument à percussion suspendu, constitué d'une plaque métallique circulaire que l'on frappe avec un maillet.
TermeAssocie: baguette
status: 1

baguette
type: Concept
modified: 2014-10-10T11:22:10+02:00
in scheme: Thésaurus de la désignation des objets mobiliers
preferred label: drumsticks @en-us
broader: accessoire du musicien
alternative label: mailloche
created: 2012-05-16T00:00:00+02:00
scope note: On peut aussi utiliser un maillet ou une mailloche, baguette terminée par une boule garnie de peau, ou encore un marteau.
related: gong
related: échelettes
related: tambour sur fût
related: timbales
related: xylophone
related: triangle
related: jeu de timbres
definition: Petit bâton mince, plus ou moins flexible, avec lequel on frappe sur différents instruments.
TermeAssocie: gong
TermeAssocie: échelettes
TermeAssocie: tambour sur fût
TermeAssocie: timbales
TermeAssocie: xylophone
TermeAssocie: triangle
TermeAssocie: jeu de timbres
status: 1
narrow match: http://vocab.getty.edu/aat/300042613

gong
type: PreferredTerm
modified: 2014-12-15T12:32:00+01:00
created: 2014-01-15T14:54:24+01:00
status: 1

idiophone à émission par percussion directe
type: Concept
modified: 2014-10-10T13:18:05+02:00
in scheme: Thésaurus de la désignation des objets mobiliers
preferred label: directly struck idiophones @en-us
narrower: gong
narrower: échelettes
narrower: cymbales
narrower: clochette
narrower: cloche
narrower: xylophone
narrower: triangle
narrower: jeu de timbres
narrower: roue à clochettes
narrower: jacquemart
narrower: T69-4940
narrower: T69-4942
narrower: T69-4943
broader: idiophone
created: 2012-05-16T00:00:00+02:00
definition: Idiophone produisant un son lorsqu'il est frappé par l'intermédiaire d'un percuteur externe directement manipulé par le musicien.
status: 1
broad match: Idiophone

machine à approprier
type: Concept
modified: 2015-10-15T11:57:22+02:00
in scheme: Thésaurus de la désignation des objets mobiliers
narrower: machine à ébarber
narrower: machine à écharner
narrower: machine à dépiler
narrower: machine à décaper
broader: machine à nettoyer
alternative label: purgeuse
created: 2012-05-16T00:00:00+02:00
definition: Machine à nettoyer un matériau ou un produit en en éliminant les parties défectueuses ou les adhérences superficielles, afin de le rendre conforme pour son utilisation.
status: 1
broad match: cb11981075n
broad match: http://vocab.getty.edu/aat/300162798

machine à ébarber
type: Concept
modified: 2015-10-15T12:08:20+02:00
in scheme: Thésaurus de la désignation des objets mobiliers
broader: machine à approprier
alternative label: ébarbeuse
created: 2012-05-16T00:00:00+02:00
definition: Machine à approprier un produit (papier, métal, verre, etc.) en en éliminant les excroissances inutiles et les bavures.
status: 1
narrow match: Meuleuse

machine à écharner
type: Concept
modified: 2015-10-15T12:11:54+02:00
in scheme: Thésaurus de la désignation des objets mobiliers
broader: machine à approprier
alternative label: écharneuse
created: 2012-05-16T00:00:00+02:00
definition: Machine à approprier la surface interne d'une peau en en éliminant les adhérences de chair et de graisse.
status: 1

machine à dépiler
type: Concept
modified: 2013-09-27T00:00:00+02:00
in scheme: Thésaurus de la désignation des objets mobiliers
broader: machine à approprier
alternative label: ébourreuse
created: 2012-05-16T00:00:00+02:00
definition: Machine à approprier une peau en la débarrassant de ses poils.
status: 1

machine à approprier
type: PreferredTerm
modified: 2015-10-15T11:57:22+02:00
created: 2014-01-15T14:54:24+01:00
status: 1

machine à nettoyer
type: Concept
modified: 2015-10-15T11:52:59+02:00
in scheme: Thésaurus de la désignation des objets mobiliers
narrower: machine à approprier
narrower: machine à épurer
narrower: machine à laver
broader: machine à mettre en état
alternative label: batteuse à sacs
alternative label: brosseuse-épointeuse
alternative label: brosse à blé
alternative label: brosse à grains
created: 2012-05-16T00:00:00+02:00
definition: Machine à mettre en état un matériau ou un produit en le débarrassant de ses éléments polluants.
status: 1

purgeuse
type: SimpleNonPreferredTerm
modified: 2015-10-15T11:57:22+02:00
created: 2014-01-15T14:54:24+01:00
status: 1

machine à décaper
type: Concept
modified: 2015-10-15T12:00:08+02:00
in scheme: Thésaurus de la désignation des objets mobiliers
narrower: machine à décalaminer
broader: machine à approprier
created: 2012-05-16T00:00:00+02:00
definition: Machine à approprier un matériau ou un produit en éliminant la couche d'impuretés qui le recouvre.
status: 1
broad match: Décapage

étouffoir de cuisson
type: Concept
modified: 2014-10-16T16:33:46+02:00
in scheme: Thésaurus de la désignation des objets mobiliers
broader: récipient pour la cuisson des aliments
alternative label: couvercle à braises
created: 2012-05-16T00:00:00+02:00
definition: Grande cloche en céramique, à une ou deux anses, dont on couvre un récipient pour cuire des aliments à l'étouffée. Le couvercle à braises est en métal, à rebord vertical (pour retenir les braises) et à long manche.
status: 1
broad match: http://vocab.getty.edu/aat/300201279
broad match: http://data.bnf.fr/ark:/12148/cb150337035

étouffoir de cuisson
type: PreferredTerm
modified: 2014-10-16T16:33:46+02:00
created: 2014-01-15T14:54:24+01:00
status: 1

couvercle à braises
type: SimpleNonPreferredTerm
modified: 2014-10-16T16:33:46+02:00
created: 2014-01-15T14:54:24+01:00
status: 1

rabat de confrérie
type: Concept
modified: 2014-12-03T12:42:22+01:00
in scheme: Thésaurus de la désignation des objets mobiliers
preferred label: confraternity rabats @en-us
preferred label: facciola di confraternita @it
preferred label: colarinho voltado de confraria @pt
broader: autre vêtement catholique
created: 2012-05-16T00:00:00+02:00
definition: Rabat, généralement de couleur, porté par les membres d'une confrérie.
status: 1
broad match: http://vocab.getty.edu/aat/300390957
broad match: cb12239586h
broad match: Catégorie:Costume religieux

rabat de confrérie
type: PreferredTerm
modified: 2014-12-03T12:42:22+01:00
created: 2014-01-15T14:54:24+01:00
status: 1

escalier
type: Concept
modified: 2015-01-16T17:08:09+01:00
in scheme: Thésaurus de la désignation des objets mobiliers
preferred label: stairs @en-us
narrower: rampe d'appui
broader: divisions architecturales
alternative label: noyau d'escalier
alternative label: contremarche
created: 2012-05-16T00:00:00+02:00
scope note: Voir aussi le Thesaurus de la désignation des œuvres architecturales et des espaces aménagés.
definition: Ouvrage formé de marches et permettant de passer d'un plan à un autre, d'un étage à un autre, dans ou à l'extérieur d’un bâtiment. Il est généralement contenu dans une cage.
status: 1

rampe d'appui
type: Concept
modified: 2015-01-16T17:11:00+01:00
in scheme: Thésaurus de la désignation des objets mobiliers
preferred label: handrails @en-us
narrower: T69-74
broader: escalier
alternative label: rampe
created: 2012-05-16T00:00:00+02:00
definition: Garde-corps d'un escalier portant une main courante. La rampe est posée sur le limon ou fixée sur sa face externe.
status: 1

escalier
type: PreferredTerm
modified: 2015-01-16T17:08:09+01:00
created: 2014-01-15T14:54:24+01:00
status: 1

noyau d'escalier
type: SimpleNonPreferredTerm
modified: 2015-01-16T17:08:09+01:00
created: 2014-01-15T14:54:24+01:00
status: 1

contremarche
type: SimpleNonPreferredTerm
modified: 2015-01-16T17:08:09+01:00
created: 2014-01-15T14:54:24+01:00
status: 1

devant de cheminée
type: PreferredTerm
modified: 2014-12-04T15:14:31+01:00
created: 2014-01-15T14:54:24+01:00
status: 1

devant de feu
type: SimpleNonPreferredTerm
modified: 2014-12-04T15:14:31+01:00
created: 2014-01-15T14:54:24+01:00
status: 1

machine à rétreindre
type: Concept
modified: 2015-08-13T15:30:27+02:00
in scheme: Thésaurus de la désignation des objets mobiliers
broader: machine à marteler
created: 2012-05-16T00:00:00+02:00
definition: Machine à diminuer par martelage la section ou le diamètre d'une pièce, d'un tube ou d'un fil métalliques.
status: 1

machine à marteler
type: Concept
modified: 2015-08-13T15:21:56+02:00
in scheme: Thésaurus de la désignation des objets mobiliers
narrower: machine à rétreindre
broader: machine à allonger
alternative label: martinet hydraulique
created: 2012-05-16T00:00:00+02:00
definition: Machine à allonger un matériau ou un produit par chocs successifs.
status: 1

machine à rétreindre
type: PreferredTerm
modified: 2015-08-13T15:30:27+02:00
created: 2014-01-15T14:54:24+01:00
status: 1

psaltérion
type: Concept
modified: 2014-10-10T13:10:55+02:00
in scheme: Thésaurus de la désignation des objets mobiliers
preferred label: psalteries @en-us
broader: cithare à cordes frappées ou pincées
alternative label: sauterie
alternative label: salterie
created: 2012-05-16T00:00:00+02:00
definition: Instrument à caisse plate en bois de forme trapézoïdale ou triangulaire, percée de roses. Les cordes, simples ou doubles, sont parallèles à la caisse et fixées à chaque extrémité par des fiches ; elles sont pincées avec les doigts ou un plectre ou bien sont frottées avec un archet.
status: 1

cithare à cordes frappées ou pincées
type: Concept
modified: 2014-10-10T13:08:58+02:00
in scheme: Thésaurus de la désignation des objets mobiliers
preferred label: zitherlike chordophone : struck or plucked @en-us
narrower: psaltérion
narrower: tympanon
narrower: épinette des Vosges
broader: cordophone simple
alternative label: tambourin de Gascogne
alternative label: tambourin souletin
alternative label: bûche des Flandres
alternative label: tambourin à cordes
alternative label: tambourin de Béarn
alternative label: tambourin ossalois
created: 2012-05-16T00:00:00+02:00
definition: Cordophone simple dont les cordes sont frappées ou mises en vibration par friction ou à l'aide d'un plectre (sorte de médiator).
status: 1

salterie
type: SimpleNonPreferredTerm
modified: 2014-10-10T13:10:55+02:00
created: 2014-01-15T14:54:24+01:00
status: 1

psaltérion
type: PreferredTerm
modified: 2014-10-10T13:10:55+02:00
created: 2014-01-15T14:54:24+01:00
status: 1

sauterie
type: SimpleNonPreferredTerm
modified: 2014-10-10T13:10:55+02:00
created: 2014-01-15T14:54:24+01:00
status: 1

signet de livre liturgique
type: Concept
modified: 2014-12-02T16:04:41+01:00
in scheme: Thésaurus de la désignation des objets mobiliers
preferred label: segnalibro di libro liturgico @it
preferred label: liturgical bookmarks @en-us
preferred label: marcador de livro litúrgico @pt
broader: linge ou garniture liés à l'autel
alternative label: tranche-fil de livre liturgique
alternative label: signet de missel
created: 2012-05-16T00:00:00+02:00
definition: Bande de carton ou ruban servant à marquer les pages d'un livre liturgique. Aux couleurs du temps liturgique, le signet est souvent attaché à une petite tige ou une épingle appelée tranche-fil, ou peut faire partie de la reliure.
status: 1

signet de missel
type: SimpleNonPreferredTerm
modified: 2014-12-02T16:04:41+01:00
created: 2014-01-15T14:54:24+01:00
status: 1

tranche-fil de livre liturgique
type: SimpleNonPreferredTerm
modified: 2014-12-02T16:04:41+01:00
created: 2014-01-15T14:54:24+01:00
status: 1

signet de livre liturgique
type: PreferredTerm
modified: 2014-12-02T16:04:41+01:00
created: 2014-01-15T14:54:24+01:00
status: 1

poignée
type: Concept
modified: 2015-01-29T17:27:03+01:00
in scheme: Thésaurus de la désignation des objets mobiliers
preferred label: handles @en-us
broader: élément de serrurerie
alternative label: bouton de tirage
alternative label: pendeloque
created: 2012-05-16T00:00:00+02:00
definition: Organe de préhension et de tirage, parfois en forme de bouton ou de pendeloque, qui permet l’ouverture d’un vantail ou peut servir à la manœuvre d’un système de fermeture. Il peut être fixe, articulé ou tournant.
status: 1
narrow match: http://data.bnf.fr/ark:/12148/cb125577259

pendeloque
type: SimpleNonPreferredTerm
modified: 2015-01-29T17:27:03+01:00
created: 2014-01-15T14:54:24+01:00
status: 1

élément de serrurerie
type: Concept
modified: 2015-01-23T17:12:19+01:00
in scheme: Thésaurus de la désignation des objets mobiliers
preferred label: ironwork (visual works) @en-us
narrower: poignée
narrower: organe de sécurité
narrower: heurtoir
narrower: T69-536
narrower: T69-539
broader: élément d'architecture
alternative label: charnière
alternative label: butoir
created: 2012-05-16T00:00:00+02:00
definition: Pièce de métal servant à consolider, articuler ou fermer une ou plusieurs pièces, de bois ou métallique, principalement dans l’architecture et le mobilier.
status: 1

bouton de tirage
type: SimpleNonPreferredTerm
modified: 2015-01-29T17:27:03+01:00
created: 2014-01-15T14:54:24+01:00
status: 1

poignée
type: PreferredTerm
modified: 2015-01-29T17:27:03+01:00
created: 2014-01-15T14:54:24+01:00
status: 1

machine à mettre en état
type: Concept
modified: 2015-10-14T15:53:02+02:00
in scheme: Thésaurus de la désignation des objets mobiliers
narrower: machine à conditionner
narrower: machine à organiser
narrower: machine à nettoyer
narrower: machine à donner un aspect
narrower: machine à enregistrer
narrower: machine à imprimer
narrower: T69-5817
narrower: T69-5765
broader: machine liée à la production industrielle
created: 2012-05-16T00:00:00+02:00
definition: Machine à réaliser, sur des produits ayant les caractéristiques physiques et structurelles voulues, diverses opérations nécessaires à leur finition, à leur conservation, à leur commercialisation, à leur exploitation, etc.
status: 1

machine à pasteuriser
type: Concept
modified: 2015-10-14T16:20:37+02:00
in scheme: Thésaurus de la désignation des objets mobiliers
broader: machine à conditionner
alternative label: pasteurisateur
created: 2012-05-16T00:00:00+02:00
scope note: Ne pas confondre avec la machine à stériliser qui ne concerne pas les produits alimentaires.
definition: Machine à faire subir un procédé de pasteurisation (changements rapides de température) à certains produits alimentaires (lait, crème, bière, jus de fruit, etc.) pour en détruire les germes pathogènes.
status: 1
broad match: cb12011474j
broad match: Pasteurisation

machine à empiler
type: SimpleNonPreferredTerm
modified: 2015-10-14T15:57:20+02:00
created: 2014-01-15T14:54:24+01:00
status: 1

machine à ensacher
type: Concept
modified: 2015-10-14T16:03:50+02:00
in scheme: Thésaurus de la désignation des objets mobiliers
broader: machine à conditionner
alternative label: ensacheuse
alternative label: ensacheuse à carrousel
created: 2012-05-16T00:00:00+02:00
definition: Machine à conditionner un matériau ou un produit dans un sac.
status: 1
broad match: cb12011474j

machine à conditionner
type: PreferredTerm
modified: 2015-10-14T15:57:20+02:00
created: 2014-01-15T14:54:24+01:00
status: 1

machine à obturer
type: Concept
modified: 2015-10-14T16:10:08+02:00
in scheme: Thésaurus de la désignation des objets mobiliers
narrower: T69-5753
narrower: T69-5755
broader: machine à conditionner
created: 2012-05-16T00:00:00+02:00
definition: Machine à rendre hermétique un contenant à l'aide d'un élément rapporté.
status: 1
broad match: cb12011474j

machine à palettiser
type: Concept
modified: 2015-10-14T16:17:54+02:00
in scheme: Thésaurus de la désignation des objets mobiliers
broader: machine à conditionner
created: 2012-05-16T00:00:00+02:00
definition: Machine à conditionner des produits sur une palette.
status: 1
broad match: cb12011474j

machine à envelopper
type: Concept
modified: 2015-10-14T16:06:05+02:00
in scheme: Thésaurus de la désignation des objets mobiliers
broader: machine à conditionner
created: 2012-05-16T00:00:00+02:00
definition: Machine à emballer un matériau ou un produit dans une protection souple.
status: 1
broad match: cb12011474j

machine à empaqueter
type: Concept
modified: 2015-10-14T16:01:50+02:00
in scheme: Thésaurus de la désignation des objets mobiliers
broader: machine à conditionner
created: 2012-05-16T00:00:00+02:00
definition: Machine à emballer un produit dans un paquet.
status: 1
broad match: cb12011474j

machine à stériliser
type: Concept
modified: 2015-10-14T16:24:16+02:00
in scheme: Thésaurus de la désignation des objets mobiliers
broader: machine à conditionner
alternative label: étuve de stérilisation
alternative label: étuve de désinfection
created: 2012-05-16T00:00:00+02:00
scope note: Ne pas confondre avec la machine à pasteuriser qui ne concerne que les produits alimentaires.
related: T69-4334
definition: Machine à traiter divers produits (instruments médicaux, composants électroniques, pansements etc.) par différents procédés de stérilisation (chauffage, ébullition, traitement chimique, filtrage, etc.) afin d'en détruire les germes microbiens.
TermeAssocie: T69-4334
status: 1
narrow match: Stérilisateur

échelettes
type: Concept
modified: 2014-09-05T12:08:21+02:00
in scheme: Thésaurus de la désignation des objets mobiliers
broader: idiophone à émission par percussion directe
created: 2012-05-16T00:00:00+02:00
scope note: Au Moyen Age, il peut s'agir d'un instrument constitué de clochettes de calibre croissant suspendues sur une barre en bois.
related: baguette
definition: Instrument de percussion suspendu, composé de lames de bois de longueur croissante que l'on frappe avec deux baguettes.
TermeAssocie: baguette
status: 1

échelettes
type: PreferredTerm
modified: 2014-09-05T12:08:21+02:00
created: 2014-01-15T14:54:24+01:00
status: 1

crachoir au sol
type: SimpleNonPreferredTerm
modified: 2014-12-10T16:46:04+01:00
created: 2014-01-15T14:54:24+01:00
status: 1

crachoir
type: PreferredTerm
modified: 2014-12-10T16:46:04+01:00
created: 2014-01-15T14:54:24+01:00
status: 1

bassin à cracher
type: SimpleNonPreferredTerm
modified: 2014-12-10T16:46:04+01:00
created: 2014-01-15T14:54:24+01:00
status: 1

égouttoir à fromage
type: Concept
modified: 2014-12-08T12:41:22+01:00
in scheme: Thésaurus de la désignation des objets mobiliers
broader: récipient pour la préparation des aliments
alternative label: pot à petit lait
alternative label: égouttoir à caillé
created: 2012-05-16T00:00:00+02:00
related: meuble pour lait ou fromage
definition: Récipient sur lequel on pose les moules à fromage remplis de caillé pour faire égoutter le petit lait. Il est en bois ou en céramique et se présente sous la forme d’ un plateau à rigoles ou d’un plat très creux.
TermeAssocie: meuble pour lait ou fromage
status: 1
broad match: http://data.bnf.fr/ark:/12148/cb119610590

égouttoir à fromage
type: PreferredTerm
modified: 2014-12-08T12:41:22+01:00
created: 2014-01-15T14:54:24+01:00
status: 1

meuble pour lait ou fromage
type: Concept
modified: 2014-10-10T16:58:38+02:00
in scheme: Thésaurus de la désignation des objets mobiliers
narrower: baratte
narrower: presse à fromage
broader: meuble de préparation culinaire
alternative label: cuve à saumure
alternative label: couloir à fromage
alternative label: malaxeur à beurre
alternative label: auge à saler le fromage
alternative label: cuve à lait
alternative label: porte-baratte
alternative label: table à lait
created: 2012-05-16T00:00:00+02:00
related: égouttoir à fromage
related: moule à fromage
definition: Meuble servant à une des étapes de la fabrication du beurre ou du fromage.
TermeAssocie: égouttoir à fromage
TermeAssocie: moule à fromage
status: 1
broad match: http://vocab.getty.edu/aat/300199765

égouttoir à caillé
type: SimpleNonPreferredTerm
modified: 2014-12-08T12:41:22+01:00
created: 2014-01-15T14:54:24+01:00
status: 1

récipient pour la préparation des aliments
type: Concept
modified: 2014-10-16T16:53:17+02:00
in scheme: Thésaurus de la désignation des objets mobiliers
preferred label: containers for preparing food @en-us
narrower: mortier de cuisine
narrower: égouttoir à fromage
narrower: moule à beurre
narrower: moule à fromage
narrower: paneton
narrower: vire-omelette
narrower: passoire
narrower: pot à filtrer
narrower: terrine
narrower: planche à découper
narrower: pot à crémer
broader: objet lié aux aliments ou aux boissons
alternative label: moule à glace
alternative label: moule à sorbet
alternative label: égouttoir à galettes
alternative label: cannelon
alternative label: écope
alternative label: crêpier
alternative label: pot à cailler
alternative label: galetier
alternative label: sorbetière
alternative label: pot à présure
alternative label: puisoir
alternative label: caillère
alternative label: bassin à blancs d'œuf
created: 2012-05-16T00:00:00+02:00
related: meuble de préparation culinaire
definition: Objet, le plus souvent creux, servant à couper, égoutter, mouler, presser, etc, des aliments.
TermeAssocie: meuble de préparation culinaire
status: 1
broad match: cb13184671j

pot à petit lait
type: SimpleNonPreferredTerm
modified: 2014-12-08T12:41:22+01:00
created: 2014-01-15T14:54:24+01:00
status: 1

estrade pour pupitre de Torah
type: Concept
modified: 2014-01-10T00:00:00+01:00
in scheme: Thésaurus de la désignation des objets mobiliers
narrower: clôture pour estrade de Torah
broader: meuble du culte synagogal
alternative label: bimah
created: 2012-05-16T00:00:00+02:00
definition: Plate-forme supportant le pupitre où l'on déroule et lit la Torah. Le rabbin peut parler depuis la bimah et on y sonne du shofar pour Rosh ha-Shanah. L'estrade peut être appelée l'Almenar, par déformation de l'Al-Mambar, pupitre du prêcheur à la mosquée ou du mot latin "memor".
status: 1

estrade pour pupitre de Torah
type: PreferredTerm
modified: 2014-01-10T00:00:00+01:00
created: 2014-01-15T14:54:24+01:00
status: 1

meuble du culte synagogal
type: Concept
modified: 2014-01-10T00:00:00+01:00
in scheme: Thésaurus de la désignation des objets mobiliers
narrower: estrade pour pupitre de Torah
narrower: fontaine d'ablutions
narrower: chaire à prêcher de synagogue
narrower: tronc de synagogue
narrower: cabane de Soukkot
narrower: siège de synagogue
narrower: baldaquin de mariage
narrower: T69-1049
narrower: T69-1018
narrower: T69-1052
narrower: T69-1041
broader: T69-1016
created: 2012-05-16T00:00:00+02:00
status: 1

bimah
type: SimpleNonPreferredTerm
modified: 2014-01-10T00:00:00+01:00
created: 2014-01-15T14:54:24+01:00
status: 1

clôture pour estrade de Torah
type: Concept
modified: 2014-01-10T00:00:00+01:00
in scheme: Thésaurus de la désignation des objets mobiliers
broader: estrade pour pupitre de Torah
alternative label: clôture pour pupitre de Torah
created: 2012-05-16T00:00:00+02:00
definition: Clôture en fer forgée, en pierre ou en bois destinée à isoler le lieu où se déroule l'office. Cette clôture peut être partielle ou faire le tour de la bimah.
status: 1

sculpture
type: Concept
modified: 2014-10-17T16:09:17+02:00
in scheme: Thésaurus de la désignation des objets mobiliers
preferred label: sculpture (visual work) @en-us
narrower: tête
narrower: socle d'oeuvre décorative
narrower: relief
narrower: protomé
narrower: accumulation
narrower: ronde-bosse
narrower: plein relief spatial
narrower: sculpture cinétique
narrower: automate
narrower: ready-made
narrower: installation
narrower: expansion
narrower: T69-7963
narrower: T69-7968
created: 2012-05-16T00:00:00+02:00
related: fronton
related: dessus-de-baie
related: trumeau de cheminée
related: forme ou moule de mise en oeuvre artisanale
related: écorché
related: dessus-de-fenêtre
related: dessus-de-porte
related: T69-382
definition: Domaine de l'art concerné par la production de formes en ronde-bosse ou en relief au moyen de diverses techniques : taille, moulage, modelage, fonte, repoussé, etc. Ce terme désigne également l'œuvre ou l'objet résultant de ces techniques.
TermeAssocie: fronton
TermeAssocie: dessus-de-baie
TermeAssocie: trumeau de cheminée
TermeAssocie: forme ou moule de mise en oeuvre artisanale
TermeAssocie: écorché
TermeAssocie: dessus-de-fenêtre
TermeAssocie: dessus-de-porte
TermeAssocie: T69-382
status: 1

tête
type: PreferredTerm
modified: 2014-12-04T10:55:36+01:00
created: 2014-01-15T14:54:24+01:00
status: 1

pince à ouvrir les gants
type: PreferredTerm
modified: 2014-10-17T14:53:52+02:00
created: 2014-01-15T14:54:24+01:00
status: 1

campanile
type: Concept
modified: 2014-12-15T17:09:24+01:00
in scheme: Thésaurus de la désignation des objets mobiliers
broader: couverture ou accessoire du toit
created: 2012-05-16T00:00:00+02:00
scope note: Ne pas appeler campanile un clocher. Voir aussi le Thesaurus de la désignation des œuvres architecturales et des espaces aménagés.
definition: Clocher formant édicule sur le faîte d'un bâtiment. Il est souvent construit en charpente.
status: 1
broad match: http://data.bnf.fr/ark:/12148/cb11934126d
broad match: http://vocab.getty.edu/aat/300004848

campanile
type: PreferredTerm
modified: 2014-12-15T17:09:24+01:00
created: 2014-01-15T14:54:24+01:00
status: 1

accessoire de jeu d'adresse ou sportif
type: Concept
modified: 2014-12-30T13:00:08+01:00
in scheme: Thésaurus de la désignation des objets mobiliers
broader: jeu d'adresse ou sportif
alternative label: ballon
alternative label: piolet
alternative label: crampon
alternative label: balle
alternative label: raquette (jeu)
created: 2013-11-29T00:00:00+01:00
definition: Élément ou ensemble incomplet d'éléments utilisés dans la pratique d'un jeu d'adresse ou sportif.
status: 1
broad match: http://vocab.getty.edu/aat/300218781

piolet
type: SimpleNonPreferredTerm
modified: 2014-12-30T13:00:08+01:00
created: 2014-01-15T14:54:24+01:00
status: 1

balle
type: SimpleNonPreferredTerm
modified: 2014-12-30T13:00:08+01:00
created: 2014-01-15T14:54:24+01:00
status: 1

crampon
type: SimpleNonPreferredTerm
modified: 2014-12-30T13:00:08+01:00
created: 2014-01-15T14:54:24+01:00
status: 1

raquette (jeu)
type: SimpleNonPreferredTerm
modified: 2014-12-30T13:00:08+01:00
created: 2014-01-15T14:54:24+01:00
status: 1

jeu d'adresse ou sportif
type: Concept
modified: 2014-12-30T13:05:28+01:00
in scheme: Thésaurus de la désignation des objets mobiliers
narrower: accessoire de jeu d'adresse ou sportif
broader: jeu, jouet et sport
alternative label: yoyo
alternative label: cerf-volant
alternative label: jeu de fléchettes
alternative label: babyfoot
alternative label: bilboquet
alternative label: diabolo
alternative label: jeu de boules
alternative label: jeu de quilles
alternative label: osselets
alternative label: jeu de billes
alternative label: toupie (jouet)
alternative label: mikado (jeu)
alternative label: boomerang
created: 2013-11-29T00:00:00+01:00
related: vêtement spécifique de sportif
definition: Ensemble cohérent d'éléments nécessaires à la pratique de certains jeux ou activités faisant appel aux capacités sportive, de dextérité, d'adresse, etc.
TermeAssocie: vêtement spécifique de sportif
status: 1
broad match: http://vocab.getty.edu/aat/300241552

ballon
type: SimpleNonPreferredTerm
modified: 2014-12-30T13:00:08+01:00
created: 2014-01-15T14:54:24+01:00
status: 1

accessoire de jeu d'adresse ou sportif
type: PreferredTerm
modified: 2014-12-30T13:00:08+01:00
created: 2014-01-15T14:54:24+01:00
status: 1

fourreau
type: Concept
modified: 2014-12-05T15:14:01+01:00
in scheme: Thésaurus de la désignation des objets mobiliers
preferred label: seaths (cases) @en-us
broader: étui
alternative label: gaine
created: 2012-05-16T00:00:00+02:00
definition: Étui adapté à la lame d'un objet tranchant ou pointu.
status: 1

étui
type: Concept
modified: 2014-12-05T15:13:13+01:00
in scheme: Thésaurus de la désignation des objets mobiliers
preferred label: etuis (containers) @en-us
narrower: fourreau
broader: objet décoratif ou de rangement ou pour les plantes et les fleurs
alternative label: trousse
alternative label: écrin
alternative label: étui à livres
alternative label: boîte à bijoux
created: 2012-05-16T00:00:00+02:00
definition: Enveloppe rigide ou souple, dont les formes intérieures et extérieures sont adaptées aux objets qu'elle contient et qui sont souvent assortis. L'étui est désigné par son contenu.
status: 1
narrow match: cb13190770q

fourreau
type: PreferredTerm
modified: 2014-12-05T15:14:01+01:00
created: 2014-01-15T14:54:24+01:00
status: 1

gaine
type: SimpleNonPreferredTerm
modified: 2014-12-05T15:14:01+01:00
created: 2014-01-15T14:54:24+01:00
status: 1

métronome
type: Concept
modified: 2014-12-12T15:23:38+01:00
in scheme: Thésaurus de la désignation des objets mobiliers
preferred label: metronomes @en-us
broader: accessoire du musicien
created: 2012-05-16T00:00:00+02:00
definition: Instrument à pendule, de forme souvent pyramidale qui, par un mouvement de balancier, marque les temps et la mesure d'un morceau de musique.
status: 1

accessoire du musicien
type: Concept
modified: 2014-10-10T11:19:50+02:00
in scheme: Thésaurus de la désignation des objets mobiliers
preferred label: equipment for music @en-us
narrower: baguette
narrower: métronome
narrower: diapason
narrower: clef d'accord
narrower: archet
narrower: bâton de mesure
broader: instrument de musique
created: 2012-05-16T00:00:00+02:00
definition: Elément nécessaire au musicien, complémentaire de son instrument.
status: 1
broad match: http://data.bnf.fr/ark:/12148/cb119367821
broad match: Instrument de musique

métronome
type: PreferredTerm
modified: 2014-12-12T15:23:38+01:00
created: 2014-01-15T14:54:24+01:00
status: 1

instrument de démonstration en statique des solides
type: Concept
modified: 2014-10-23T16:09:26+02:00
in scheme: Thésaurus de la désignation des objets mobiliers
broader: instrument de démonstration en mécanique des solides
alternative label: solide à gravité variable
created: 2012-05-16T00:00:00+02:00
definition: Instrument de mise en évidence et d'étude des systèmes de points matériel soumis à l'action de forces, quand elles ne créent aucun mouvement : objets en équilibre, équilibres paradoxaux, recherche du centre de gravité.
status: 1
broad match: http://data.bnf.fr/ark:/12148/cb15577164c
broad match: http://vocab.getty.edu/aat/300122283

instrument de démonstration en statique des solides
type: PreferredTerm
modified: 2014-10-23T16:09:26+02:00
created: 2014-01-15T14:54:24+01:00
status: 1

solide à gravité variable
type: SimpleNonPreferredTerm
modified: 2014-10-23T16:09:26+02:00
created: 2014-01-15T14:54:24+01:00
status: 1

verrière
type: Concept
modified: 2014-12-09T17:07:57+01:00
in scheme: Thésaurus de la désignation des objets mobiliers
narrower: panneau de verrière
narrower: rondel
broader: fermeture de baie
created: 2012-05-16T00:00:00+02:00
definition: Fermeture fixe en verre d'une baie ou d'une partie de baie, directement maintenue par une armature métallique, parfois un châssis en bois, ou par le cadre en maçonnerie de la baie. Elle appartient à un édifice religieux ou civil et peut être réalisée selon différentes techniques (vitrail, dalle de verre, vitrerie, etc.).
status: 1

panneau de verrière
type: Concept
modified: 2014-12-15T17:39:42+01:00
in scheme: Thésaurus de la désignation des objets mobiliers
preferred label: panes @en-us
broader: verrière
alternative label: panneau
created: 2012-05-16T00:00:00+02:00
definition: Elément d'une verrière, de dimensions et de formes variées, correspondant à l'unité de montage.
status: 1
broad match: Verrière (architecture)

verrière
type: PreferredTerm
modified: 2014-12-09T17:07:57+01:00
created: 2014-01-15T14:54:24+01:00
status: 1

rondel
type: Concept
modified: 2014-12-09T17:17:40+01:00
in scheme: Thésaurus de la désignation des objets mobiliers
preferred label: roundels (circular panels) @en-us
broader: verrière
created: 2012-05-16T00:00:00+02:00
definition: Pièce de verre employée isolément, circulaire, incolore, ovale ou même polygonale, de 20 cm environ de diamètre ou de côté, portant un décor peint et le plus souvent utilisée comme motif central dans une verrière ou un châssis vitré.
status: 1
broad match: http://vocab.getty.edu/aat/300010267
broad match: Verrière (architecture)

fermeture de baie
type: Concept
modified: 2015-02-06T12:53:00+01:00
in scheme: Thésaurus de la désignation des objets mobiliers
narrower: remplage
narrower: verrière
narrower: dormant
narrower: contrevent
narrower: volet intérieur
narrower: vantail
broader: élément de baie
created: 2012-05-16T00:00:00+02:00
definition: Ensemble des éléments fixes ou mobiles rapportés dans l'embrasure d'une baie pour réduire son ouverture, barrer l'accès ou empêcher le passage de l'air et de la lumière.
status: 1
broad match: http://vocab.getty.edu/aat/300003138
broad match: http://data.bnf.fr/ark:/12148/cb125704047
broad match: Baie (architecture)

four de campagne
type: Concept
modified: 2014-10-16T16:34:53+02:00
in scheme: Thésaurus de la désignation des objets mobiliers
broader: récipient pour la cuisson des aliments
alternative label: brûloir à orge
alternative label: four de ménage
alternative label: moule à cuire le jambon
alternative label: brûloir de ménage
alternative label: brûloir à café
created: 2012-05-16T00:00:00+02:00
definition: Récipient en céramique ou en métal pour cuire à l'étouffée. Il est hermétiquement fermé par un couvercle bombé et constitué de deux parties : l'une contient les aliments à cuire et l'autre, au-dessous, est remplie de braises ou, si elle est ajourée, posée directement sur le feu. Le four de ménage est un petit four en tôle de fer, sous lequel on place des braises.
status: 1
broad match: http://data.bnf.fr/ark:/12148/cb119785071
broad match: http://vocab.getty.edu/aat/300201279

brûloir à orge
type: SimpleNonPreferredTerm
modified: 2014-10-16T16:34:53+02:00
created: 2014-01-15T14:54:24+01:00
status: 1

brûloir de ménage
type: SimpleNonPreferredTerm
modified: 2014-10-16T16:34:53+02:00
created: 2014-01-15T14:54:24+01:00
status: 1

four de ménage
type: SimpleNonPreferredTerm
modified: 2014-10-16T16:34:53+02:00
created: 2014-01-15T14:54:24+01:00
status: 1

moule à cuire le jambon
type: SimpleNonPreferredTerm
modified: 2014-10-16T16:34:53+02:00
created: 2014-01-15T14:54:24+01:00
status: 1

four de campagne
type: PreferredTerm
modified: 2014-10-16T16:34:53+02:00
created: 2014-01-15T14:54:24+01:00
status: 1

brûloir à café
type: SimpleNonPreferredTerm
modified: 2014-10-16T16:34:53+02:00
created: 2014-01-15T14:54:24+01:00
status: 1

bateau de servitude
type: PreferredTerm
modified: 2014-10-16T09:59:46+02:00
created: 2014-01-15T14:54:24+01:00
status: 1

bateau pousseur
type: Concept
modified: 2014-10-16T10:02:04+02:00
in scheme: Thésaurus de la désignation des objets mobiliers
preferred label: towboats @en-us
broader: bateau de servitude
created: 2012-05-16T00:00:00+02:00
definition: Bateau à avant plat destiné à pousser les barges ou les navires.
status: 1

toueur
type: Concept
modified: 2014-12-19T12:25:48+01:00
in scheme: Thésaurus de la désignation des objets mobiliers
preferred label: warping tugs @en-us
broader: bateau de servitude
created: 2013-11-04T00:00:00+01:00
definition: Bateau amphidrome (se déplaçant dans les deux sens) possédant un mode de propulsion par appui au sol. Sur un parcours déterminé, ils se halent, à l'aide d'un treuil, à une chaîne reposant au fond de l'eau du fleuve ou de la rivière, traînant ainsi derrière eux un train de péniches.
status: 1
broad match: cb11982071h
broad match: http://vocab.getty.edu/aat/300232860

remorqueur
type: Concept
modified: 2014-12-19T12:24:54+01:00
in scheme: Thésaurus de la désignation des objets mobiliers
preferred label: tugboats @en-us
broader: bateau de servitude
created: 2012-05-16T00:00:00+02:00
definition: Navire utilisé pour tracter des bateaux ou aider à la manœuvre dans les ports.
status: 1

bateau de service
type: Concept
modified: 2014-12-19T12:28:34+01:00
in scheme: Thésaurus de la désignation des objets mobiliers
preferred label: utility and service vessels @en-us
narrower: bateau de servitude
narrower: bateau de génie civil
narrower: bateau de surveillance
narrower: T69-6272
broader: bateau
alternative label: chaloupe
alternative label: citerne automotrice
created: 2012-05-16T00:00:00+02:00
definition: Bateau apportant une assistance aux navires ou aux infrastructures portuaires ou fluviales.
status: 1
broad match: cb11953087h

voile de consécration des saintes huiles
type: Concept
modified: 2014-12-03T11:14:54+01:00
in scheme: Thésaurus de la désignation des objets mobiliers
preferred label: veils for the blessing of the holy oils @en-us
preferred label: velo per la consacrazione degli oli santi @it
preferred label: véu da consagração dos Santos Oleos @pt
broader: linge ou garniture liés aux temps de Carême
created: 2012-05-16T00:00:00+02:00
related: réserves aux saintes huiles
definition: Voile qui recouvre chacune des trois réserves aux saintes huiles, le Jeudi saint, lors de la consécration, par l’évêque, du saint Chrême (voile blanc), de la bénédiction de l'huile des catéchumènes (voile vert) et de l'huile des malades (voile violet).
TermeAssocie: réserves aux saintes huiles
status: 1
broad match: http://vocab.getty.edu/aat/300214771
broad match: http://data.bnf.fr/ark:/12148/cb119805497

voile de consécration des saintes huiles
type: PreferredTerm
modified: 2014-12-03T11:14:54+01:00
created: 2014-01-15T14:54:24+01:00
status: 1

réserves aux saintes huiles
type: Concept
modified: 2014-12-01T10:50:11+01:00
in scheme: Thésaurus de la désignation des objets mobiliers
preferred label: vasi per la riserva degli oli santi @it
preferred label: holy oil stocks @en-us
preferred label: reservas dos Santos Oleos @pt
narrower: réserve à huile des malades
narrower: réserve à huile des catéchumènes
narrower: réserve à saint chrême
broader: objet lié aux sacrements autres que l'Eucharistie
alternative label: vases aux saintes huiles
alternative label: urnes chrismales
created: 2012-05-16T00:00:00+02:00
scope note: Ces réserves peuvent être contenues dans un coffret pour les réserves aux saintes huiles.
related: voile huméral
related: voile de consécration des saintes huiles
related: coffret pour les réserves aux saintes huiles
definition: Ensemble de trois grands récipients assortis souvent en étain, dotés chacun d'un couvercle vissé, et utilisés pour contenir les saintes huiles consacrées le Jeudi saint dans une cathédrale. Les autres églises y puisent leurs propres réserves soit dans des récipients de formes analogues, mais plus petits, soit directement dans les ampoules à sainte huile. Le contenu des réserves est identifié par une inscription (s.c., o.i., o.c. ou o.s.). Les réserves sont parfois posées sur un plateau portant également une inscription désignant l'huile qu'elles contiennent.
TermeAssocie: voile huméral
TermeAssocie: voile de consécration des saintes huiles
TermeAssocie: coffret pour les réserves aux saintes huiles
status: 1
broad match: http://vocab.getty.edu/aat/300194500
broad match: http://data.bnf.fr/ark:/12148/cb119805497
broad match: Objets du culte catholique

linge ou garniture liés aux temps de Carême
type: Concept
modified: 2014-12-03T11:12:53+01:00
in scheme: Thésaurus de la désignation des objets mobiliers
preferred label: linen and ornaments for Lent @en-us
preferred label: lini e coperture per la Quaresima @it
preferred label: guarnições relacionadas com a Quaresma @pt
narrower: voile du Jeudi saint pour le calice
narrower: voile de consécration des saintes huiles
narrower: T69-2296
narrower: T69-2311
broader: linge ou garniture du culte catholique
alternative label: voile du cierge pascal
alternative label: voile du Vendredi saint
alternative label: pare-main
alternative label: voile de croix d'autel
alternative label: coussin du Vendredi saint
created: 2012-05-16T00:00:00+02:00
related: cierge pascal
related: croix du Vendredi saint
definition: Pièce textile spécifiquement utilisée durant le Carême.
TermeAssocie: cierge pascal
TermeAssocie: croix du Vendredi saint
status: 1

pyxide des malades-chrismatoire
type: Concept
modified: 2014-11-27T14:50:48+01:00
in scheme: Thésaurus de la désignation des objets mobiliers
preferred label: pisside da viatico-crismatorio @it
preferred label: pyxes-chrismatories of the sick @en-us
preferred label: píxide-crismatória @pt
broader: ciboire
created: 2012-05-16T00:00:00+02:00
related: pavillon de ciboire
related: coffret aux saintes huiles
related: bourse du viatique
related: ampoule à huile des malades
definition: Pyxide, maintenue ou vissée sur un coffret aux saintes huiles contenant une ampoule à huile des malades, et avec lequel elle forme un ensemble.
TermeAssocie: pavillon de ciboire
TermeAssocie: coffret aux saintes huiles
TermeAssocie: bourse du viatique
TermeAssocie: ampoule à huile des malades
status: 1

ciboire
type: Concept
modified: 2014-11-27T14:39:26+01:00
in scheme: Thésaurus de la désignation des objets mobiliers
preferred label: ciboria (liturgical vessels) @en-us
preferred label: pisside @it
preferred label: píxide @pt
narrower: pyxide des malades-chrismatoire
narrower: pyxide
narrower: ciboire-chrismatoire
narrower: ciboire des malades
broader: objet lié à l'Eucharistie
alternative label: pyxide pédiculée
created: 2012-05-16T00:00:00+02:00
related: voile huméral
related: pavillon de ciboire
related: boîte de ciboire
related: tabernacle
related: tabernacle suspendu
related: suspension eucharistique
related: T69-1185
definition: Vase sacré utilisé pour la conservation des hosties consacrées dans le tabernacle, et leur distribution lors de la communion. Le ciboire, habituellement en métal précieux, est constitué d'une coupe dont l'intérieur est toujours doré, munie d'un couvercle emboîtant surmonté d'une petite croix ou d'un symbole religieux tel que la sphère, le pélican, etc. et, généralement, d'un pied central avec une tige et un nœud. Il forme parfois un ensemble avec le calice et la patène.
TermeAssocie: voile huméral
TermeAssocie: pavillon de ciboire
TermeAssocie: boîte de ciboire
TermeAssocie: tabernacle
TermeAssocie: tabernacle suspendu
TermeAssocie: suspension eucharistique
TermeAssocie: T69-1185
status: 1
broad match: cb11936841q

pavillon de ciboire
type: Concept
modified: 2014-12-02T16:52:30+01:00
in scheme: Thésaurus de la désignation des objets mobiliers
preferred label: conopeo di pisside @it
preferred label: ciborium veils @en-us
preferred label: pavilhão de píxide @pt
broader: linge ou garniture liés à l'Eucharistie
created: 2012-05-16T00:00:00+02:00
related: pyxide des malades-chrismatoire
related: ciboire
related: ciboire des malades
definition: Etoffe destinée à recouvrir un ciboire, généralement en soie blanche, en drap d'argent ou en drap d'or, comportant un percement central permettant le passage de la croix ou du bouton du couvercle du ciboire.
TermeAssocie: pyxide des malades-chrismatoire
TermeAssocie: ciboire
TermeAssocie: ciboire des malades
status: 1
broad match: http://data.bnf.fr/ark:/12148/cb119669330

coffret aux saintes huiles
type: Concept
modified: 2014-12-01T10:38:25+01:00
in scheme: Thésaurus de la désignation des objets mobiliers
preferred label: custodia di vasetti per oli santi @it
preferred label: chrismatories @en-us
preferred label: caixa dos Santos Oleos @pt
broader: objet lié aux sacrements autres que l'Eucharistie
alternative label: boîte à ampoules
created: 2012-05-16T00:00:00+02:00
related: chapelle de messe
related: pyxide des malades-chrismatoire
definition: Petite boîte couverte ou coffret contenant de une à trois ampoules aux saintes huiles. Le coffret aux saintes huiles peut épouser la forme des ampoules et comporte souvent une plaque perforée pour les maintenir.
TermeAssocie: chapelle de messe
TermeAssocie: pyxide des malades-chrismatoire
status: 1

bourse du viatique
type: Concept
modified: 2014-12-02T16:17:55+01:00
in scheme: Thésaurus de la désignation des objets mobiliers
preferred label: pyx burses @en-us
preferred label: sacchetto per pisside da viatico @it
preferred label: bolsa de viático @pt
broader: linge ou garniture liés à l'Eucharistie
alternative label: bourse pour la communion des malades
alternative label: bourse de custode
alternative label: bourse du saint sacrement
alternative label: sac à custode
alternative label: bourse pour le viatique
alternative label: bourse d'administration
created: 2012-05-16T00:00:00+02:00
related: pyxide des malades-chrismatoire
related: ciboire des malades
related: T69-2256
definition: Pochette carrée ou rectangulaire en soie blanche, en drap d'or ou d'argent, semblable à une bourse de corporal avec en plus une petite poche latérale, destinée à porter un ciboire des malades, pour l'administration du viatique (Eucharistie donnée à un mourant). Un cordon permet de la porter autour du cou.
TermeAssocie: pyxide des malades-chrismatoire
TermeAssocie: ciboire des malades
TermeAssocie: T69-2256
status: 1
broad match: http://data.bnf.fr/ark:/12148/cb167275867

pyxide des malades-chrismatoire
type: PreferredTerm
modified: 2014-11-27T14:50:48+01:00
created: 2014-01-15T14:54:24+01:00
status: 1

ampoule à huile des malades
type: Concept
modified: 2014-12-01T10:26:32+01:00
in scheme: Thésaurus de la désignation des objets mobiliers
preferred label: vasetto per l'olio degli infermi @it
preferred label: ampullae for oil of the sick @en-us
preferred label: ampola do Oleo dos Enfermos @pt
broader: T69-1289
alternative label: boîte à huile des infirmes
alternative label: boîte à huile des malades
alternative label: ampoule à huile des infirmes
created: 2012-05-16T00:00:00+02:00
scope note: Il peut être en forme de croix munie d'un anneau de suspension et porté autour du cou.
related: pyxide des malades-chrismatoire
related: ciboire-chrismatoire
related: coffret pour le viatique
related: ciboire des malades
related: T69-2256
definition: Récipient contenant l'huile des malades utilisée lors de l'extrême-onction et de la bénédiction des cloches. Il porte l'inscription oleum infirmorum ou o.i.
TermeAssocie: pyxide des malades-chrismatoire
TermeAssocie: ciboire-chrismatoire
TermeAssocie: coffret pour le viatique
TermeAssocie: ciboire des malades
TermeAssocie: T69-2256
status: 1
broad match: http://vocab.getty.edu/aat/300198899

machine à épurer
type: Concept
modified: 2015-10-15T12:39:03+02:00
in scheme: Thésaurus de la désignation des objets mobiliers
narrower: machine à épurer par filtration
narrower: machine à épurer par gravité
narrower: machine à épurer mécaniquement
narrower: machine à épurer chimiquement
broader: machine à nettoyer
created: 2012-05-16T00:00:00+02:00
definition: Machine à nettoyer un matériau ou un produit (solide, liquide, gazeux) en en éliminant les corps étrangers par un procédé sélectif.
status: 1
broad match: cb11981075n
broad match: http://vocab.getty.edu/aat/300162798

brosseuse-épointeuse
type: SimpleNonPreferredTerm
modified: 2015-10-15T11:52:59+02:00
created: 2014-01-15T14:54:24+01:00
status: 1

brosse à grains
type: SimpleNonPreferredTerm
modified: 2015-10-15T11:52:59+02:00
created: 2014-01-15T14:54:24+01:00
status: 1

machine à laver
type: Concept
modified: 2015-10-15T14:34:59+02:00
in scheme: Thésaurus de la désignation des objets mobiliers
narrower: T69-5871
broader: machine à nettoyer
alternative label: essangeuse
alternative label: laveur mécanique
alternative label: machine à lessiver
alternative label: laveuse-essoreuse
alternative label: laveur
created: 2012-05-16T00:00:00+02:00
definition: Machine à nettoyer un matériau ou un produit, avec de l'eau ou à l'aide d'une solution acide ou alcaline.
status: 1
narrow match: Machine à laver le linge

machine à nettoyer
type: PreferredTerm
modified: 2015-10-15T11:52:59+02:00
created: 2014-01-15T14:54:24+01:00
status: 1

batteuse à sacs
type: SimpleNonPreferredTerm
modified: 2015-10-15T11:52:59+02:00
created: 2014-01-15T14:54:24+01:00
status: 1

brosse à blé
type: SimpleNonPreferredTerm
modified: 2015-10-15T11:52:59+02:00
created: 2014-01-15T14:54:24+01:00
status: 1

maquette
type: Concept
modified: 2014-01-10T00:00:00+01:00
in scheme: Thésaurus de la désignation des objets mobiliers
broader: divers
alternative label: modèle réduit
alternative label: chef d'œuvre de compagnon
created: 2013-12-04T00:00:00+01:00
related: ex-voto
TermeAssocie: ex-voto
status: 1

divers
type: Concept
modified: 2014-01-10T00:00:00+01:00
in scheme: Thésaurus de la désignation des objets mobiliers
narrower: maquette
narrower: matériel archéologique
narrower: robinet
narrower: matériel de tirage au sort
narrower: menottes
narrower: objet commémoratif
narrower: objet publicitaire
narrower: urne électorale
broader: dénomination provisoire
created: 2013-12-04T00:00:00+01:00
status: 1

modèle réduit
type: SimpleNonPreferredTerm
modified: 2014-01-10T00:00:00+01:00
created: 2014-01-15T14:54:24+01:00
status: 1

maquette
type: PreferredTerm
modified: 2014-01-10T00:00:00+01:00
created: 2014-01-15T14:54:24+01:00
status: 1

chef d'œuvre de compagnon
type: SimpleNonPreferredTerm
modified: 2014-01-10T00:00:00+01:00
created: 2014-01-15T14:54:24+01:00
status: 1

crèche de Noël
type: Concept
modified: 2014-12-01T11:15:35+01:00
in scheme: Thésaurus de la désignation des objets mobiliers
preferred label: crèches (Christmas) @en-us
preferred label: presepio @it
preferred label: presépio @pt
narrower: santon
broader: objet lié aux temps de Noël et de Carême
created: 2012-05-16T00:00:00+02:00
related: paradis
definition: Représentation en trois dimensions de la Nativité, dans un décor plus ou moins élaboré. La crèche comprend le plus souvent l'Adoration des bergers et l'Adoration des mages, des anges ainsi que d'autres scènes du cycle de la Nativité ; elle peut comprendre également des personnages de la vie quotidienne et des animaux. De dimensions variables, la crèche se trouve aussi bien dans les églises que dans les maisons et les lieux publics durant la période de Noël. Elle est parfois enfermée dans une boîte, souvent vitrée. Les personnages sont parfois appelés santons.
TermeAssocie: paradis
status: 1

santon
type: Concept
modified: 2014-12-01T11:18:14+01:00
in scheme: Thésaurus de la désignation des objets mobiliers
preferred label: statua da presepio @it
preferred label: santons @en-us
broader: crèche de Noël
alternative label: figura de presépio @pt
created: 2012-05-16T00:00:00+02:00
definition: Figurine d’origine provençale garnissant la crèche.
status: 1

paradis
type: Concept
modified: 2014-11-26T16:44:58+01:00
in scheme: Thésaurus de la désignation des objets mobiliers
preferred label: scarabattolo @it
preferred label: beatilhos @en-us
preferred label: maquineta @pt
broader: objet de dévotion
alternative label: beatilho
created: 2012-05-16T00:00:00+02:00
related: crèche de Noël
definition: Instrument de piété constitué d'une boîte vitrée contenant une scène religieuse, une crèche par exemple ou, plus rarement, une statuette.
TermeAssocie: crèche de Noël
status: 1

crèche de Noël
type: PreferredTerm
modified: 2014-12-01T11:15:35+01:00
created: 2014-01-15T14:54:24+01:00
status: 1

turbine hydraulique
type: Concept
modified: 2015-08-06T12:38:44+02:00
in scheme: Thésaurus de la désignation des objets mobiliers
broader: moteur hydraulique
created: 2012-05-16T00:00:00+02:00
definition: Moteur hydraulique, le plus souvent immergé, à grande vitesse de rotation, constitué d'une partie fixe, le distributeur, et d'une partie mobile, roue à pales, à augets ou hélice.
status: 1

moteur hydraulique
type: Concept
modified: 2015-08-06T15:56:56+02:00
in scheme: Thésaurus de la désignation des objets mobiliers
narrower: turbine hydraulique
narrower: roue hydraulique verticale
narrower: roue hydraulique horizontale
broader: moteur à énergie mécanique
created: 2012-05-16T00:00:00+02:00
definition: Moteur à énergie mécanique utilisant l'énergie cinétique d'un courant d'eau, avec ou sans chute.
status: 1

turbine hydraulique
type: PreferredTerm
modified: 2015-08-06T12:38:44+02:00
created: 2014-01-15T14:54:24+01:00
status: 1

voile de mariage
type: Concept
modified: 2014-12-03T11:02:26+01:00
in scheme: Thésaurus de la désignation des objets mobiliers
preferred label: velo nuziale @it
preferred label: marriage veils @en-us
preferred label: véu nupcial @pt
broader: linge ou garniture liés aux sacrements autres que l'Eucharistie
alternative label: poêle du mariage
created: 2012-05-16T00:00:00+02:00
definition: Voile que l'on tenait suspendu au-dessus des époux pendant qu'ils recevaient la bénédiction nuptiale.
status: 1
broad match: http://vocab.getty.edu/aat/300215072
broad match: cb11975001v

voile de mariage
type: PreferredTerm
modified: 2014-12-03T11:02:26+01:00
created: 2014-01-15T14:54:24+01:00
status: 1

poêle du mariage
type: SimpleNonPreferredTerm
modified: 2014-12-03T11:02:26+01:00
created: 2014-01-15T14:54:24+01:00
status: 1

humidificateur
type: Concept
modified: 2014-10-17T13:57:15+02:00
in scheme: Thésaurus de la désignation des objets mobiliers
preferred label: humidifiers @en-us
broader: objet pour l'entretien de la maison
created: 2012-05-16T00:00:00+02:00
definition: Récipient rempli d'eau et muni d'un couvercle ajouré, que l'on place au-dessus d'un poêle ou à proximité d’une source de chaleur pour humidifier l'air.
status: 1

humidificateur
type: PreferredTerm
modified: 2014-10-17T13:57:15+02:00
created: 2014-01-15T14:54:24+01:00
status: 1

étagère-bibliothèque
type: Concept
modified: 2014-12-04T16:43:11+01:00
in scheme: Thésaurus de la désignation des objets mobiliers
preferred label: bookshelves @en-us
broader: étagère
created: 2012-05-16T00:00:00+02:00
definition: Etagère servant à contenir des livres. Elle peut être murale, d'applique ou de milieu.
status: 1

étagère-bibliothèque
type: PreferredTerm
modified: 2014-12-04T16:43:11+01:00
created: 2014-01-15T14:54:24+01:00
status: 1

cymbales
type: Concept
modified: 2014-10-10T13:32:37+02:00
in scheme: Thésaurus de la désignation des objets mobiliers
preferred label: cymbals @en-us
broader: idiophone à émission par percussion directe
created: 2012-05-16T00:00:00+02:00
definition: Instrument formé de deux plaques circulaires en métal, l'extérieur comportant un mamelon, qui sont frappées l'une contre l'autre.
status: 1

cymbales
type: PreferredTerm
modified: 2014-10-10T13:32:37+02:00
created: 2014-01-15T14:54:24+01:00
status: 1

lampe d'église
type: Concept
modified: 2014-12-01T11:40:04+01:00
in scheme: Thésaurus de la désignation des objets mobiliers
preferred label: church lamps @en-us
preferred label: lampada de chiesa @it
preferred label: lâmpada de igreja @pt
broader: objet pour l'éclairage
created: 2012-05-16T00:00:00+02:00
definition: Lampe généralement suspendue dans une église
status: 1

lampe d'église
type: PreferredTerm
modified: 2014-12-01T11:40:04+01:00
created: 2014-01-15T14:54:24+01:00
status: 1

sous-vêtement
type: Concept
modified: 2014-12-11T15:59:48+01:00
in scheme: Thésaurus de la désignation des objets mobiliers
preferred label: underwear @en-us
broader: costume civil, professionnel ou militaire
alternative label: corset
alternative label: culotte de dessous
alternative label: chemise de corps
alternative label: jupon
alternative label: soutien-gorge
alternative label: caleçon
alternative label: dessous-de-robe
alternative label: combinaison
created: 2012-05-16T00:00:00+02:00
definition: Pièce du vêtement toujours portée sous d'autres pièces et non visible ou très partiellement.
status: 1

dessous-de-robe
type: SimpleNonPreferredTerm
modified: 2014-12-11T15:59:48+01:00
created: 2014-01-15T14:54:24+01:00
status: 1

chemise de corps
type: SimpleNonPreferredTerm
modified: 2014-12-11T15:59:48+01:00
created: 2014-01-15T14:54:24+01:00
status: 1

caleçon
type: SimpleNonPreferredTerm
modified: 2014-12-11T15:59:48+01:00
created: 2014-01-15T14:54:24+01:00
status: 1

soutien-gorge
type: SimpleNonPreferredTerm
modified: 2014-12-11T15:59:48+01:00
created: 2014-01-15T14:54:24+01:00
status: 1

culotte de dessous
type: SimpleNonPreferredTerm
modified: 2014-12-11T15:59:48+01:00
created: 2014-01-15T14:54:24+01:00
status: 1

corset
type: SimpleNonPreferredTerm
modified: 2014-12-11T15:59:48+01:00
created: 2014-01-15T14:54:24+01:00
status: 1

jupon
type: SimpleNonPreferredTerm
modified: 2014-12-11T15:59:48+01:00
created: 2014-01-15T14:54:24+01:00
status: 1

combinaison
type: SimpleNonPreferredTerm
modified: 2014-12-11T15:59:48+01:00
created: 2014-01-15T14:54:24+01:00
status: 1

sous-vêtement
type: PreferredTerm
modified: 2014-12-11T15:59:48+01:00
created: 2014-01-15T14:54:24+01:00
status: 1

costume civil, professionnel ou militaire
type: Concept
modified: 2014-10-17T16:41:29+02:00
in scheme: Thésaurus de la désignation des objets mobiliers
narrower: chapeau ou coiffure
narrower: sous-vêtement
narrower: vêtement spécifique de sportif
narrower: pièce chaussée
narrower: vêtement de nuit ou d'intérieur
narrower: vêtement d'intérieur ou d'extérieur
narrower: vêtement spécifique de militaire
narrower: vêtement spécifique lié à une fonction civile
narrower: accessoire de l'habillement
narrower: vêtement d'extérieur
narrower: T69-6512
narrower: T69-6510
narrower: T69-9226
broader: textile, garniture ou vêtement laïcs
created: 2012-05-16T00:00:00+02:00
related: panoplie, déguisement, tenue de carnaval
definition: Ensemble des pièces servant à couvrir ou protéger le corps humain à l'exclusion des vêtements religieux. Les principales pièces du costume sont des vêtements en tissu, d'autres (le chaussage, la ganterie, etc.) peuvent être en cuir et quelques accessoires en métal, écaille, bois, etc.
TermeAssocie: panoplie, déguisement, tenue de carnaval
status: 1

volet de polyptyque
type: Concept
modified: 2014-12-01T13:14:13+01:00
in scheme: Thésaurus de la désignation des objets mobiliers
preferred label: anta di politicco @it
preferred label: polyptych wings @en-us
preferred label: volante (de políptico) @pt
broader: polyptyque
created: 2012-05-16T00:00:00+02:00
definition: Partie mobile articulée sur la partie fixe d'un polyptyque. Le volet de polyptyque est composé d'un ou de plusieurs panneaux ou d'éléments peints ou sculptés et porte des représentations sur les deux faces.
status: 1
broad match: http://data.bnf.fr/ark:/12148/cb133240296
broad match: http://vocab.getty.edu/aat/300178235
broad match: Polyptyque

polyptyque
type: Concept
modified: 2014-12-01T12:55:21+01:00
in scheme: Thésaurus de la désignation des objets mobiliers
preferred label: politicco @it
preferred label: polyptychs @en-us
preferred label: políptico @pt
narrower: volet de polyptyque
narrower: polyptyque en boîte à volets
narrower: triptyque
narrower: diptyque
narrower: panneau de polyptyque
broader: autel et son environnement
alternative label: polyptyque portatif
created: 2012-05-16T00:00:00+02:00
related: tableau
related: relief
definition: Œuvre constituée de plusieurs éléments figurés peints ou sculptés, montés dans un cadre ou placés dans une caisse. Le polyptyque est généralement posé sur ou derrière un autel, c'est alors un retable ; il est composé d'au moins deux éléments appelés panneaux de polyptyque lorsqu'ils sont fixes, volets de polyptyque lorsqu'ils sont articulés. Lorsqu'il est de dimensions réduites, on l'appelle polyptyque portatif. Une prédelle ou une lunette peut être une partie ou un élément démembré d'un polyptyque.
TermeAssocie: tableau
TermeAssocie: relief
status: 1

volet de polyptyque
type: PreferredTerm
modified: 2014-12-01T13:14:13+01:00
created: 2014-01-15T14:54:24+01:00
status: 1

jeu, jouet et sport
type: Concept
modified: 2014-10-09T13:08:20+02:00
in scheme: Thésaurus de la désignation des objets mobiliers
preferred label: recreational artifacts (equipment) @en-us
narrower: jeu d'adresse ou sportif
narrower: jeu de cartes ou de société
narrower: jouet
narrower: panoplie, déguisement, tenue de carnaval
broader: dénomination provisoire
created: 2012-05-16T00:00:00+02:00
definition: Objet permettant de s'adonner, individuellement ou collectivement, à une activité de loisir, de divertissement ou sportive ; certains d'entre eux sont le plus souvent destinés aux enfants.
status: 1

yoyo
type: SimpleNonPreferredTerm
modified: 2014-12-30T13:05:28+01:00
created: 2014-01-15T14:54:24+01:00
status: 1

babyfoot
type: SimpleNonPreferredTerm
modified: 2014-12-30T13:05:28+01:00
created: 2014-01-15T14:54:24+01:00
status: 1

jeu de quilles
type: SimpleNonPreferredTerm
modified: 2014-12-30T13:05:28+01:00
created: 2014-01-15T14:54:24+01:00
status: 1

vêtement spécifique de sportif
type: Concept
modified: 2014-12-12T10:25:05+01:00
in scheme: Thésaurus de la désignation des objets mobiliers
preferred label: sports clothing @en-us
broader: costume civil, professionnel ou militaire
alternative label: caleçon de bain
alternative label: maillot de bain
alternative label: tenue de sport
created: 2013-11-14T00:00:00+01:00
related: jeu d'adresse ou sportif
definition: Vêtement ou ensemble de pièces, de coupe et de couleur organisés, utilisés pour pratiquer un sport, notamment dans le cadre de compétition.
TermeAssocie: jeu d'adresse ou sportif
status: 1

jeu de boules
type: SimpleNonPreferredTerm
modified: 2014-12-30T13:05:28+01:00
created: 2014-01-15T14:54:24+01:00
status: 1

jeu de fléchettes
type: SimpleNonPreferredTerm
modified: 2014-12-30T13:05:28+01:00
created: 2014-01-15T14:54:24+01:00
status: 1

mikado (jeu)
type: SimpleNonPreferredTerm
modified: 2014-12-30T13:05:28+01:00
created: 2014-01-15T14:54:24+01:00
status: 1

jeu d'adresse ou sportif
type: PreferredTerm
modified: 2014-12-30T13:05:28+01:00
created: 2014-01-15T14:54:24+01:00
status: 1

osselets
type: SimpleNonPreferredTerm
modified: 2014-12-30T13:05:28+01:00
created: 2014-01-15T14:54:24+01:00
status: 1

bilboquet
type: SimpleNonPreferredTerm
modified: 2014-12-30T13:05:28+01:00
created: 2014-01-15T14:54:24+01:00
status: 1

diabolo
type: SimpleNonPreferredTerm
modified: 2014-12-30T13:05:28+01:00
created: 2014-01-15T14:54:24+01:00
status: 1

toupie (jouet)
type: SimpleNonPreferredTerm
modified: 2014-12-30T13:05:28+01:00
created: 2014-01-15T14:54:24+01:00
status: 1

jeu de billes
type: SimpleNonPreferredTerm
modified: 2014-12-30T13:05:28+01:00
created: 2014-01-15T14:54:24+01:00
status: 1

cerf-volant
type: SimpleNonPreferredTerm
modified: 2014-12-30T13:05:28+01:00
created: 2014-01-15T14:54:24+01:00
status: 1

boomerang
type: SimpleNonPreferredTerm
modified: 2014-12-30T13:05:28+01:00
created: 2014-01-15T14:54:24+01:00
status: 1

chandelier de chœur à branches
type: SimpleNonPreferredTerm
modified: 2015-03-09T11:03:31+01:00
created: 2014-01-15T14:54:24+01:00
status: 1

chandelier de sanctuaire
type: SimpleNonPreferredTerm
modified: 2015-03-09T11:03:31+01:00
created: 2014-01-15T14:54:24+01:00
status: 1

candélabre de chœur
type: SimpleNonPreferredTerm
modified: 2015-03-09T11:03:31+01:00
created: 2014-01-15T14:54:24+01:00
status: 1

chandelier d'église
type: Concept
modified: 2014-12-01T11:35:39+01:00
in scheme: Thésaurus de la désignation des objets mobiliers
preferred label: candeliere da chiesa @it
preferred label: church candlesticks @en-us
preferred label: castiçal de igreja @pt
broader: objet pour l'éclairage
alternative label: candélabre d'église
alternative label: chandelier à branches d'église
created: 2012-05-16T00:00:00+02:00
related: chandelier d'autel
related: chandelier d'acolyte
related: chandelier pascal
related: luminaire d'applique d'église
related: chandelier des Ténèbres
related: chandelier de choeur
related: chandelier de consécration
definition: Tout type de chandelier utilisé dans une église ; il se distingue généralement de l’objet civil par ses inscriptions ou son décor.
TermeAssocie: chandelier d'autel
TermeAssocie: chandelier d'acolyte
TermeAssocie: chandelier pascal
TermeAssocie: luminaire d'applique d'église
TermeAssocie: chandelier des Ténèbres
TermeAssocie: chandelier de choeur
TermeAssocie: chandelier de consécration
status: 1

chandelier de chœur
type: SimpleNonPreferredTerm
modified: 2015-03-09T11:03:31+01:00
created: 2014-01-15T14:54:24+01:00
status: 1

machine à dépouiller
type: Concept
modified: 2015-08-12T14:53:51+02:00
in scheme: Thésaurus de la désignation des objets mobiliers
broader: machine à séparer des solides
created: 2012-05-16T00:00:00+02:00
definition: Machine à enlever la peau d'un animal ou l'enveloppe d'un végétal.
status: 1

machine à dépouiller
type: PreferredTerm
modified: 2015-08-12T14:53:51+02:00
created: 2014-01-15T14:54:24+01:00
status: 1

tuile
type: Concept
modified: 2015-01-30T12:21:47+01:00
in scheme: Thésaurus de la désignation des objets mobiliers
preferred label: roofing tile @en-us
broader: matériau de construction
created: 2012-05-16T00:00:00+02:00
definition: Elément, le plus souvent de terre cuite, servant comme matériau de couverture, habituellement posé à recouvrement.
status: 1

matériau de construction
type: Concept
modified: 2015-01-30T12:22:42+01:00
in scheme: Thésaurus de la désignation des objets mobiliers
preferred label: building materials @en-us
narrower: tuile
narrower: T69-137
narrower: T69-139
broader: élément d'architecture
alternative label: tuyau de canalisation
created: 2012-05-16T00:00:00+02:00
definition: Matière naturelle ou artificielle façonnée et mise en œuvre dans les secteurs du bâtiment et des travaux publics.
status: 1

tuile
type: PreferredTerm
modified: 2015-01-30T12:21:47+01:00
created: 2014-01-15T14:54:24+01:00
status: 1

étagère dressoir
type: Concept
modified: 2014-12-04T16:45:08+01:00
in scheme: Thésaurus de la désignation des objets mobiliers
preferred label: buffets (sideboards) @en-us
broader: étagère
created: 2012-05-16T00:00:00+02:00
definition: Etagère provisoire, à degrés montés sur une table, ou haute étagère au sol, servant à exposer de la vaisselle et des objets précieux ou à présenter les mets et préparer les couverts en usage.
status: 1
broad match: cb13562642r

étagère dressoir
type: PreferredTerm
modified: 2014-12-04T16:45:08+01:00
created: 2014-01-15T14:54:24+01:00
status: 1

carte
type: Concept
modified: 2014-12-03T15:02:01+01:00
in scheme: Thésaurus de la désignation des objets mobiliers
preferred label: maps (documents) @en-us
broader: arts graphiques
alternative label: carte politique
alternative label: carte topographique
alternative label: planisphère
alternative label: carte du ciel
alternative label: plan cadastral
alternative label: carte géologique
alternative label: portulan
alternative label: carte marine
alternative label: cadastre
created: 2012-05-16T00:00:00+02:00
related: objet de représentation de corps célestes
definition: Représentation, réelle ou imaginaire, à échelle réduite et en plan, de tout ou partie de la surface de la Terre, du Ciel ou d'un autre astre. La carte peut également représenter, dans un espace géographique donné, un phénomène naturel, culturel, historique, politique, fiscal, etc.
TermeAssocie: objet de représentation de corps célestes
status: 1

plan
type: Concept
modified: 2014-12-03T15:50:35+01:00
in scheme: Thésaurus de la désignation des objets mobiliers
preferred label: plans @en-us
broader: arts graphiques
alternative label: élévation (dessin)
alternative label: relevé graphique
alternative label: vue d'optique
alternative label: plan perspectif
alternative label: perspective cavalière
alternative label: perspective axonométrique
alternative label: coupe (dessin)
created: 2012-05-16T00:00:00+02:00
definition: Représentation en projection, dans un plan donné, le plus souvent horizontal, d'un objet, d'une construction, d'un terrain, d'un jardin, d'une ville, d'un réseau de circulation, etc. Par extension, "les plans" sont un ensemble de dessins schématiques ou techniques représentant diverses parties d'un tout et comprennent également les représentations destinées à donner une impression de relief.
status: 1

manuscrit
type: Concept
modified: 2014-12-03T15:36:49+01:00
in scheme: Thésaurus de la désignation des objets mobiliers
preferred label: manuscripts (document genre) @en-us
broader: arts graphiques
alternative label: autographe
alternative label: tapuscrit
created: 2012-05-16T00:00:00+02:00
related match: T529-271
definition: Œuvre, sur parchemin ou sur papier, formée d'images ou de textes écrits ou dessinés à la main. Le texte peut être une copie ou un original (par extension on nomme manuscrit un original dactylographié - tapuscrit).
status: 1

plaque décorative
type: Concept
modified: 2014-12-03T15:54:36+01:00
in scheme: Thésaurus de la désignation des objets mobiliers
broader: arts graphiques
alternative label: plaque émaillée
alternative label: plaque publicitaire
alternative label: plaque trompe-l'œil
created: 2013-07-22T00:00:00+02:00
related: enseigne professionnelle
related: T69-392
definition: Plaque en céramique (faïence, porcelaine) ou émaillée comportant un décor, une inscription, une figure publicitaire, etc.
TermeAssocie: enseigne professionnelle
TermeAssocie: T69-392
status: 1
narrow match: http://vocab.getty.edu/aat/300078438
narrow match: http://data.bnf.fr/ark:/12148/cb11992409d
narrow match: Plaque émaillée

arts graphiques
type: PreferredTerm
modified: 2014-10-17T15:38:13+02:00
created: 2014-01-15T14:54:24+01:00
status: 1

dessin
type: Concept
modified: 2014-12-03T15:06:00+01:00
in scheme: Thésaurus de la désignation des objets mobiliers
preferred label: drawings (visual works) @en-us
broader: arts graphiques
alternative label: carton de tapisserie
alternative label: carton de vitrail
alternative label: poncif
created: 2012-05-16T00:00:00+02:00
definition: Œuvre résultant de la pratique de l'art de dessiner. Il ne se définit ni par le support ni par la technique exclusivement, mais plutôt par l'intention de l'artiste. Le dessin peut être réalisé avec un matériau sec ou avec un liant, à la plume, au pinceau, au crayon, etc., sur papier, sur parchemin, sur toile, etc., et être de n'importe quelle couleur. Il peut être l'expression d'une première pensée, d'une préparation à une réalisation ou d'un travail d'étude.
status: 1

tag
type: Concept
modified: 2014-12-03T15:56:17+01:00
in scheme: Thésaurus de la désignation des objets mobiliers
broader: arts graphiques
created: 2013-07-22T00:00:00+02:00
related: peinture monumentale
definition: Inscription ou dessin peint dans un espace public et le plus souvent réalisé sans autorisation.
TermeAssocie: peinture monumentale
status: 1

peinture, arts graphiques et des média
type: Concept
modified: 2014-10-17T15:37:28+02:00
in scheme: Thésaurus de la désignation des objets mobiliers
narrower: arts graphiques
narrower: peinture
narrower: découpure
narrower: cadre
narrower: collage
narrower: oeuvre multimédia
created: 2012-05-16T00:00:00+02:00
definition: Création plastique et son support, en deux dimensions, constituée d’images fixes ou animées.
status: 1

document imprimé
type: Concept
modified: 2014-12-03T15:08:37+01:00
in scheme: Thésaurus de la désignation des objets mobiliers
broader: arts graphiques
alternative label: faire-part
alternative label: partition
alternative label: carte postale
alternative label: carte de visite
alternative label: timbre
alternative label: carte de vœux
created: 2012-05-16T00:00:00+02:00
definition: Elément produit ou reproduit, généralement en grande quantité, grâce au moyen des techniques de l'imprimerie sur un support de papier (ou une matière assimilable).
status: 1

graffiti
type: Concept
modified: 2014-12-03T15:17:12+01:00
in scheme: Thésaurus de la désignation des objets mobiliers
broader: arts graphiques
created: 2012-05-16T00:00:00+02:00
definition: Inscription ou croquis, incisé ou non, apposé sur un édifice, un meuble ou uneœuvre d'art et dont le but est de laisser une trace de son auteur.
status: 1

affiche
type: Concept
modified: 2014-12-03T14:58:10+01:00
in scheme: Thésaurus de la désignation des objets mobiliers
preferred label: posters @en-us
broader: arts graphiques
alternative label: affiche légale
alternative label: affiche judiciaire
alternative label: affiche pédagogique
alternative label: affiche publicitaire
created: 2012-05-16T00:00:00+02:00
definition: Feuille, généralement imprimée, destinée à être placardée, afin de porter à la connaissance du public des informations officielles, publicitaires, etc.
status: 1

estampe
type: Concept
modified: 2014-12-03T15:14:12+01:00
in scheme: Thésaurus de la désignation des objets mobiliers
preferred label: prints (visual works) @en-us
broader: arts graphiques
alternative label: eau-forte
alternative label: lithographie
alternative label: sérigraphie
alternative label: gravure
created: 2012-05-16T00:00:00+02:00
definition: Œuvre graphique sur papier, vélin ou tissu, obtenue par tout procédé d'impression (gravure en relief ou en creux, lithographie, sérigraphie, estampe numérique) pourvu que celui-ci ait été préparé manuellement, excluant ainsi les procédés de reproduction mécaniques ou photomécaniques. A l'exception du monotype, tiré en un seul exemplaire, l'estampe est reproductible (tirages numérotés, états).
status: 1

livre
type: Concept
modified: 2014-12-03T15:22:28+01:00
in scheme: Thésaurus de la désignation des objets mobiliers
preferred label: books @en-us
narrower: livre liturgique
narrower: reliure
narrower: livre sacré
broader: arts graphiques
alternative label: brochure
alternative label: catalogue
alternative label: almanach
alternative label: livre manuscrit
alternative label: album
alternative label: codex
created: 2012-05-16T00:00:00+02:00
definition: Assemblage de nombreux feuillets de papier ou de parchemin, portant des images ou des textes imprimés ou manuscrits. Pour être réunies, les pages sont reliées (cousues et protégées par une couverture rigide) ou brochées (cousues ou collées et protégées par une couverture souple).
status: 1

clôture de lit
type: PreferredTerm
modified: 2014-10-10T17:08:11+02:00
created: 2014-01-15T14:54:24+01:00
status: 1

effilocheuse
type: SimpleNonPreferredTerm
modified: 2015-10-09T11:52:16+02:00
created: 2014-01-15T14:54:24+01:00
status: 1

déchiqueteur
type: SimpleNonPreferredTerm
modified: 2015-10-09T11:52:16+02:00
created: 2014-01-15T14:54:24+01:00
status: 1

machine à déchiqueter
type: PreferredTerm
modified: 2015-10-09T11:52:16+02:00
created: 2014-01-15T14:54:24+01:00
status: 1

déchiqueteuse
type: SimpleNonPreferredTerm
modified: 2015-10-09T11:52:16+02:00
created: 2014-01-15T14:54:24+01:00
status: 1

broie
type: Concept
modified: 2014-12-10T14:54:53+01:00
in scheme: Thésaurus de la désignation des objets mobiliers
preferred label: breakers @en-us
broader: matériel de préparation du fil
alternative label: broie à lames
alternative label: broie à rouleaux
alternative label: broie à chanvre ou à lin
created: 2012-05-16T00:00:00+02:00
definition: Instrument qui sert, après le rouissage et le séchage (hâlage) de la tige de chanvre ou de lin, à séparer la filasse de la partie ligneuse (tille, tillots) et de l’étoupe (chenevotte), ainsi que les différentes fibres entre elles.
status: 1
broad match: http://data.bnf.fr/ark:/12148/cb11942815d
broad match: http://vocab.getty.edu/aat/300053751

matériel de préparation du fil
type: Concept
modified: 2014-09-23T14:58:58+02:00
in scheme: Thésaurus de la désignation des objets mobiliers
narrower: broie
narrower: T69-3452
narrower: T69-3458
narrower: T69-3411
narrower: T69-3456
broader: objet ou matériel pour les ouvrages textiles
alternative label: table à peigne
alternative label: débourreur à soie
alternative label: bâton à lame
alternative label: cuve à affiner le chanvre ou le lin
alternative label: pied à affiner le chanvre ou le lin
alternative label: fer à affiner
alternative label: auge à affiner le chanvre et le lin
alternative label: billot à piler
alternative label: billot à affiner le chanvre
alternative label: peigne à dégrossir le chanvre
created: 2013-03-22T00:00:00+01:00
definition: Petit matériel ou outil servant à préparer la matière brute (végétale ou animale) en vue de l’opération de filage.
status: 1
broad match: http://vocab.getty.edu/aat/300163224
broad match: cb16165565k

broie à chanvre ou à lin
type: SimpleNonPreferredTerm
modified: 2014-12-10T14:54:53+01:00
created: 2014-01-15T14:54:24+01:00
status: 1

broie à lames
type: SimpleNonPreferredTerm
modified: 2014-12-10T14:54:53+01:00
created: 2014-01-15T14:54:24+01:00
status: 1

broie
type: PreferredTerm
modified: 2014-12-10T14:54:53+01:00
created: 2014-01-15T14:54:24+01:00
status: 1

broie à rouleaux
type: SimpleNonPreferredTerm
modified: 2014-12-10T14:54:53+01:00
created: 2014-01-15T14:54:24+01:00
status: 1

tableau pour indiquer l'est
type: Concept
modified: 2014-01-10T00:00:00+01:00
in scheme: Thésaurus de la désignation des objets mobiliers
broader: objet lié à la prière
alternative label: tableau pour marquer l'est
alternative label: mizrah
created: 2012-05-16T00:00:00+02:00
definition: Tableau, souvent décoré (vue de Jérusalem, vue du Temple, etc.) placé dans les maisons et parfois les synagogues pour indiquer la direction de Jérusalem, direction à laquelle on doit faire face pendant la prière.
status: 1

tableau pour indiquer l'est
type: PreferredTerm
modified: 2014-01-10T00:00:00+01:00
created: 2014-01-15T14:54:24+01:00
status: 1

mizrah
type: SimpleNonPreferredTerm
modified: 2014-01-10T00:00:00+01:00
created: 2014-01-15T14:54:24+01:00
status: 1

tableau pour marquer l'est
type: SimpleNonPreferredTerm
modified: 2014-01-10T00:00:00+01:00
created: 2014-01-15T14:54:24+01:00
status: 1

porte-chape
type: Concept
modified: 2014-12-01T15:49:55+01:00
in scheme: Thésaurus de la désignation des objets mobiliers
preferred label: cope stands @en-us
preferred label: portapiviale @it
preferred label: cabide para capas @pt
broader: meuble de rangement pour objets, linges et vêtements du culte
created: 2012-05-16T00:00:00+02:00
definition: Grand cintre sur pied sur lequel l’officiant suspend temporairement ses vêtements avant et après une cérémonie.
status: 1

meuble de rangement pour objets, linges et vêtements du culte
type: Concept
modified: 2014-12-01T15:30:17+01:00
in scheme: Thésaurus de la désignation des objets mobiliers
preferred label: furniture for storage of liturgical objects, linen and vestments @en-us
preferred label: mobilia per la custodia del corredo ecclesiastico @it
preferred label: mobiliário para arrumção de documentos, alfaias e paramentos litúrgicos @pt
narrower: porte-chape
narrower: porte-encensoir
narrower: armoire à reliquaires
narrower: armoire à bannières
narrower: chapier
narrower: meuble de sacristie
narrower: chasublier
broader: meuble du culte catholique
created: 2012-05-16T00:00:00+02:00
definition: Mobilier, destiné au rangement des objets, linges et vêtements liturgiques, le plus souvent placé dans la sacristie.
status: 1

porte-chape
type: PreferredTerm
modified: 2014-12-01T15:49:55+01:00
created: 2014-01-15T14:54:24+01:00
status: 1

matériel archéologique
type: Concept
modified: 2014-05-27T17:08:00+02:00
in scheme: Thésaurus de la désignation des objets mobiliers
broader: divers
alternative label: pierre polie
alternative label: percuteur
alternative label: silex
alternative label: tesson
alternative label: pierre taillée
created: 2012-05-16T00:00:00+02:00
scope note: Utiliser une double dénomination dans le mesure du possible quand la fonction de l'objet est clairement identifiée. Par exemple : épingle de vêtement + matériel archéologique pour une fibule.
definition: Élément découvert dans le sol et mis au jour, le plus souvent, à l'occasion de fouilles archéologiques.
status: 1

robinet
type: Concept
modified: 2014-01-10T00:00:00+01:00
in scheme: Thésaurus de la désignation des objets mobiliers
broader: divers
created: 2013-12-09T00:00:00+01:00
status: 1

matériel de tirage au sort
type: Concept
modified: 2014-01-10T00:00:00+01:00
in scheme: Thésaurus de la désignation des objets mobiliers
broader: divers
created: 2013-12-09T00:00:00+01:00
status: 1

menottes
type: Concept
modified: 2014-01-10T00:00:00+01:00
in scheme: Thésaurus de la désignation des objets mobiliers
broader: divers
created: 2014-01-10T00:00:00+01:00
status: 1

divers
type: PreferredTerm
modified: 2014-01-10T00:00:00+01:00
created: 2014-01-15T14:54:24+01:00
status: 1

objet commémoratif
type: Concept
modified: 2014-01-10T00:00:00+01:00
in scheme: Thésaurus de la désignation des objets mobiliers
broader: divers
alternative label: objet de cérémonie
created: 2014-01-10T00:00:00+01:00
scope note: Utiliser une double dénomination dans le mesure du possible. Par exemple : coupe à boire + objet commémoratif pour une coupe commémorative ou outil + objet commémoratif pour une truelle de cérémonie.
related: plaque commémorative
related: service de consécration
TermeAssocie: plaque commémorative
TermeAssocie: service de consécration
status: 1

dénomination provisoire
type: Concept
modified: 2014-01-10T00:00:00+01:00
in scheme: Thésaurus de la désignation des objets mobiliers
narrower: matériel agricole, professionnel et artisanal
narrower: divers
narrower: jeu, jouet et sport
narrower: bijouterie et orfèvrerie civiles, monnaie, médaille
narrower: appareil d'enregistrement ou de restitution
created: 2012-05-16T00:00:00+02:00
status: 1

objet publicitaire
type: Concept
modified: 2014-01-10T00:00:00+01:00
in scheme: Thésaurus de la désignation des objets mobiliers
broader: divers
created: 2014-01-10T00:00:00+01:00
scope note: Utiliser une double dénomination dans le mesure du possible. Par exemple : cendrier + objet publicitaire.
status: 1

urne électorale
type: Concept
modified: 2014-01-10T00:00:00+01:00
in scheme: Thésaurus de la désignation des objets mobiliers
broader: divers
alternative label: urne de vote
alternative label: urne de délibération
created: 2013-12-09T00:00:00+01:00
status: 1

armoire à archives
type: Concept
modified: 2014-12-04T15:21:12+01:00
in scheme: Thésaurus de la désignation des objets mobiliers
preferred label: archives cupboards @en-us
broader: armoire
alternative label: armoire à archives de communauté
created: 2012-05-16T00:00:00+02:00
related: armoire de confrérie, de congrégation ou de fabrique
related: classeur à archives
definition: Armoire où l'on range des papiers (titres de propriétés, etc).
TermeAssocie: armoire de confrérie, de congrégation ou de fabrique
TermeAssocie: classeur à archives
status: 1
broad match: http://data.bnf.fr/ark:/12148/cb13163615d

armoire à archives
type: PreferredTerm
modified: 2014-12-04T15:21:12+01:00
created: 2014-01-15T14:54:24+01:00
status: 1

classeur à archives
type: Concept
modified: 2014-12-05T10:20:05+01:00
in scheme: Thésaurus de la désignation des objets mobiliers
preferred label: filing cabinets @en-us
narrower: cartonnier
broader: rangement lié aux activités de bureau et de loisirs
created: 2012-05-16T00:00:00+02:00
related: armoire de confrérie, de congrégation ou de fabrique
related: armoire à archives
definition: Meuble au sol, à nombreux tiroirs ou cases, servant à classer des papiers. Il peut être à deux corps. Les tiroirs ou cases sont parfois cachés derrière des battants.
TermeAssocie: armoire de confrérie, de congrégation ou de fabrique
TermeAssocie: armoire à archives
status: 1

armoire à archives de communauté
type: SimpleNonPreferredTerm
modified: 2014-12-04T15:21:12+01:00
created: 2014-01-15T14:54:24+01:00
status: 1

plaque commémorative
type: Concept
modified: 2015-02-24T15:31:28+01:00
in scheme: Thésaurus de la désignation des objets mobiliers
preferred label: tabella commemorativa @it
preferred label: commemorative plaques @en-us
broader: monument
alternative label: tableau commémoratif
alternative label: dalle commémorative
alternative label: panneau commémoratif
created: 2012-05-16T00:00:00+02:00
related: objet commémoratif
related: tableau commémoratif des morts
definition: Plaque, dalle ou tableau parfois décoré, fixé sur un mur et qui commémore un événement quelconque religieux ou profane.
TermeAssocie: objet commémoratif
TermeAssocie: tableau commémoratif des morts
status: 1

tableau commémoratif des morts
type: Concept
modified: 2015-02-24T13:23:45+01:00
in scheme: Thésaurus de la désignation des objets mobiliers
broader: monument aux morts
created: 2012-05-16T00:00:00+02:00
related: plaque commémorative
definition: Plaque, panneau ou tableau, parfois décoré, qui commémore le souvenir des morts ou des disparus lors de guerres ou de catastrophes.
TermeAssocie: plaque commémorative
status: 1
broad match: http://vocab.getty.edu/aat/300006957
broad match: Monument aux morts

plaque commémorative
type: PreferredTerm
modified: 2015-02-24T15:31:28+01:00
created: 2014-01-15T14:54:24+01:00
status: 1

monument
type: Concept
modified: 2015-02-24T12:36:55+01:00
in scheme: Thésaurus de la désignation des objets mobiliers
preferred label: monuments @en-us
narrower: plaque commémorative
narrower: stèle
narrower: monument funéraire
narrower: litre
narrower: monument aux morts
narrower: croix de consécration
broader: mobilier monumental ou de l'espace extérieur
alternative label: monument commémoratif
created: 2012-05-16T00:00:00+02:00
scope note: Voir aussi le Thesaurus de la désignation des œuvres architecturales et des espaces aménagés.
definition: Au sens propre, édicule commémoratif ou votif.
status: 1

dalle commémorative
type: SimpleNonPreferredTerm
modified: 2015-02-24T15:31:28+01:00
created: 2014-01-15T14:54:24+01:00
status: 1

tableau commémoratif
type: SimpleNonPreferredTerm
modified: 2015-02-24T15:31:28+01:00
created: 2014-01-15T14:54:24+01:00
status: 1

panneau commémoratif
type: SimpleNonPreferredTerm
modified: 2015-02-24T15:31:28+01:00
created: 2014-01-15T14:54:24+01:00
status: 1

croix pectorale
type: Concept
modified: 2014-11-26T14:05:21+01:00
in scheme: Thésaurus de la désignation des objets mobiliers
preferred label: croce pectorale @it
preferred label: pectoral crosses @en-us
preferred label: cruz peitoral @pt
broader: insigne ecclésiastique
created: 2012-05-16T00:00:00+02:00
related: anneau pastoral
related: croix
definition: Insigne de dignité en forme de croix, suspendue autour du cou, portée par le clergé et autrefois par les fidèles, réservée depuis la Contre-Réforme aux hauts dignitaires ecclésiastiques. Généralement en métal précieux, elle peut être assortie à l’anneau pastoral.
TermeAssocie: anneau pastoral
TermeAssocie: croix
status: 1

anneau pastoral
type: Concept
modified: 2014-11-26T12:38:55+01:00
in scheme: Thésaurus de la désignation des objets mobiliers
preferred label: pastoral rings @en-us
preferred label: anello pastorale @it
preferred label: anel pastoral @pt
broader: insigne ecclésiastique
alternative label: anneau de cardinal
alternative label: anneau cardinalice
alternative label: anneau du pêcheur
alternative label: bague d'évêque
alternative label: anneau papal
alternative label: anneau abbatial
alternative label: anneau pontifical
alternative label: anneau épiscopal
created: 2012-05-16T00:00:00+02:00
related: croix pectorale
related: plateau de présentation
related: anneau sigillaire
related: gants pontificaux
related: bague
definition: Bague, le plus souvent en métal précieux, portée par un haut dignitaire ecclésiastique, comme insigne de sa dignité. Souvent de grandes dimensions, il peut être porté sur des gants pontificaux. L'anneau papal est généralement orné d'un camée ou d'une intaille portant une représentation de l'héraldique papale. L'anneau de cardinal est souvent en or et muni d’un saphir. L’anneau épiscopal est en or et porte généralement une améthyste ou un rubis. Il ne doit comporter aucune figure gravée. L'anneau abbatial ne doit comporter qu'une seule pierre sans brillants.
TermeAssocie: croix pectorale
TermeAssocie: plateau de présentation
TermeAssocie: anneau sigillaire
TermeAssocie: gants pontificaux
TermeAssocie: bague
status: 1

croix
type: Concept
modified: 2014-11-26T15:46:50+01:00
in scheme: Thésaurus de la désignation des objets mobiliers
preferred label: croce @it
preferred label: crosses (visual works) @en-us
preferred label: cruz @pt
narrower: calvaire
narrower: croix encadrée
narrower: croix de sacristie
broader: objet de dévotion
alternative label: croix de jubé
alternative label: croix de confessionnal
alternative label: croix de tempérance
alternative label: croix de poutre de gloire
alternative label: croix de baptême
alternative label: croix de chaire à prêcher
alternative label: crucifix
created: 2012-05-16T00:00:00+02:00
related: croix d'autel
related: croix pectorale
related: croix du Vendredi saint
related: croix-reliquaire
related: poutre de gloire
related: boîte de croix
related: jubé
related: croix de procession
related: croix de la Passion
definition: Le plus souvent en forme de croix latine et portant généralement une représentation du Christ (crucifix), il s’agit du principal symbole de la réligion catholique. Les croix sont placées en maints endroits des églises. Certaines sont réservées à des cérémonies particulières. Elles sont également utilisées pour la dévotion publique ou privée ou encore comme insignes de dignité.
TermeAssocie: croix d'autel
TermeAssocie: croix pectorale
TermeAssocie: croix du Vendredi saint
TermeAssocie: croix-reliquaire
TermeAssocie: poutre de gloire
TermeAssocie: boîte de croix
TermeAssocie: jubé
TermeAssocie: croix de procession
TermeAssocie: croix de la Passion
status: 1

croix pectorale
type: PreferredTerm
modified: 2014-11-26T14:05:21+01:00
created: 2014-01-15T14:54:24+01:00
status: 1

moule à beurre
type: Concept
modified: 2014-12-08T12:47:56+01:00
in scheme: Thésaurus de la désignation des objets mobiliers
preferred label: butter molds @en-us
broader: récipient pour la préparation des aliments
alternative label: moule à motte
created: 2012-05-16T00:00:00+02:00
definition: Moule en bois servant à mettre en forme et décorer une épaisse plaque de beurre. Il comporte un décor intérieur généralement en creux et ses parois peuvent être mobiles ou à charnières.
status: 1

moule à beurre
type: PreferredTerm
modified: 2014-12-08T12:47:56+01:00
created: 2014-01-15T14:54:24+01:00
status: 1

moule à motte
type: SimpleNonPreferredTerm
modified: 2014-12-08T12:47:57+01:00
created: 2014-01-15T14:54:24+01:00
status: 1

barre de tirage
type: Concept
modified: 2015-01-29T12:31:22+01:00
in scheme: Thésaurus de la désignation des objets mobiliers
preferred label: pull bars @en-us
broader: loquet
created: 2012-05-16T00:00:00+02:00
definition: Poignée fixe et de grande taille placée sur un vantail ou un tiroir.
status: 1
broad match: http://data.bnf.fr/ark:/12148/cb12122640d
broad match: Loquet

loquet
type: Concept
modified: 2015-01-29T12:50:35+01:00
in scheme: Thésaurus de la désignation des objets mobiliers
preferred label: latches @en-us
narrower: barre de tirage
broader: organe de sécurité
created: 2012-05-16T00:00:00+02:00
definition: Organe de fermeture, placé sur une partie mobile, constitué par une branche mobile et pivotante, la clenche (pêne, battant), dont la course est limitée par la garde de maintien et qui bute sur un crochet, le mentonnet, placé sur le bâti.
status: 1
broad match: http://data.bnf.fr/ark:/12148/cb12122640d

barre de tirage
type: PreferredTerm
modified: 2015-01-29T12:31:22+01:00
created: 2014-01-15T14:54:24+01:00
status: 1

martinet hydraulique
type: SimpleNonPreferredTerm
modified: 2015-08-13T15:21:56+02:00
created: 2014-01-15T14:54:24+01:00
status: 1

machine à marteler
type: PreferredTerm
modified: 2015-08-13T15:21:56+02:00
created: 2014-01-15T14:54:24+01:00
status: 1

bâton à boucles
type: PreferredTerm
modified: 2014-10-17T14:25:14+02:00
created: 2014-01-15T14:54:24+01:00
status: 1

bigoudis
type: SimpleNonPreferredTerm
modified: 2014-10-17T14:25:14+02:00
created: 2014-01-15T14:54:24+01:00
status: 1

coiffe
type: Concept
modified: 2014-12-10T18:13:31+01:00
in scheme: Thésaurus de la désignation des objets mobiliers
preferred label: headdresses @en-us
broader: chapeau ou coiffure
created: 2012-05-16T00:00:00+02:00
definition: Coiffure de femme, en toile ou en tissu léger (soie, dentelle), comprenant le bonnet et ses divers accessoires.
status: 1

coiffe
type: PreferredTerm
modified: 2014-12-10T18:13:31+01:00
created: 2014-01-15T14:54:24+01:00
status: 1

protomé
type: Concept
modified: 2014-10-17T16:15:34+02:00
in scheme: Thésaurus de la désignation des objets mobiliers
preferred label: protomai @en-us
broader: sculpture
created: 2012-05-16T00:00:00+02:00
definition: Représentation en buste d'un animal ou partie antérieure (tête, poitrail ou patte de devant) employée comme motif décoratif ou servant de support.
status: 1

protomé
type: PreferredTerm
modified: 2014-10-17T16:15:34+02:00
created: 2014-01-15T14:54:24+01:00
status: 1

matériel de traction ferroviaire
type: PreferredTerm
modified: 2014-10-14T16:07:19+02:00
created: 2014-01-15T14:54:24+01:00
status: 1

locomotive
type: Concept
modified: 2014-12-18T10:14:54+01:00
in scheme: Thésaurus de la désignation des objets mobiliers
preferred label: locomotives @en-us
narrower: locomotive articulée
narrower: locomotive électrique
narrower: locomotive thermique
narrower: locomotive à vapeur
broader: matériel de traction ferroviaire
created: 2013-11-04T00:00:00+01:00
definition: Véhicule ferroviaire à moteur destiné à tracter le matériel roulant ou à le pousser dans certaines circonstances (triage, train de banlieue).
status: 1

automoteur ferroviaire
type: Concept
modified: 2014-10-14T16:09:43+02:00
in scheme: Thésaurus de la désignation des objets mobiliers
narrower: tramway
narrower: autorail
narrower: automotrice à vapeur
narrower: draisine
narrower: automotrice électrique
narrower: automotrice de chemin de fer métropolitain
broader: matériel de traction ferroviaire
created: 2013-11-04T00:00:00+01:00
definition: Véhicule ferroviaire motorisé autonome destiné au transport des personnes.
status: 1
broad match: cb11938431s
broad match: http://vocab.getty.edu/aat/300042934

coeur-reliquaire
type: Concept
modified: 2015-03-20T12:16:27+01:00
in scheme: Thésaurus de la désignation des objets mobiliers
preferred label: heart-reliquaries @en-us
preferred label: reliquiario a cuore @it
broader: reliquaire morphologique
alternative label: cœur-reliquaire
alternative label: cœur reliquaire
created: 2012-07-12T00:00:00+02:00
status: 1
broad match: http://vocab.getty.edu/aat/300263061

cœur reliquaire
type: SimpleNonPreferredTerm
modified: 2015-03-20T12:16:28+01:00
created: 2014-01-15T14:54:24+01:00
status: 1

cœur-reliquaire
type: SimpleNonPreferredTerm
modified: 2015-03-20T12:16:28+01:00
created: 2014-01-15T14:54:24+01:00
status: 1

ponton-bigue
type: Concept
modified: 2014-12-19T16:36:22+01:00
in scheme: Thésaurus de la désignation des objets mobiliers
preferred label: sheer hulks @en-us
broader: équipement portuaire flottant
created: 2012-05-16T00:00:00+02:00
definition: Installation flottante portant un engin de levage.
status: 1
broad match: http://data.bnf.fr/ark:/12148/cb119829710

équipement portuaire flottant
type: Concept
modified: 2014-10-16T10:51:06+02:00
in scheme: Thésaurus de la désignation des objets mobiliers
narrower: ponton-bigue
narrower: T69-6335
narrower: T69-6337
broader: matériel flottant stationnaire
created: 2012-05-16T00:00:00+02:00
definition: Matériel flottant réservé à l'activité portuaire.
status: 1
broad match: http://vocab.getty.edu/aat/300007967
broad match: cb15888847p
broad match: Port

ponton-bigue
type: PreferredTerm
modified: 2014-12-19T16:36:22+01:00
created: 2014-01-15T14:54:24+01:00
status: 1

instrument de démonstration en mécanique des solides
type: PreferredTerm
modified: 2014-10-23T16:05:31+02:00
created: 2014-01-15T14:54:24+01:00
status: 1

instrument de démonstration en mécanique
type: Concept
modified: 2014-12-15T14:13:45+01:00
in scheme: Thésaurus de la désignation des objets mobiliers
narrower: instrument de démonstration en mécanique des solides
narrower: instrument de démonstration en mécanique des fluides
broader: instrument de démonstration de phénomènes physiques
created: 2012-05-16T00:00:00+02:00
definition: Instrument de mise en évidence et d'étude de l'équilibre (statique) et des mouvements (dynamique) des corps solides ou fluides, ainsi que de la théorie des machines.
status: 1

armoire à linge
type: Concept
modified: 2014-12-04T15:24:47+01:00
in scheme: Thésaurus de la désignation des objets mobiliers
preferred label: presses (cupboards) @en-us
narrower: T69-2866
narrower: T69-2864
broader: armoire
created: 2012-05-16T00:00:00+02:00
definition: Armoire servant au rangement du linge ou des vêtements. Elle se présente en général comme une armoire haute à deux battants juxtaposés, avec ou sans tiroir(s) inférieurs(s) et des tablettes intérieures ou une barre horizontale servant à suspendre des vêtements. Elle peut comporter également des tiroirs intérieurs pour y ranger les petits objets plus précieux.
status: 1

armoire à liqueurs
type: SimpleNonPreferredTerm
modified: 2014-12-04T15:48:35+01:00
created: 2014-01-15T14:54:24+01:00
status: 1

armoire à pain
type: Concept
modified: 2014-10-13T10:26:19+02:00
in scheme: Thésaurus de la désignation des objets mobiliers
broader: armoire
created: 2012-05-16T00:00:00+02:00
definition: Armoire de petite taille, au sol ou suspendue, servant à conserver le pain.
status: 1

dressoir
type: SimpleNonPreferredTerm
modified: 2014-12-04T15:48:35+01:00
created: 2014-01-15T14:54:24+01:00
status: 1

armoire bout-de-bureau
type: SimpleNonPreferredTerm
modified: 2014-12-04T15:48:35+01:00
created: 2014-01-15T14:54:24+01:00
status: 1

armoire garde-manger
type: Concept
modified: 2014-12-04T15:34:45+01:00
in scheme: Thésaurus de la désignation des objets mobiliers
preferred label: kitchen safes @en-us
broader: armoire
created: 2012-05-16T00:00:00+02:00
definition: Armoire au sol ou suspendue, servant à conserver les aliments. Les battants ou le corps sont totalement ou en partie à claire-voie ou garnis par une toile, de façon à créer une aération
status: 1
broad match: http://data.bnf.fr/ark:/12148/cb13163615d

armoire porte-instruments de cuisine
type: SimpleNonPreferredTerm
modified: 2014-12-04T15:48:35+01:00
created: 2014-01-15T14:54:24+01:00
status: 1

armoire
type: PreferredTerm
modified: 2014-12-04T15:48:35+01:00
created: 2014-01-15T14:54:24+01:00
status: 1

armoire-dressoir
type: SimpleNonPreferredTerm
modified: 2014-12-04T15:48:35+01:00
created: 2014-01-15T14:54:24+01:00
status: 1

armoire à flèches
type: SimpleNonPreferredTerm
modified: 2014-12-04T15:48:35+01:00
created: 2014-01-15T14:54:24+01:00
status: 1

armoire à jeux
type: SimpleNonPreferredTerm
modified: 2014-12-04T15:48:35+01:00
created: 2014-01-15T14:54:24+01:00
status: 1

armoire à musique
type: Concept
modified: 2014-10-13T10:25:01+02:00
in scheme: Thésaurus de la désignation des objets mobiliers
preferred label: music cabinets @en-us
broader: armoire
created: 2012-05-16T00:00:00+02:00
definition: Armoire servant à ranger les instruments de musique ou les partitions.
status: 1
broad match: Armoire

armoire coffre-fort
type: Concept
modified: 2014-12-04T15:33:22+01:00
in scheme: Thésaurus de la désignation des objets mobiliers
preferred label: safes (storage containers) @en-us
broader: armoire
created: 2012-05-16T00:00:00+02:00
related: armoire de confrérie, de congrégation ou de fabrique
definition: Armoire constituée de bois et de métal comportant une serrure complexe et pouvant être scellée. Certaines pièces ont reçu un décor peint voilant leur aspect fonctionnel.
TermeAssocie: armoire de confrérie, de congrégation ou de fabrique
status: 1

armoire-bibliothèque
type: Concept
modified: 2014-12-04T15:32:09+01:00
in scheme: Thésaurus de la désignation des objets mobiliers
preferred label: bibliothèques (bookcases) @en-us
broader: armoire
created: 2012-05-16T00:00:00+02:00
definition: Armoire servant à ranger les livres. Elle comporte des battants vitrés ou grillagés et fréquemment des crémaillères angulaires intérieures permettant de changer les tablettes de niveau. Les grillages sont souvent, dès l'origine, doublés de rideaux.
status: 1

armoire à fusils
type: SimpleNonPreferredTerm
modified: 2014-12-04T15:48:35+01:00
created: 2014-01-15T14:54:24+01:00
status: 1

armoire à cartouches
type: SimpleNonPreferredTerm
modified: 2014-12-04T15:48:35+01:00
created: 2014-01-15T14:54:24+01:00
status: 1

armoire à lait
type: Concept
modified: 2014-10-13T10:20:46+02:00
in scheme: Thésaurus de la désignation des objets mobiliers
broader: armoire
alternative label: armoire à lait garde-manger
created: 2012-05-16T00:00:00+02:00
definition: Armoire très généralement ajourée servant à la conservation du lait et de ses produits. Sa partie inférieure peut recevoir un réchaud à braises pour faire monter la crème ou cailler le lait. Elle peut comporter également une partie garde-manger.
status: 1
broad match: http://vocab.getty.edu/aat/300249925

armoire à cigares
type: SimpleNonPreferredTerm
modified: 2014-12-04T15:48:35+01:00
created: 2014-01-15T14:54:24+01:00
status: 1

pièce chaussée
type: Concept
modified: 2014-10-20T10:30:38+02:00
in scheme: Thésaurus de la désignation des objets mobiliers
preferred label: accessories by location ont the legs or feet @en-us
narrower: chaussure
narrower: bas
broader: costume civil, professionnel ou militaire
created: 2012-05-16T00:00:00+02:00
related: bas et chaussures liturgiques
definition: Partie de l'habillement qui entoure et protège les pieds et les membres inférieurs.
TermeAssocie: bas et chaussures liturgiques
status: 1
narrow match: cb11955690j

bas liturgiques
type: Concept
modified: 2014-12-03T12:46:40+01:00
in scheme: Thésaurus de la désignation des objets mobiliers
preferred label: buskins (stockings) @en-us
preferred label: calze pontificali @it
preferred label: cáligas @pt
broader: bas et chaussures liturgiques
alternative label: bas d'évêque
created: 2012-05-16T00:00:00+02:00
definition: Bas portés lors des messes pontificales par-dessus des bas ordinaires, par les prélats. Les bas liturgiques comportent des liens parfois terminés par des pompons pour les attacher au-dessus du genou. Ils suivent la couleur du temps liturgique, sauf le noir.
status: 1

vêtement du culte catholique
type: Concept
modified: 2014-10-22T11:06:47+02:00
in scheme: Thésaurus de la désignation des objets mobiliers
preferred label: religious vestments @en-us
preferred label: paramenti ecclesiastici @it
narrower: bas et chaussures liturgiques
narrower: autre vêtement catholique
narrower: coiffure liturgique
narrower: vêtement liturgique de dessus
narrower: vêtement liturgique de dessous
narrower: accessoire du costume liturgique des clercs
broader: textile du culte catholique
created: 2012-05-16T00:00:00+02:00
definition: Pièce textile constituant un élément de l’habillement du clerc. Sa forme, son décor, sa couleur, la nature même de l’étoffe ou du tissu, varient selon le rang, la fonction et le temps liturgique. Cette pièce peut porter des marques d’appartenance.
status: 1

bas et chaussures liturgiques
type: PreferredTerm
modified: 2014-12-03T12:45:49+01:00
created: 2014-01-15T14:54:24+01:00
status: 1

crochet à gants
type: SimpleNonPreferredTerm
modified: 2014-10-17T14:43:15+02:00
created: 2014-01-15T14:54:24+01:00
status: 1

tire-bouton
type: SimpleNonPreferredTerm
modified: 2014-10-17T14:43:15+02:00
created: 2014-01-15T14:54:24+01:00
status: 1

crochet à bottines
type: PreferredTerm
modified: 2014-10-17T14:43:15+02:00
created: 2014-01-15T14:54:24+01:00
status: 1

bateau de chasse au harpon
type: Concept
modified: 2014-10-16T09:37:24+02:00
in scheme: Thésaurus de la désignation des objets mobiliers
preferred label: whaleboats @en-us
broader: bateau de pêche
alternative label: baleinier
created: 2012-05-16T00:00:00+02:00
definition: Bateau de pêche conçu pour la capture d'animaux marins qui s'effectue avec une arme de jet.
status: 1
narrow match: http://vocab.getty.edu/aat/300232761
narrow match: Baleinier

bateau de chasse au harpon
type: PreferredTerm
modified: 2014-10-16T09:37:24+02:00
created: 2014-01-15T14:54:24+01:00
status: 1

bateau de pêche
type: Concept
modified: 2014-12-19T12:11:15+01:00
in scheme: Thésaurus de la désignation des objets mobiliers
preferred label: fishing vessels @en-us
narrower: bateau de chasse au harpon
narrower: bateau de pêche à la drague
narrower: bateau de pêche au filet ou à la traîne
narrower: bateau usine
narrower: bateau de pêche aux casiers
broader: bateau
alternative label: goémonier
created: 2012-05-16T00:00:00+02:00
definition: Bateau utilisé pour la capture de ressources biologiques, principalement des poissons.
status: 1

baleinier
type: SimpleNonPreferredTerm
modified: 2014-10-16T09:37:24+02:00
created: 2014-01-15T14:54:24+01:00
status: 1

pot à eau de toilette
type: SimpleNonPreferredTerm
modified: 2014-12-10T16:45:08+01:00
created: 2014-01-15T14:54:24+01:00
status: 1

broc à eau de toilette
type: PreferredTerm
modified: 2014-12-10T16:45:08+01:00
created: 2014-01-15T14:54:24+01:00
status: 1

moteur à pistons à explosion
type: PreferredTerm
modified: 2015-08-10T12:09:11+02:00
created: 2014-01-15T14:54:24+01:00
status: 1

moteur à essence
type: SimpleNonPreferredTerm
modified: 2015-08-10T12:09:11+02:00
created: 2014-01-15T14:54:24+01:00
status: 1

galoubet
type: Concept
modified: 2014-10-10T11:55:29+02:00
in scheme: Thésaurus de la désignation des objets mobiliers
broader: flûte à biseau
alternative label: flûte à trois trous
created: 2012-05-16T00:00:00+02:00
definition: Flûte à bec à trois trous, en général en bois. Le galoubet possède deux trous sur la face antérieure et un au revers pour le pouce. On en joue d'une seule main.
status: 1

flûte à trois trous
type: SimpleNonPreferredTerm
modified: 2014-10-10T11:55:29+02:00
created: 2014-01-15T14:54:24+01:00
status: 1

galoubet
type: PreferredTerm
modified: 2014-10-10T11:55:29+02:00
created: 2014-01-15T14:54:24+01:00
status: 1

meneau
type: Concept
modified: 2014-12-09T16:26:32+01:00
in scheme: Thésaurus de la désignation des objets mobiliers
preferred label: mullions @en-us
broader: remplage
created: 2012-05-16T00:00:00+02:00
definition: Elément vertical d'un remplage de fenêtre. Le meneau formé par un petit mur étroit divise la fenêtre en plusieurs baies.
status: 1
broad match: http://data.bnf.fr/ark:/12148/cb167675324

meneau
type: PreferredTerm
modified: 2014-12-09T16:26:32+01:00
created: 2014-01-15T14:54:24+01:00
status: 1

baïonnette
type: Concept
modified: 2014-12-12T14:54:12+01:00
in scheme: Thésaurus de la désignation des objets mobiliers
preferred label: bayonets @en-us
broader: arme blanche
created: 2012-05-16T00:00:00+02:00
definition: Arme blanche, à lame courte et pointue, faite pour s'ajouter au canon d'un fusil et utilisée dans le combat au corps à corps.
status: 1

arme blanche
type: Concept
modified: 2015-03-27T16:54:54+01:00
in scheme: Thésaurus de la désignation des objets mobiliers
preferred label: edged weapons @en-us
narrower: baïonnette
narrower: glaive
narrower: épée
narrower: poignard
narrower: hache (arme)
narrower: sabre
broader: arme offensive
created: 2012-05-16T00:00:00+02:00
definition: Arme dont l'action perforante (l'estoc) ou tranchante (la taille) n'est due qu'à la force humaine (ou à un mécanisme excluant l'explosion). Leur grande majorité combine les deux types d'utilisation.
status: 1

baïonnette
type: PreferredTerm
modified: 2014-12-12T14:54:12+01:00
created: 2014-01-15T14:54:24+01:00
status: 1

clôture pour pupitre de Torah
type: SimpleNonPreferredTerm
modified: 2014-01-10T00:00:00+01:00
created: 2014-01-15T14:54:24+01:00
status: 1

clôture pour estrade de Torah
type: PreferredTerm
modified: 2014-01-10T00:00:00+01:00
created: 2014-01-15T14:54:24+01:00
status: 1

clochette
type: Concept
modified: 2014-12-15T12:25:17+01:00
in scheme: Thésaurus de la désignation des objets mobiliers
preferred label: handbells @en-us
narrower: sonnette d'autel
narrower: clochette d'autel
broader: idiophone à émission par percussion directe
alternative label: clochette de procession
alternative label: tintenelle
created: 2012-05-16T00:00:00+02:00
related: objet lié à la procession
related: clochette de basilique
definition: Petite cloche portative en métal, verre ou terre cuite.
TermeAssocie: objet lié à la procession
TermeAssocie: clochette de basilique
status: 1

tintenelle
type: SimpleNonPreferredTerm
modified: 2014-12-15T12:25:17+01:00
created: 2014-01-15T14:54:24+01:00
status: 1

clochette
type: PreferredTerm
modified: 2014-12-15T12:25:17+01:00
created: 2014-01-15T14:54:24+01:00
status: 1

clochette de procession
type: SimpleNonPreferredTerm
modified: 2014-12-15T12:25:17+01:00
created: 2014-01-15T14:54:24+01:00
status: 1

clochette de basilique
type: Concept
modified: 2014-12-02T10:11:28+01:00
in scheme: Thésaurus de la désignation des objets mobiliers
preferred label: tintinnabulos @en-us
preferred label: tintinnabolo @it
preferred label: tintinábulo @pt
broader: meuble lié à la procession et à la dévotion
alternative label: tintinnabule
created: 2012-05-16T00:00:00+02:00
related: clochette
definition: Clochette montée sur un cadre porté par une hampe, utilisée comme insigne de basilique. La clochette de basilique peut être portée en procession comme une clochette de procession. Elle précède généralement alors un ombellino de basilique et une croix de procession.
TermeAssocie: clochette
status: 1

porte-courtine d'autel
type: Concept
modified: 2014-12-01T13:18:20+01:00
in scheme: Thésaurus de la désignation des objets mobiliers
preferred label: riddel posts @en-us
preferred label: portacortine d'altare @it
preferred label: varão de cortina de altar @pt
broader: autel et son environnement
created: 2012-05-16T00:00:00+02:00
related: courtine d'autel
definition: Barres horizontales portées en général par des supports verticaux, auxquelles sont suspendus des rideaux ou courtine d'autel. Le porte-courtine d'autel délimite un espace autour de l'autel. Les supports sont souvent couronnés d'anges portant des instruments de la Passion ou un chandelier.
TermeAssocie: courtine d'autel
status: 1
broad match: cb11943953g
broad match: Autel (christianisme)

porte-courtine d'autel
type: PreferredTerm
modified: 2014-12-01T13:18:20+01:00
created: 2014-01-15T14:54:24+01:00
status: 1

courtine d'autel
type: Concept
modified: 2014-12-02T15:56:03+01:00
in scheme: Thésaurus de la désignation des objets mobiliers
preferred label: riddels @en-us
preferred label: cortina d'altare @it
preferred label: cortina de altar @pt
broader: linge ou garniture liés à l'autel
alternative label: rideau d'autel
alternative label: aile d'autel
created: 2012-05-16T00:00:00+02:00
related: porte-courtine d'autel
related: T69-588
definition: Rideaux délimitant un espace autour d'un autel. Les courtines d'autel sont suspendues à un ciborium ou à un porte-courtines d'autel, sur les côtés et parfois derrière l'autel.
TermeAssocie: porte-courtine d'autel
TermeAssocie: T69-588
status: 1

autel et son environnement
type: Concept
modified: 2014-12-01T11:42:46+01:00
in scheme: Thésaurus de la désignation des objets mobiliers
preferred label: altars and their environment @en-us
preferred label: altari e loro adiacenze @it
preferred label: altares e seus acessórios @pt
narrower: crédence
narrower: polyptyque
narrower: porte-courtine d'autel
narrower: degré d'autel
narrower: prédelle
narrower: tableautin d'autel
narrower: tableau d'autel
narrower: retable
narrower: statue ouvrante
narrower: dais d'autel
narrower: T69-579
narrower: T69-588
narrower: T69-585
narrower: T69-608
narrower: T69-614
narrower: T69-612
broader: meuble du culte catholique
created: 2012-05-16T00:00:00+02:00
definition: Autel, ou meuble situé à proximité, lié à la célébration du sacrifice de la messe.
status: 1
narrow match: cb11943953g

roue hydraulique verticale
type: Concept
modified: 2015-10-07T17:40:34+02:00
in scheme: Thésaurus de la désignation des objets mobiliers
broader: moteur hydraulique
alternative label: roue à augets
alternative label: roue de poitrine
alternative label: roue de type Sagebien
alternative label: roue de type Millot
alternative label: roue vanne
alternative label: roue à pots
alternative label: roue siphon
alternative label: roue à choc
alternative label: roue à palette
alternative label: roue de type Poncelet
alternative label: roue à godets
created: 2012-05-16T00:00:00+02:00
definition: Moteur hydraulique constitué d'une roue à aubes ou à augets placée verticalement, dont l'axe de rotation est horizontal, et dont l’arrivée d’eau se fait par dessous, par dessus ou de côté.
status: 1
narrow match: Roue à aubes

roue de type Millot
type: SimpleNonPreferredTerm
modified: 2015-10-07T17:40:34+02:00
created: 2014-01-15T14:54:24+01:00
status: 1

roue de poitrine
type: SimpleNonPreferredTerm
modified: 2015-10-07T17:40:34+02:00
created: 2014-01-15T14:54:24+01:00
status: 1

roue à godets
type: SimpleNonPreferredTerm
modified: 2015-10-07T17:40:34+02:00
created: 2014-01-15T14:54:24+01:00
status: 1

roue de type Poncelet
type: SimpleNonPreferredTerm
modified: 2015-10-07T17:40:34+02:00
created: 2014-01-15T14:54:24+01:00
status: 1

roue hydraulique verticale
type: PreferredTerm
modified: 2015-10-07T17:40:34+02:00
created: 2014-01-15T14:54:24+01:00
status: 1

roue à choc
type: SimpleNonPreferredTerm
modified: 2015-10-07T17:40:34+02:00
created: 2014-01-15T14:54:24+01:00
status: 1

roue à augets
type: SimpleNonPreferredTerm
modified: 2015-10-07T17:40:34+02:00
created: 2014-01-15T14:54:24+01:00
status: 1

roue vanne
type: SimpleNonPreferredTerm
modified: 2015-10-07T17:40:34+02:00
created: 2014-01-15T14:54:24+01:00
status: 1

roue de type Sagebien
type: SimpleNonPreferredTerm
modified: 2015-10-07T17:40:34+02:00
created: 2014-01-15T14:54:24+01:00
status: 1

roue à pots
type: SimpleNonPreferredTerm
modified: 2015-10-07T17:40:34+02:00
created: 2014-01-15T14:54:24+01:00
status: 1

roue siphon
type: SimpleNonPreferredTerm
modified: 2015-10-07T17:40:34+02:00
created: 2014-01-15T14:54:24+01:00
status: 1

roue à palette
type: SimpleNonPreferredTerm
modified: 2015-10-07T17:40:34+02:00
created: 2014-01-15T14:54:24+01:00
status: 1

cierge pascal
type: Concept
modified: 2014-12-01T11:12:49+01:00
in scheme: Thésaurus de la désignation des objets mobiliers
preferred label: cero pasquale @it
preferred label: paschal candles @en-us
preferred label: círio pascal @pt
broader: objet lié aux temps de Noël et de Carême
created: 2012-05-16T00:00:00+02:00
related: chandelier pascal
related: cierge
related: linge ou garniture liés aux temps de Carême
definition: Grand cierge bénit, en cire blanche, dans lequel on a pratiqué cinq trous disposés en croix afin d'y placer des grains d'encens. Avec un style liturgique, on y grave une croix, les lettres alpha et oméga, et l'année. Ce cierge est supporté par le chandelier pascal et allumé pendant le temps pascal. Durant le reste de l'année, il peut être placé près des fonts baptismaux ou à la tête d'un cercueil et allumé pour le baptême ou pendant la cérémonie funèbre.
TermeAssocie: chandelier pascal
TermeAssocie: cierge
TermeAssocie: linge ou garniture liés aux temps de Carême
status: 1

cierge pascal
type: PreferredTerm
modified: 2014-12-01T11:12:49+01:00
created: 2014-01-15T14:54:24+01:00
status: 1

bateau de charge d'eaux abritées
type: Concept
modified: 2014-12-18T11:47:52+01:00
in scheme: Thésaurus de la désignation des objets mobiliers
narrower: chaland
narrower: péniche
narrower: barge
broader: bateau de commerce pour marchandises
alternative label: gabare
alternative label: gabarre
created: 2013-09-18T00:00:00+02:00
definition: Bateau de charge adapté aux cours d'eau navigables ou aux rades abritées.
status: 1

gabare
type: SimpleNonPreferredTerm
modified: 2014-12-18T11:47:52+01:00
created: 2014-01-15T14:54:24+01:00
status: 1

bateau de charge d'eaux abritées
type: PreferredTerm
modified: 2014-12-18T11:47:52+01:00
created: 2014-01-15T14:54:24+01:00
status: 1

gabarre
type: SimpleNonPreferredTerm
modified: 2014-12-18T11:47:52+01:00
created: 2014-01-15T14:54:24+01:00
status: 1

chaland
type: Concept
modified: 2014-12-18T11:43:53+01:00
in scheme: Thésaurus de la désignation des objets mobiliers
preferred label: lighters (watercraft) @en-us
broader: bateau de charge d'eaux abritées
alternative label: allège
created: 2013-09-18T00:00:00+02:00
definition: Bateau à fond plat, motorisé, souvent non ponté, employé sur les rivières et les canaux pour le transport des marchandises. Dans une rade, un estuaire ou un port, le chaland est employé pour le transport de matériel (munitions, marchandises etc.) à bord des navires et vice versa.
status: 1
broad match: cb11951555s

bateau de commerce pour marchandises
type: Concept
modified: 2014-10-15T10:11:22+02:00
in scheme: Thésaurus de la désignation des objets mobiliers
preferred label: cargo vessels @en-us
narrower: bateau de charge d'eaux abritées
narrower: bateau de charge maritime
broader: bateau
created: 2012-05-16T00:00:00+02:00
definition: Navire de commerce destiné au transport des marchandises solides, liquides, fluides, pulvérulentes, en vrac ou conditionnées.
status: 1

péniche
type: Concept
modified: 2014-12-18T11:45:15+01:00
in scheme: Thésaurus de la désignation des objets mobiliers
broader: bateau de charge d'eaux abritées
alternative label: péniche-citerne
created: 2013-09-18T00:00:00+02:00
definition: Bateau adapté à la navigation sur les fleuves et canaux, de gabarit Freycinet, pour le transport de marchandises, généralement sèches, stockées dans une cale non spécialisée, accessible par des panneaux amovibles.
status: 1

barge
type: Concept
modified: 2014-12-18T11:41:46+01:00
in scheme: Thésaurus de la désignation des objets mobiliers
preferred label: barges (flat-bottomed watercraft) @en-us
broader: bateau de charge d'eaux abritées
alternative label: barge ostréicole
created: 2013-09-18T00:00:00+02:00
definition: Bateau adapté à la navigation sur les fleuves et canaux pour le transport de marchandises, dépourvu de moteur et poussé soit par une péniche soit par un bateau pousseur.
status: 1
broad match: cb11951555s

lambris de revêtement
type: PreferredTerm
modified: 2015-01-16T16:36:16+01:00
created: 2014-01-15T14:54:24+01:00
status: 1

lambris de hauteur
type: Concept
modified: 2015-01-16T16:31:57+01:00
in scheme: Thésaurus de la désignation des objets mobiliers
broader: lambris de revêtement
created: 2012-05-16T00:00:00+02:00
definition: Lambris de revêtement couvrant toute la hauteur d'un vaisseau ou d'une pièce. Il est couronné par une corniche ou un entablement.
status: 1
broad match: http://vocab.getty.edu/aat/300014658
broad match: cb12505322n

générateur d'ondes électromagnétiques
type: Concept
modified: 2015-08-05T10:57:29+02:00
in scheme: Thésaurus de la désignation des objets mobiliers
broader: générateur
alternative label: générateur de rayons ultraviolet
alternative label: magnétron
alternative label: générateur micro-ondes
alternative label: laser
alternative label: émetteur d'ondes radioélectriques
alternative label: générateur de rayon X
alternative label: générateur hautes fréquences
created: 2012-05-16T00:00:00+02:00
related: instrument de mesure des phénomènes ondulatoires électromagnétiques
definition: Générateur d'ondes se propageant dans le vide sans support matériel. Les ondes électromagnétiques comprennent les ondes radioélectriques, l'infrarouge, la lumière visible, l'ultraviolet, les rayons X.
TermeAssocie: instrument de mesure des phénomènes ondulatoires électromagnétiques
status: 1
narrow match: http://vocab.getty.edu/aat/300024548
narrow match: Laser
narrow match: http://data.bnf.fr/ark:/12148/cb119428293

instrument de mesure des phénomènes ondulatoires électromagnétiques
type: Concept
modified: 2014-12-15T14:30:33+01:00
in scheme: Thésaurus de la désignation des objets mobiliers
preferred label: radiant energy measuring devices @en-us
broader: instrument de mesure de phénomènes ondulatoires
alternative label: colorimètre
alternative label: spectromètre
alternative label: photomètre
alternative label: radiomètre
created: 2012-05-16T00:00:00+02:00
scope note: Instrument de mesure ou de repérage des ondes électromagnétiques, visibles ou non (ondes hertziennes, rayonnements infrarouges, lumière visible, rayonnements ultraviolets, rayons X, et rayonnements de plus courte longueur d'onde) par comparaison ou par représentation graphique ou optique du signal étudié.
related: générateur d'ondes électromagnétiques
TermeAssocie: générateur d'ondes électromagnétiques
status: 1
narrow match: Radiomètre

émetteur d'ondes radioélectriques
type: SimpleNonPreferredTerm
modified: 2015-08-05T10:57:29+02:00
created: 2014-01-15T14:54:24+01:00
status: 1

magnétron
type: SimpleNonPreferredTerm
modified: 2015-08-05T10:57:29+02:00
created: 2014-01-15T14:54:24+01:00
status: 1

générateur de rayon X
type: SimpleNonPreferredTerm
modified: 2015-08-05T10:57:29+02:00
created: 2014-01-15T14:54:24+01:00
status: 1

générateur de rayons ultraviolet
type: SimpleNonPreferredTerm
modified: 2015-08-05T10:57:29+02:00
created: 2014-01-15T14:54:24+01:00
status: 1

générateur hautes fréquences
type: SimpleNonPreferredTerm
modified: 2015-08-05T10:57:29+02:00
created: 2014-01-15T14:54:24+01:00
status: 1

générateur micro-ondes
type: SimpleNonPreferredTerm
modified: 2015-08-05T10:57:29+02:00
created: 2014-01-15T14:54:24+01:00
status: 1

laser
type: SimpleNonPreferredTerm
modified: 2015-08-05T10:57:29+02:00
created: 2014-01-15T14:54:24+01:00
status: 1

générateur d'ondes électromagnétiques
type: PreferredTerm
modified: 2015-08-05T10:57:29+02:00
created: 2014-01-15T14:54:24+01:00
status: 1

polissoir à couteaux
type: Concept
modified: 2014-10-17T13:59:29+02:00
in scheme: Thésaurus de la désignation des objets mobiliers
broader: objet pour l'entretien de la maison
alternative label: machine à nettoyer les couteaux
created: 2012-05-16T00:00:00+02:00
definition: Plaque de bois recouverte de cuir, fixée sur un support, sur laquelle on frotte la lame d'acier des couteaux pour en retirer l'oxydation. Il peut également s’agir d’un mécanisme à manivelle actionnant des disques garnis de cuir qui frottent les lames des couteaux en tournant.
status: 1
broad match: http://vocab.getty.edu/aat/300236674

polissoir à couteaux
type: PreferredTerm
modified: 2014-10-17T13:59:29+02:00
created: 2014-01-15T14:54:24+01:00
status: 1

machine à nettoyer les couteaux
type: SimpleNonPreferredTerm
modified: 2014-10-17T13:59:29+02:00
created: 2014-01-15T14:54:24+01:00
status: 1

bidet
type: Concept
modified: 2014-12-04T12:26:37+01:00
in scheme: Thésaurus de la désignation des objets mobiliers
preferred label: bidets (plumbing fixtures) @en-us
broader: meuble d'hygiène
alternative label: bidet à clystère
created: 2012-05-16T00:00:00+02:00
related: seau de toilette
related: T69-4332
definition: Cuvette en forme de demi-poire, parfois à écoulement, permettant de se mettre à cheval pour la toilette intime. La cuvette est intégrée dans une caisse montée sur pieds. Le bidet fixe est monté directement sur pied unique et reçoit généralement l'eau courante.
TermeAssocie: seau de toilette
TermeAssocie: T69-4332
status: 1

seau de toilette
type: PreferredTerm
modified: 2014-10-17T15:26:01+02:00
created: 2014-01-15T14:54:24+01:00
status: 1

pyxide
type: Concept
modified: 2014-11-27T14:49:25+01:00
in scheme: Thésaurus de la désignation des objets mobiliers
preferred label: pyxes @en-us
broader: ciboire
created: 2012-05-16T00:00:00+02:00
definition: Ciboire sans pied prenant la forme d’une petite boite ronde.
status: 1
broad match: cb11936841q

pyxide
type: PreferredTerm
modified: 2014-11-27T14:49:25+01:00
created: 2014-01-15T14:54:24+01:00
status: 1

bureau
type: PreferredTerm
modified: 2014-12-05T13:56:46+01:00
created: 2014-01-15T14:54:24+01:00
status: 1

bas d'évêque
type: SimpleNonPreferredTerm
modified: 2014-12-03T12:46:40+01:00
created: 2014-01-15T14:54:24+01:00
status: 1

bas liturgiques
type: PreferredTerm
modified: 2014-12-03T12:46:40+01:00
created: 2014-01-15T14:54:24+01:00
status: 1

machine à décalaminer
type: Concept
modified: 2014-01-10T00:00:00+01:00
in scheme: Thésaurus de la désignation des objets mobiliers
broader: machine à décaper
created: 2012-05-16T00:00:00+02:00
definition: Machine à décaper une pièce métallique (cylindre, piston, etc.) de sa couche d'oxyde.
status: 1

machine à décalaminer
type: PreferredTerm
modified: 2014-01-10T00:00:00+01:00
created: 2014-01-15T14:54:24+01:00
status: 1

matériel remorqué pour le transport ferroviaire des voyageurs
type: Concept
modified: 2014-10-14T16:43:42+02:00
in scheme: Thésaurus de la désignation des objets mobiliers
preferred label: passenger cars (railroad cars) @en-us
narrower: T69-8815
narrower: T69-8816
narrower: T69-8817
narrower: T69-8811
narrower: T69-8807
narrower: T69-8808
narrower: T69-8806
broader: matériel ferroviaire roulant
created: 2013-11-04T00:00:00+01:00
definition: Matériel ferroviaire roulant destiné au transport des personnes.
status: 1

matériel ferroviaire roulant
type: PreferredTerm
modified: 2014-12-18T11:34:43+01:00
created: 2014-01-15T14:54:24+01:00
status: 1

poêle de chauffage
type: Concept
modified: 2014-12-05T11:04:12+01:00
in scheme: Thésaurus de la désignation des objets mobiliers
preferred label: stoves (heating equipment) @en-us
narrower: plaque de poêle
narrower: T69-3196
broader: meuble lié au chauffage
created: 2012-05-16T00:00:00+02:00
related: carreau de poêle
related: cheminée
definition: Appareil meuble ou immeuble, en céramique ou en métal, placé dans un espace relativement fermé, permettant de contenir et brûler un combustible ou de récupérer la chaleur produite dans un foyer immédiatement voisin, pour chauffer une pièce.
TermeAssocie: carreau de poêle
TermeAssocie: cheminée
status: 1

cheminée
type: PreferredTerm
modified: 2015-02-25T10:06:58+01:00
created: 2014-01-15T14:54:24+01:00
status: 1

manteau de cheminée
type: Concept
modified: 2015-01-07T16:10:22+01:00
in scheme: Thésaurus de la désignation des objets mobiliers
preferred label: mantels (fireplace components) @en-us
broader: cheminée
created: 2012-05-16T00:00:00+02:00
definition: Construction formée de deux piédroits, d'un couvrement et éventuellement d'un couronnement, renfermant le foyer et faisant avant-corps.
status: 1
broad match: cb11931172v

souche de cheminée
type: Concept
modified: 2015-01-07T11:23:15+01:00
in scheme: Thésaurus de la désignation des objets mobiliers
preferred label: chimney stacks @en-us
broader: couverture ou accessoire du toit
created: 2012-05-16T00:00:00+02:00
scope note: Voir aussi le Thesaurus de la désignation des œuvres architecturales et des espaces aménagés.
related: cheminée
definition: Ouvrage de maçonnerie renfermant un ou plusieurs conduits de cheminée et s'élevant au-dessus du toit.
TermeAssocie: cheminée
status: 1

hotte de cheminée
type: Concept
modified: 2015-01-07T16:01:04+01:00
in scheme: Thésaurus de la désignation des objets mobiliers
narrower: trumeau de cheminée
broader: cheminée
created: 2012-05-16T00:00:00+02:00
scope note: Les décors peints ou sculptés ainsi que les miroirs et leur encadrement ornant l'extérieur des hottes de cheminée doivent être décrits sous le terme trumeau de cheminée.
definition: Ouvrage de maçonnerie faisant partie du coffre, contenant le ou les conduits d'évacuation, placé entre le manteau ou le faux-manteau et le couvrement de la pièce dans laquelle se trouve le départ du conduit.
status: 1
broad match: cb11931172v

machine à graver
type: Concept
modified: 2015-09-03T15:22:28+02:00
in scheme: Thésaurus de la désignation des objets mobiliers
broader: machine à donner un aspect
alternative label: tour à graver
created: 2012-05-16T00:00:00+02:00
definition: Machine à tracer en creux, sur un support dur (métal, verre, bois, pierre, etc.), des traits, des figures, des caractères, etc.
status: 1

tour à graver
type: SimpleNonPreferredTerm
modified: 2015-09-03T15:22:28+02:00
created: 2014-01-15T14:54:24+01:00
status: 1

machine à donner un aspect
type: Concept
modified: 2014-01-10T00:00:00+01:00
in scheme: Thésaurus de la désignation des objets mobiliers
narrower: machine à surfacer
narrower: machine à graver
narrower: machine à broder
narrower: machine à revêtir
narrower: machine à gaufrer
broader: machine à mettre en état
created: 2012-05-16T00:00:00+02:00
definition: Machine à mettre en état la surface d'un produit en lui donnant l'aspect souhaité.
status: 1

machine à graver
type: PreferredTerm
modified: 2015-09-03T15:22:28+02:00
created: 2014-01-15T14:54:24+01:00
status: 1

sceptre
type: Concept
modified: 2014-12-30T12:44:44+01:00
in scheme: Thésaurus de la désignation des objets mobiliers
preferred label: scepters @en-us
broader: emblème de pouvoir
created: 2013-11-29T00:00:00+01:00
definition: Bâton de commandement, parfois surmonté d'une figure emblématique, représentant un insigne du pouvoir royal ou impérial.
status: 1

emblème de pouvoir
type: Concept
modified: 2014-10-09T12:52:26+02:00
in scheme: Thésaurus de la désignation des objets mobiliers
narrower: couronne royale
narrower: sceptre
narrower: masse de cérémonie
narrower: main de justice
broader: bijouterie et orfèvrerie civiles, monnaie, médaille
created: 2013-11-29T00:00:00+01:00
definition: Objet en métal précieux, et parfois orné de pierreries, symbole du pouvoir royal (puis par extension d'une autorité) utilisé lors de cérémonies solennelles.
status: 1

sceptre
type: PreferredTerm
modified: 2014-12-30T12:44:44+01:00
created: 2014-01-15T14:54:24+01:00
status: 1

cantonnière d'arche sainte
type: Concept
modified: 2014-01-10T00:00:00+01:00
in scheme: Thésaurus de la désignation des objets mobiliers
broader: linge et garniture liés au culte synagogal
alternative label: kapporet
created: 2012-05-16T00:00:00+02:00
definition: Cantonnière souvent richement ornée qui accompagne le rideau d'arche sainte. Le programme iconographique destiné à la décoration de ces cantonnières a été très élaboré, en particulier au XVIIIe s., avec la menorah (chandelier à sept branches), le broc pour les ablutions, la table pour le pain azyme.
status: 1

linge et garniture liés au culte synagogal
type: Concept
modified: 2014-01-10T00:00:00+01:00
in scheme: Thésaurus de la désignation des objets mobiliers
narrower: cantonnière d'arche sainte
narrower: bandelette de Torah
narrower: garniture de pupitre d'officiant
narrower: couverture de Torah
narrower: rideau d'arche sainte
narrower: manteau de Torah
broader: textile de la religion juive
created: 2012-05-16T00:00:00+02:00
status: 1

kapporet
type: SimpleNonPreferredTerm
modified: 2014-01-10T00:00:00+01:00
created: 2014-01-15T14:54:24+01:00
status: 1

cantonnière d'arche sainte
type: PreferredTerm
modified: 2014-01-10T00:00:00+01:00
created: 2014-01-15T14:54:24+01:00
status: 1

objet monté
type: Concept
modified: 2014-12-05T15:22:00+01:00
in scheme: Thésaurus de la désignation des objets mobiliers
broader: objet décoratif ou de rangement ou pour les plantes et les fleurs
alternative label: nautile
created: 2012-05-16T00:00:00+02:00
definition: Élément végétal, minéral ou animal présenté dans, ou sur, une monture, à usage uniquement décoratif.
status: 1
narrow match: http://vocab.getty.edu/aat/300201184
broad match: http://data.bnf.fr/ark:/12148/cb119328783

objet décoratif ou de rangement ou pour les plantes et les fleurs
type: Concept
modified: 2014-10-16T14:30:41+02:00
in scheme: Thésaurus de la désignation des objets mobiliers
narrower: étui
narrower: objet monté
narrower: pique-fleurs
narrower: boîte décorative
narrower: vase à fleurs
narrower: pot à plantes
narrower: porte-montre
narrower: bouquet
narrower: récipient à illusion
narrower: plat décoratif
narrower: T69-4570
narrower: T69-4579
narrower: T69-4577
narrower: T69-4575
narrower: T69-4573
narrower: T69-3497
narrower: T69-4572
narrower: T69-4546
narrower: T69-4589
narrower: T69-4583
narrower: T69-6926
narrower: T69-3489
narrower: T69-4585
narrower: T69-4581
narrower: T69-4587
broader: objet civil domestique
alternative label: obélisque décoratif
alternative label: quenouille de rosière
alternative label: porte-étendard
created: 2012-05-16T00:00:00+02:00
definition: Élément de rangement ou de présentation, contribuant éventuellement à l’ornementation de la demeure, ou strictement décoratif.
status: 1

nautile
type: SimpleNonPreferredTerm
modified: 2014-12-05T15:22:00+01:00
created: 2014-01-15T14:54:24+01:00
status: 1

objet monté
type: PreferredTerm
modified: 2014-12-05T15:22:00+01:00
created: 2014-01-15T14:54:24+01:00
status: 1

tapis d'autel
type: Concept
modified: 2014-12-02T16:06:04+01:00
in scheme: Thésaurus de la désignation des objets mobiliers
preferred label: altar carpets @en-us
preferred label: tappeto d'altare @it
preferred label: tapete de altar @pt
broader: linge ou garniture liés à l'autel
alternative label: tapis de pied d'autel
alternative label: tapis des marches de l'autel
created: 2012-05-16T00:00:00+02:00
related: degré d'autel
related: plate-forme d'autel
definition: Tapis posé sur un degré d'autel, sa plate-forme ou sur le sol devant un autel.
TermeAssocie: degré d'autel
TermeAssocie: plate-forme d'autel
status: 1

tapis des marches de l'autel
type: SimpleNonPreferredTerm
modified: 2014-12-02T16:06:04+01:00
created: 2014-01-15T14:54:24+01:00
status: 1

tapis d'autel
type: PreferredTerm
modified: 2014-12-02T16:06:04+01:00
created: 2014-01-15T14:54:24+01:00
status: 1

degré d'autel
type: Concept
modified: 2014-12-01T12:27:34+01:00
in scheme: Thésaurus de la désignation des objets mobiliers
preferred label: altar steps @en-us
preferred label: gradinata d'altare @it
preferred label: degraus de altar @pt
narrower: plate-forme d'autel
broader: autel et son environnement
created: 2012-05-16T00:00:00+02:00
related: tapis d'autel
definition: Marche ou ensemble de marches, souvent au nombre de trois, permettant d'accéder à un autel. L'autel est parfois construit sur le degré d'autel.
TermeAssocie: tapis d'autel
status: 1
broad match: cb11943953g
broad match: Autel (christianisme)

plate-forme d'autel
type: Concept
modified: 2014-12-01T12:30:44+01:00
in scheme: Thésaurus de la désignation des objets mobiliers
preferred label: footpaces @en-us
preferred label: pedena d'altare @it
preferred label: supedâneo @pt
broader: degré d'autel
alternative label: palier d'autel
alternative label: degré supérieur de l'autel
alternative label: marchepied d'autel
created: 2012-05-16T00:00:00+02:00
related: tapis d'autel
definition: Marche supérieure d'un degré d'autel, plate-forme en bois posée sur un degré ou encore degré d'autel à une seule marche.
TermeAssocie: tapis d'autel
status: 1
broad match: cb11943953g
broad match: Autel (christianisme)

tapis de pied d'autel
type: SimpleNonPreferredTerm
modified: 2014-12-02T16:06:04+01:00
created: 2014-01-15T14:54:24+01:00
status: 1

croix mortuaire
type: Concept
modified: 2014-10-21T10:08:15+02:00
in scheme: Thésaurus de la désignation des objets mobiliers
broader: objet funéraire
created: 2012-05-16T00:00:00+02:00
related: couronne mortuaire
related: porte-couronne mortuaire
definition: Croix de fleurs et de feuillages naturels ou artificiels (céramique, perles de verre, etc.) que l'on dépose sur une tombe, parfois complétée par un ruban portant une inscription dédicatoire.
TermeAssocie: couronne mortuaire
TermeAssocie: porte-couronne mortuaire
status: 1
broad match: http://vocab.getty.edu/aat/300235443
broad match: cb12647480k
broad match: Croix (christianisme)

couronne mortuaire
type: Concept
modified: 2014-11-27T10:59:47+01:00
in scheme: Thésaurus de la désignation des objets mobiliers
preferred label: corona funebre @it
preferred label: funeral wreaths @en-us
preferred label: coroa funerária @pt
broader: objet funéraire
alternative label: couronne funéraire
created: 2012-05-16T00:00:00+02:00
related: croix mortuaire
related: porte-couronne mortuaire
definition: Cercle ornemental fait de fleurs et de feuillages naturels ou artificiels que l'on dépose sur une tombe, qui comporte généralement un ruban portant une inscription dédicatoire.
TermeAssocie: croix mortuaire
TermeAssocie: porte-couronne mortuaire
status: 1

croix mortuaire
type: PreferredTerm
modified: 2014-10-21T10:08:15+02:00
created: 2014-01-15T14:54:24+01:00
status: 1

porte-couronne mortuaire
type: Concept
modified: 2014-12-02T11:52:33+01:00
in scheme: Thésaurus de la désignation des objets mobiliers
preferred label: portacorona funebre @it
preferred label: funeral crown stands @en-us
preferred label: suporte para coroa funerária @pt
broader: meuble lié aux rites funéraires
created: 2012-05-16T00:00:00+02:00
related: croix mortuaire
related: couronne mortuaire
definition: Support, généralement en métal, servant à porter une ou plusieurs couronnes mortuaires au-dessus d'un cercueil pendant une cérémonie funèbre, ou sur un tombeau.
TermeAssocie: croix mortuaire
TermeAssocie: couronne mortuaire
status: 1
broad match: cb11931491z
broad match: Couronne mortuaire

prédelle
type: Concept
modified: 2014-12-01T13:22:23+01:00
in scheme: Thésaurus de la désignation des objets mobiliers
preferred label: predella @it
preferred label: predellas @en-us
preferred label: predela @pt
broader: autel et son environnement
created: 2012-05-16T00:00:00+02:00
definition: Panneau, ensemble de panneaux, éléments peints ou sculptés, placés horizontalement à la partie inférieure d'un retable, d'un tableau d'autel ou d'un polyptyque. Située directement au-dessus du niveau de l'autel, la prédelle porte une ou plusieurs représentations figurées qui peuvent être complémentaires de celles du reste du retable, du tableau d'autel ou du polyptyque.
status: 1

prédelle
type: PreferredTerm
modified: 2014-12-01T13:22:23+01:00
created: 2014-01-15T14:54:24+01:00
status: 1

machine à joindre
type: Concept
modified: 2015-10-08T14:15:44+02:00
in scheme: Thésaurus de la désignation des objets mobiliers
narrower: machine à coller
narrower: machine à sertir
narrower: machine à braser
narrower: machine à stratifier
narrower: machine à souder
broader: machine à assembler
created: 2012-05-16T00:00:00+02:00
definition: Machine à assembler des produits par adhérence ou pression avec ou sans produit d'apport.
status: 1
broad match: http://data.bnf.fr/ark:/12148/cb120214424

machine à coller
type: Concept
modified: 2015-08-11T11:12:38+02:00
in scheme: Thésaurus de la désignation des objets mobiliers
broader: machine à joindre
alternative label: presse à coller
alternative label: jointeuse
created: 2012-05-16T00:00:00+02:00
definition: Machine à joindre des produits à l'aide d'un adhésif.
status: 1

machine à sertir
type: Concept
modified: 2015-10-08T14:34:15+02:00
in scheme: Thésaurus de la désignation des objets mobiliers
broader: machine à joindre
alternative label: tour à sertir
alternative label: presse à sertir
created: 2012-05-16T00:00:00+02:00
definition: Machine à joindre des produits sans soudure en écrasant les saillies ou les agrafes dont ils sont dotés.
status: 1
broad match: Sertissage

machine à braser
type: Concept
modified: 2015-10-08T14:21:52+02:00
in scheme: Thésaurus de la désignation des objets mobiliers
broader: machine à joindre
created: 2012-05-16T00:00:00+02:00
definition: Machine à joindre des produits par interposition d'un métal ou d'un alliage fondu dont le point de fusion est inférieur à 400°C.
status: 1
broad match: Brasage

machine à stratifier
type: Concept
modified: 2014-01-10T00:00:00+01:00
in scheme: Thésaurus de la désignation des objets mobiliers
broader: machine à joindre
created: 2012-05-16T00:00:00+02:00
definition: Machine à joindre par superposition des plaques en les imprégnant de résines thermodurcissables ou de polymères.
status: 1

machine à joindre
type: PreferredTerm
modified: 2015-10-08T14:15:44+02:00
created: 2014-01-15T14:54:24+01:00
status: 1

machine à assembler
type: Concept
modified: 2015-10-08T11:02:56+02:00
in scheme: Thésaurus de la désignation des objets mobiliers
narrower: machine à joindre
narrower: machine à entrelacer
narrower: machine à agglomérer
narrower: machine à ligaturer
narrower: machine à attacher
narrower: machine à insérer
broader: machine liée à la production industrielle
created: 2012-05-16T00:00:00+02:00
definition: Machine à solidariser, entre eux, définitivement ou non, divers matériaux ou produits.
status: 1

machine à souder
type: Concept
modified: 2015-10-08T14:39:31+02:00
in scheme: Thésaurus de la désignation des objets mobiliers
broader: machine à joindre
alternative label: presse à souder
created: 2012-05-16T00:00:00+02:00
definition: Machine à joindre des produits métalliques ou synthétiques, soit par fusion de parties en contact, soit par réaction chimique.
status: 1
broad match: Soudage

vêtement de nuit ou d'intérieur
type: Concept
modified: 2014-12-11T16:56:47+01:00
in scheme: Thésaurus de la désignation des objets mobiliers
preferred label: night and dressing wear @en-us
broader: costume civil, professionnel ou militaire
alternative label: pyjama
alternative label: chemise de nuit
alternative label: peignoir
alternative label: robe de chambre
created: 2012-05-16T00:00:00+02:00
definition: Vêtement qui se porte pour dormir ou exclusivement à l'intérieur de la maison.
status: 1

pyjama
type: SimpleNonPreferredTerm
modified: 2014-12-11T16:56:48+01:00
created: 2014-01-15T14:54:24+01:00
status: 1

vêtement de nuit ou d'intérieur
type: PreferredTerm
modified: 2014-12-11T16:56:48+01:00
created: 2014-01-15T14:54:24+01:00
status: 1

chemise de nuit
type: SimpleNonPreferredTerm
modified: 2014-12-11T16:56:48+01:00
created: 2014-01-15T14:54:24+01:00
status: 1

peignoir
type: SimpleNonPreferredTerm
modified: 2014-12-11T16:56:48+01:00
created: 2014-01-15T14:54:24+01:00
status: 1

robe de chambre
type: SimpleNonPreferredTerm
modified: 2014-12-11T16:56:47+01:00
created: 2014-01-15T14:54:24+01:00
status: 1

machine à tréfiler
type: Concept
modified: 2015-10-14T12:09:38+02:00
in scheme: Thésaurus de la désignation des objets mobiliers
broader: machine à allonger
alternative label: tréfileuse
alternative label: banc à étirer
created: 2012-05-16T00:00:00+02:00
definition: Machine à étirer un matériau ou un produit par traction à travers une filière.
status: 1
narrow match: Banc à étirer

banc à étirer
type: SimpleNonPreferredTerm
modified: 2015-10-14T12:09:38+02:00
created: 2014-01-15T14:54:24+01:00
status: 1

tréfileuse
type: SimpleNonPreferredTerm
modified: 2015-10-14T12:09:38+02:00
created: 2014-01-15T14:54:24+01:00
status: 1

machine à tréfiler
type: PreferredTerm
modified: 2015-10-14T12:09:38+02:00
created: 2014-01-15T14:54:24+01:00
status: 1

baratte
type: Concept
modified: 2014-12-04T15:06:39+01:00
in scheme: Thésaurus de la désignation des objets mobiliers
preferred label: churns @en-us
broader: meuble pour lait ou fromage
created: 2012-05-16T00:00:00+02:00
related: machine à émulsionner
definition: Récipient avec instrument servant à transformer la crème de lait crue en beurre par agitation.
TermeAssocie: machine à émulsionner
status: 1

baratte
type: PreferredTerm
modified: 2014-12-04T15:06:39+01:00
created: 2014-01-15T14:54:24+01:00
status: 1

machine à émulsionner
type: Concept
modified: 2015-10-15T16:17:28+02:00
in scheme: Thésaurus de la désignation des objets mobiliers
broader: machine à changer d'état
alternative label: baratte industrielle
alternative label: baratte continue
alternative label: baratte-malaxeur
created: 2012-05-16T00:00:00+02:00
related: baratte
definition: Machine à changer d'état un produit composé d'éléments insolubles en le malaxant de façon à obtenir une émulsion.
TermeAssocie: baratte
status: 1
narrow match: http://vocab.getty.edu/aat/300043094
narrow match: http://data.bnf.fr/ark:/12148/cb156146957
narrow match: Baratte

bogie
type: SimpleNonPreferredTerm
modified: 2014-12-17T17:11:30+01:00
created: 2014-01-15T14:54:24+01:00
status: 1

élément de matériel de transport ferroviaire
type: PreferredTerm
modified: 2014-12-17T17:11:30+01:00
created: 2014-01-15T14:54:24+01:00
status: 1

coupon de voie
type: Concept
modified: 2014-10-14T16:04:35+02:00
in scheme: Thésaurus de la désignation des objets mobiliers
broader: élément de matériel de transport ferroviaire
alternative label: coupon de voie à crémaillère
created: 2013-11-04T00:00:00+01:00
definition: Tronçon démonté et transporté hors de son emprise d'une voie de chemin de fer.
status: 1
broad match: http://data.bnf.fr/ark:/12148/cb119316998
broad match: http://vocab.getty.edu/aat/300248207

instrument de démonstration en mécanique des fluides
type: Concept
modified: 2014-12-15T14:14:49+01:00
in scheme: Thésaurus de la désignation des objets mobiliers
narrower: instrument de démonstration en statique des fluides
narrower: instrument de démonstration en dynamique des fluides
broader: instrument de démonstration en mécanique
created: 2012-05-16T00:00:00+02:00
definition: Instrument de mise en évidence des phénomènes liés aux pressions de fluides (liquides ou gaz), ou à leurs déplacements (hydrostatique, hydrodynamique).
status: 1
broad match: http://vocab.getty.edu/aat/300122283

instrument de démonstration en mécanique
type: PreferredTerm
modified: 2014-12-15T14:13:45+01:00
created: 2014-01-15T14:54:24+01:00
status: 1

masse de cérémonie
type: Concept
modified: 2014-12-30T12:41:56+01:00
in scheme: Thésaurus de la désignation des objets mobiliers
preferred label: ceremonial maces @en-us
broader: emblème de pouvoir
created: 2013-11-29T00:00:00+01:00
definition: Objet en métal précieux, en forme de masse d'arme, symbole d'autorité.
status: 1
broad match: cb11931965s

masse de cérémonie
type: PreferredTerm
modified: 2014-12-30T12:41:56+01:00
created: 2014-01-15T14:54:24+01:00
status: 1

cotte de mailles
type: Concept
modified: 2014-12-12T14:10:14+01:00
in scheme: Thésaurus de la désignation des objets mobiliers
preferred label: shirts of mail @en-us
broader: arme défensive
alternative label: haubert
created: 2012-05-16T00:00:00+02:00
definition: Protection corporelle en forme de tunique, constituée de mailles métalliques entrelacées.
status: 1
broad match: cb12266187n

cotte de mailles
type: PreferredTerm
modified: 2014-12-12T14:10:14+01:00
created: 2014-01-15T14:54:24+01:00
status: 1

arme défensive
type: Concept
modified: 2014-09-02T17:44:30+02:00
in scheme: Thésaurus de la désignation des objets mobiliers
preferred label: armor (protective wear) @en-us
narrower: cotte de mailles
narrower: armure ou élément d'armure
narrower: protection d'animal
narrower: bouclier
narrower: protection NBC
broader: armement
alternative label: masque balistique
alternative label: gilet pare-balle
alternative label: gilet pare-éclat
created: 2013-11-13T00:00:00+01:00
related: vêtement spécifique de militaire
definition: Pièce qui protège le corps du combattant ou celui de sa monture.
TermeAssocie: vêtement spécifique de militaire
status: 1
broad match: armements

haubert
type: SimpleNonPreferredTerm
modified: 2014-12-12T14:10:14+01:00
created: 2014-01-15T14:54:24+01:00
status: 1

turboréacteur
type: SimpleNonPreferredTerm
modified: 2015-10-07T18:21:05+02:00
created: 2014-01-15T14:54:24+01:00
status: 1

turbine de propulsion
type: SimpleNonPreferredTerm
modified: 2015-10-07T18:21:05+02:00
created: 2014-01-15T14:54:24+01:00
status: 1

turbine d'entraînement
type: SimpleNonPreferredTerm
modified: 2015-10-07T18:21:05+02:00
created: 2014-01-15T14:54:24+01:00
status: 1

moteur à turbine à combustion
type: PreferredTerm
modified: 2015-10-07T18:21:05+02:00
created: 2014-01-15T14:54:24+01:00
status: 1

moteur-fusée
type: SimpleNonPreferredTerm
modified: 2015-10-07T18:21:05+02:00
created: 2014-01-15T14:54:24+01:00
status: 1

écharpe de croix de confrérie
type: Concept
modified: 2014-12-03T10:34:00+01:00
in scheme: Thésaurus de la désignation des objets mobiliers
preferred label: fusciacco @it
preferred label: confraternity cross veils @en-us
preferred label: faixa de cruz de confraria @pt
broader: linge ou garniture liés à la procession
created: 2012-05-16T00:00:00+02:00
related: croix de confrérie
definition: Bande de tissu placée sur une croix de confrérie et portant généralement l’emblème de cette confrérie. Elle est souvent retenue par une armature fixée aux trois branches supérieures de la croix, les extrémités de l'écharpe retombant de part et d'autre du crucifix, de manière à former une sorte de dais. Elle peut aussi être portée sans armature par les bras de la croix qu'elle enveloppe. Plus rarement, elle est suspendue sous le nœud de la croix.
TermeAssocie: croix de confrérie
status: 1
broad match: http://vocab.getty.edu/aat/300263685

écharpe de croix de confrérie
type: PreferredTerm
modified: 2014-12-03T10:34:00+01:00
created: 2014-01-15T14:54:24+01:00
status: 1

croix de confrérie
type: Concept
modified: 2014-11-28T12:21:33+01:00
in scheme: Thésaurus de la désignation des objets mobiliers
preferred label: confraternity crosses @en-us
preferred label: croce di confraternita @it
preferred label: cruz de confraria @pt
broader: objet lié à la procession
created: 2012-05-16T00:00:00+02:00
related: écharpe de croix de confrérie
definition: Croix portée lors de processions par un membre d'une confrérie. Elle se distingue souvent de la croix de procession par une bande d'étoffe drapée autour des branches ou accrochée à la hampe (écharpe de croix de confrérie).
TermeAssocie: écharpe de croix de confrérie
status: 1
broad match: http://vocab.getty.edu/aat/300235443

lame funéraire
type: Concept
modified: 2015-02-24T15:08:27+01:00
in scheme: Thésaurus de la désignation des objets mobiliers
preferred label: tomb slabs @en-us
preferred label: lastra tombale @it
broader: plate-tombe
created: 2012-05-16T00:00:00+02:00
definition: Feuille de métal, longue et peu épaisse, toujours rigide, fermant une plate-tombe. Elle peut être émaillée, peinte ou gravée et comporter une épitaphe.
status: 1
broad match: http://vocab.getty.edu/aat/300005923
broad match: Tombe

plate-tombe
type: Concept
modified: 2015-02-24T15:00:48+01:00
in scheme: Thésaurus de la désignation des objets mobiliers
preferred label: tomba terragna @it
preferred label: graves @en-us
narrower: lame funéraire
narrower: T69-396
broader: monument funéraire
created: 2012-05-16T00:00:00+02:00
definition: Monument funéraire situé à l'intérieur d'un édifice, composé d'une dalle funéraire ou d'une lame funéraire fermant la tombe, encastrée dans le sol ou légèrement surélevée par rapport à ce dernier.
status: 1

lame funéraire
type: PreferredTerm
modified: 2015-02-24T15:08:27+01:00
created: 2014-01-15T14:54:24+01:00
status: 1

robinet
type: PreferredTerm
modified: 2014-01-10T00:00:00+01:00
created: 2014-01-15T14:54:24+01:00
status: 1

arme de choc
type: Concept
modified: 2014-12-12T15:11:44+01:00
in scheme: Thésaurus de la désignation des objets mobiliers
preferred label: percussive weapons @en-us
broader: arme offensive
alternative label: matraque
alternative label: masse d'arme
alternative label: fléau d'arme
alternative label: coup de poing
alternative label: poing américain
created: 2012-05-16T00:00:00+02:00
definition: Arme qui blesse par choc, sans couper ni déchirer les chairs.
status: 1
broad match: cb11934803p
broad match: Arme

poing américain
type: SimpleNonPreferredTerm
modified: 2014-12-12T15:11:44+01:00
created: 2014-01-15T14:54:24+01:00
status: 1

fléau d'arme
type: SimpleNonPreferredTerm
modified: 2014-12-12T15:11:44+01:00
created: 2014-01-15T14:54:24+01:00
status: 1

coup de poing
type: SimpleNonPreferredTerm
modified: 2014-12-12T15:11:44+01:00
created: 2014-01-15T14:54:24+01:00
status: 1

arme de choc
type: PreferredTerm
modified: 2014-12-12T15:11:44+01:00
created: 2014-01-15T14:54:24+01:00
status: 1

matraque
type: SimpleNonPreferredTerm
modified: 2014-12-12T15:11:44+01:00
created: 2014-01-15T14:54:24+01:00
status: 1

arme offensive
type: Concept
modified: 2014-12-12T14:17:17+01:00
in scheme: Thésaurus de la désignation des objets mobiliers
preferred label: weapons @en-us
narrower: arme blanche
narrower: arme de choc
narrower: arme à feu
narrower: arme de jet
narrower: T69-9093
narrower: T69-9157
broader: armement
alternative label: engin de siège
alternative label: trébuchet (arme)
alternative label: mine explosive
alternative label: missile
alternative label: fusil à air comprimé
alternative label: carabine à air comprimé
alternative label: catapulte
alternative label: torpille
created: 2013-09-18T00:00:00+02:00
definition: Instrument ou dispositif pour neutraliser, blesser ou tuer un être vivant ou provoquer une destruction matérielle. On trouve essentiellement des armes pour la guerre ou la chasse.
status: 1
broad match: http://vocab.getty.edu/aat/300036926

masse d'arme
type: SimpleNonPreferredTerm
modified: 2014-12-12T15:11:44+01:00
created: 2014-01-15T14:54:24+01:00
status: 1

corbeille à couverts
type: SimpleNonPreferredTerm
modified: 2014-10-16T15:19:02+02:00
created: 2014-01-15T14:54:24+01:00
status: 1

ramasse-couverts
type: PreferredTerm
modified: 2014-10-16T15:19:02+02:00
created: 2014-01-15T14:54:24+01:00
status: 1

armoire de confrérie
type: SimpleNonPreferredTerm
modified: 2014-12-01T15:14:01+01:00
created: 2014-01-15T14:54:24+01:00
status: 1

armoire de congrégation
type: SimpleNonPreferredTerm
modified: 2014-12-01T15:14:01+01:00
created: 2014-01-15T14:54:24+01:00
status: 1

armoire de confrérie, de congrégation ou de fabrique
type: PreferredTerm
modified: 2014-12-01T15:14:01+01:00
created: 2014-01-15T14:54:24+01:00
status: 1

armoire de fabrique
type: SimpleNonPreferredTerm
modified: 2014-12-01T15:14:01+01:00
created: 2014-01-15T14:54:24+01:00
status: 1

malaxeur à beurre
type: SimpleNonPreferredTerm
modified: 2014-10-10T16:58:38+02:00
created: 2014-01-15T14:54:24+01:00
status: 1

couloir à fromage
type: SimpleNonPreferredTerm
modified: 2014-10-10T16:58:38+02:00
created: 2014-01-15T14:54:24+01:00
status: 1

cuve à lait
type: SimpleNonPreferredTerm
modified: 2014-10-10T16:58:38+02:00
created: 2014-01-15T14:54:24+01:00
status: 1

porte-baratte
type: SimpleNonPreferredTerm
modified: 2014-10-10T16:58:38+02:00
created: 2014-01-15T14:54:24+01:00
status: 1

moule à fromage
type: Concept
modified: 2014-12-08T12:49:54+01:00
in scheme: Thésaurus de la désignation des objets mobiliers
preferred label: cheese molds @en-us
broader: récipient pour la préparation des aliments
alternative label: forme à fromage
alternative label: moule à sérac
alternative label: faisselle
created: 2012-05-16T00:00:00+02:00
related: meuble pour lait ou fromage
definition: Récipient entièrement perforé et qui, posé sur un égouttoir à fromage, sert à égoutter ou presser le caillé, cru ou cuit. Ses formes varient en fonction du fromage produit.
TermeAssocie: meuble pour lait ou fromage
status: 1

table à lait
type: SimpleNonPreferredTerm
modified: 2014-10-10T16:58:38+02:00
created: 2014-01-15T14:54:24+01:00
status: 1

auge à saler le fromage
type: SimpleNonPreferredTerm
modified: 2014-10-10T16:58:38+02:00
created: 2014-01-15T14:54:24+01:00
status: 1

cuve à saumure
type: SimpleNonPreferredTerm
modified: 2014-10-10T16:58:38+02:00
created: 2014-01-15T14:54:24+01:00
status: 1

meuble pour lait ou fromage
type: PreferredTerm
modified: 2014-10-10T16:58:38+02:00
created: 2014-01-15T14:54:24+01:00
status: 1

presse à fromage
type: Concept
modified: 2014-12-04T15:09:46+01:00
in scheme: Thésaurus de la désignation des objets mobiliers
preferred label: cheese presses @en-us
broader: meuble pour lait ou fromage
created: 2012-05-16T00:00:00+02:00
definition: Meuble au sol ou à poser, en forme de banc, de table ou d’armoire servant à extraire du fromage le liquide en excédent. La pression peut être exercée par une vis ou un poids placé sur une planche qui couvre le fromage ou suspendu à l’extérieur du meuble.
status: 1

moule à sérac
type: SimpleNonPreferredTerm
modified: 2014-12-08T12:49:54+01:00
created: 2014-01-15T14:54:24+01:00
status: 1

faisselle
type: SimpleNonPreferredTerm
modified: 2014-12-08T12:49:54+01:00
created: 2014-01-15T14:54:24+01:00
status: 1

forme à fromage
type: SimpleNonPreferredTerm
modified: 2014-12-08T12:49:54+01:00
created: 2014-01-15T14:54:24+01:00
status: 1

moule à fromage
type: PreferredTerm
modified: 2014-12-08T12:49:54+01:00
created: 2014-01-15T14:54:24+01:00
status: 1

roue hydraulique horizontale
type: Concept
modified: 2015-10-07T17:41:03+02:00
in scheme: Thésaurus de la désignation des objets mobiliers
broader: moteur hydraulique
created: 2012-05-16T00:00:00+02:00
definition: Moteur hydraulique constitué d'une roue, équipée de pales ou de cuillers, placée horizontalement et dont l'axe de rotation est vertical.
status: 1
broad match: Moteur hydraulique

roue hydraulique horizontale
type: PreferredTerm
modified: 2015-10-07T17:41:03+02:00
created: 2014-01-15T14:54:24+01:00
status: 1

meuble à horloge
type: Concept
modified: 2014-12-10T14:11:13+01:00
in scheme: Thésaurus de la désignation des objets mobiliers
preferred label: clock cases @en-us
broader: horloge
alternative label: boîte à horloge
alternative label: gaine d'horloge
alternative label: caisse d'horloge
alternative label: boîtier d'horloge
created: 2012-05-16T00:00:00+02:00
definition: Boîte en bois contenant le mécanisme d'horlogerie. La gaine ou caisse d'horloge, surtout utilisée pour les horloges au sol, adopte différentes formes : évasée, renflée à la partie médiane ou inférieure, droite ou encore pyramidale.
status: 1
broad match: http://data.bnf.fr/ark:/12148/cb119384444
broad match: Horloge

boîtier d'horloge
type: SimpleNonPreferredTerm
modified: 2014-12-10T14:11:13+01:00
created: 2014-01-15T14:54:24+01:00
status: 1

caisse d'horloge
type: SimpleNonPreferredTerm
modified: 2014-12-10T14:11:13+01:00
created: 2014-01-15T14:54:24+01:00
status: 1

meuble à horloge
type: PreferredTerm
modified: 2014-12-10T14:11:13+01:00
created: 2014-01-15T14:54:24+01:00
status: 1

boîte à horloge
type: SimpleNonPreferredTerm
modified: 2014-12-10T14:11:13+01:00
created: 2014-01-15T14:54:24+01:00
status: 1

gaine d'horloge
type: SimpleNonPreferredTerm
modified: 2014-12-10T14:11:13+01:00
created: 2014-01-15T14:54:24+01:00
status: 1

bassin pour le lavement des pieds
type: Concept
modified: 2014-12-01T11:11:31+01:00
in scheme: Thésaurus de la désignation des objets mobiliers
preferred label: bacile per la lavanda di piedi @it
preferred label: basins for the washing of the feet @en-us
preferred label: bacia de lava-pés @pt
broader: objet lié aux temps de Noël et de Carême
created: 2012-05-16T00:00:00+02:00
scope note: Récipient en forme de bassin, de grandes dimensions, utilisé spécifiquement pour la cérémonie du lavement des pieds le Jeudi saint, avec une aiguière pour le lavement des pieds.
related: objet lié à l'ablution, à l'aspersion et à l'encensement
TermeAssocie: objet lié à l'ablution, à l'aspersion et à l'encensement
status: 1
broad match: http://data.bnf.fr/ark:/12148/cb119669330

bassin pour le lavement des pieds
type: PreferredTerm
modified: 2014-12-01T11:11:31+01:00
created: 2014-01-15T14:54:24+01:00
status: 1

carreau de poêle
type: PreferredTerm
modified: 2015-01-15T17:21:37+01:00
created: 2014-01-15T14:54:24+01:00
status: 1

dalmatique
type: Concept
modified: 2014-12-03T14:38:26+01:00
in scheme: Thésaurus de la désignation des objets mobiliers
preferred label: dalmatica @it
preferred label: dalmatics @en-us
preferred label: dalmática @pt
broader: vêtement liturgique de dessus
alternative label: clavi
created: 2012-05-16T00:00:00+02:00
related: tunicelle
related: dalmatique de confrérie
related: ornement liturgique catholique
related: dalmaticelle
definition: Vêtement en forme de tunique courte, qui s'enfile par la tête, porté par-dessus tous les autres par les diacres. La tunique, vêtement porté par les sous-diacres, ne se différencie que par le fait qu’elle est plus courte et moins ornée. Généralement ouverte sur les côtés, la dalmatique est ornée sur le devant et le dos de galons verticaux ou de bandes de tissu, appelées clavi. La dalmatique peut avoir un col assorti, amovible : le collet de dalmatique.
TermeAssocie: tunicelle
TermeAssocie: dalmatique de confrérie
TermeAssocie: ornement liturgique catholique
TermeAssocie: dalmaticelle
status: 1

tunicelle
type: Concept
modified: 2014-12-03T14:29:44+01:00
in scheme: Thésaurus de la désignation des objets mobiliers
preferred label: tunicellas @en-us
preferred label: tunicella @it
preferred label: tunicela @pt
broader: vêtement liturgique de dessous
created: 2012-05-16T00:00:00+02:00
related: dalmatique
definition: Vêtement en soie que les dignitaires ecclésiastiques portent sur une aube et sous une dalmaticelle lors des messes solennelles. La tunicelle est sans doublure, à manches plus longues et plus étroites que celles d'une dalmaticelle.
TermeAssocie: dalmatique
status: 1
broad match: http://vocab.getty.edu/aat/300210450
broad match: cb11941484w

dalmatique de confrérie
type: Concept
modified: 2014-12-03T12:41:39+01:00
in scheme: Thésaurus de la désignation des objets mobiliers
preferred label: confraternity dalmatics @en-us
preferred label: dalmatica di confraternita @it
preferred label: dalmática de confraria @pt
broader: autre vêtement catholique
alternative label: tabard
created: 2012-05-16T00:00:00+02:00
related: dalmatique
definition: Dalmatique, portée par les membres importants d'une confrérie, souvent de couleur noire, plus rarement rouge ou bleue, brodée d'une iconographie relative à la confrérie.
TermeAssocie: dalmatique
status: 1

vêtement liturgique de dessus
type: Concept
modified: 2014-12-03T14:30:36+01:00
in scheme: Thésaurus de la désignation des objets mobiliers
preferred label: outer liturgical vestments @en-us
preferred label: sopravvesti liturgiche @it
preferred label: vestes litúrgicas exteriores @pt
narrower: dalmatique
narrower: chasuble
narrower: surplis
narrower: mozette
narrower: chape
narrower: T69-2513
broader: vêtement du culte catholique
alternative label: mantelet
alternative label: falda
alternative label: fanon papal
alternative label: manteau de chœur
alternative label: orfroi
alternative label: mantellone
created: 2012-05-16T00:00:00+02:00
definition: Élément d’habillement porté au-dessus des autres vêtements. Sa forme, son décor, sa couleur, la nature même de l’étoffe ou du tissu, varient selon le rang et la fonction du clerc qui le revêt, et le temps liturgique. Ce type de vêtement comprend généralement des orfrois, bandes de broderies ou de tissu brodé appliqué, souvent en remploi. Il peut également présenter des marques d’appartenance. Lorsque plusieurs de ces éléments forment un ensemble, on parle d’ornement liturgique.
status: 1

ornement liturgique catholique
type: Concept
modified: 2014-10-22T11:05:03+02:00
in scheme: Thésaurus de la désignation des objets mobiliers
broader: textile du culte catholique
created: 2012-05-16T00:00:00+02:00
related: voile huméral
related: dalmatique
related: manipule
related: étole de clerc
related: chasuble
related: chape
related: T69-2214
related: T69-614
definition: Ensemble de vêtements et de linges utilisés pour la liturgie catholique, assortis et de même couleur, comportant généralement une chasuble, une étole, un manipule, un voile de calice et une bourse de corporal, auxquels s'ajoutent éventuellement des chapes, des dalmatiques, parfois un voile huméral, un parement d'autel, etc.
TermeAssocie: voile huméral
TermeAssocie: dalmatique
TermeAssocie: manipule
TermeAssocie: étole de clerc
TermeAssocie: chasuble
TermeAssocie: chape
TermeAssocie: T69-2214
TermeAssocie: T69-614
status: 1

dalmaticelle
type: Concept
modified: 2014-12-03T13:16:14+01:00
in scheme: Thésaurus de la désignation des objets mobiliers
preferred label: dalmaticellas @en-us
preferred label: dalmaticella @it
preferred label: dalmaticela @pt
broader: vêtement liturgique de dessous
created: 2012-05-16T00:00:00+02:00
related: dalmatique
definition: Vêtement de forme semblable à celle d'une dalmatique, que les dignitaires ecclésiastiques portent sous une chasuble ou une chape, sur une aube et une tunicelle, lors des messes solennelles. La dalmaticelle est en soie, sans doublure, généralement pourvue de manches courtes, souvent attachée sous les bras et sur les épaules par des cordons ou des rubans.
TermeAssocie: dalmatique
status: 1
broad match: http://vocab.getty.edu/aat/300210450
broad match: cb11941484w

dalmatique
type: PreferredTerm
modified: 2014-12-03T14:38:26+01:00
created: 2014-01-15T14:54:24+01:00
status: 1

clavi
type: SimpleNonPreferredTerm
modified: 2014-12-03T14:38:26+01:00
created: 2014-01-15T14:54:24+01:00
status: 1

tasse
type: Concept
modified: 2014-12-08T16:12:42+01:00
in scheme: Thésaurus de la désignation des objets mobiliers
preferred label: cups (drinking vessels) @en-us
broader: récipient pour le service et la consommation des boissons
alternative label: tasse à café
alternative label: tasse trompeuse
alternative label: tasse trembleuse
alternative label: tasse-filtre
alternative label: tasse à chocolat
alternative label: tasse de chasse
alternative label: tasse à lait
alternative label: tasse moustache
alternative label: tasse-litron
alternative label: tasse à thé
alternative label: tasse à punch
alternative label: tasse à la reine
alternative label: tasse pour zarph
alternative label: tasse chique
created: 2012-05-16T00:00:00+02:00
related: soucoupe
definition: Récipient individuel pour boire des liquides généralement chauds. La tasse est généralement à fond plat ou sur pied bas et à anse latérale verticale. Elle est souvent complétée par une soucoupe assortie et parfois par un couvercle. Sa désignation peut être liée à son utilisation ou à sa forme.
TermeAssocie: soucoupe
status: 1

tasse de chasse
type: SimpleNonPreferredTerm
modified: 2014-12-08T16:12:42+01:00
created: 2014-01-15T14:54:24+01:00
status: 1

tasse trembleuse
type: SimpleNonPreferredTerm
modified: 2014-12-08T16:12:42+01:00
created: 2014-01-15T14:54:24+01:00
status: 1

tasse à café
type: SimpleNonPreferredTerm
modified: 2014-12-08T16:12:42+01:00
created: 2014-01-15T14:54:24+01:00
status: 1

tasse moustache
type: SimpleNonPreferredTerm
modified: 2014-12-08T16:12:42+01:00
created: 2014-01-15T14:54:24+01:00
status: 1

tasse à chocolat
type: SimpleNonPreferredTerm
modified: 2014-12-08T16:12:42+01:00
created: 2014-01-15T14:54:24+01:00
status: 1

tasse chique
type: SimpleNonPreferredTerm
modified: 2014-12-08T16:12:42+01:00
created: 2014-01-15T14:54:24+01:00
status: 1

tasse-filtre
type: SimpleNonPreferredTerm
modified: 2014-12-08T16:12:42+01:00
created: 2014-01-15T14:54:24+01:00
status: 1

tasse trompeuse
type: SimpleNonPreferredTerm
modified: 2014-12-08T16:12:42+01:00
created: 2014-01-15T14:54:24+01:00
status: 1

tasse-litron
type: SimpleNonPreferredTerm
modified: 2014-12-08T16:12:42+01:00
created: 2014-01-15T14:54:24+01:00
status: 1

tasse
type: PreferredTerm
modified: 2014-12-08T16:12:42+01:00
created: 2014-01-15T14:54:24+01:00
status: 1

tasse à punch
type: SimpleNonPreferredTerm
modified: 2014-12-08T16:12:42+01:00
created: 2014-01-15T14:54:24+01:00
status: 1

tasse pour zarph
type: SimpleNonPreferredTerm
modified: 2014-12-08T16:12:42+01:00
created: 2014-01-15T14:54:24+01:00
status: 1

tasse à lait
type: SimpleNonPreferredTerm
modified: 2014-12-08T16:12:42+01:00
created: 2014-01-15T14:54:24+01:00
status: 1

tasse à thé
type: SimpleNonPreferredTerm
modified: 2014-12-08T16:12:42+01:00
created: 2014-01-15T14:54:24+01:00
status: 1

tasse à la reine
type: SimpleNonPreferredTerm
modified: 2014-12-08T16:12:42+01:00
created: 2014-01-15T14:54:24+01:00
status: 1

acrotère
type: PreferredTerm
modified: 2015-01-07T15:13:45+01:00
created: 2014-01-15T14:54:24+01:00
status: 1

machine à broder
type: Concept
modified: 2013-12-05T00:00:00+01:00
in scheme: Thésaurus de la désignation des objets mobiliers
broader: machine à donner un aspect
alternative label: brodeuse mécanique
alternative label: métier à broder Suisse
alternative label: métier à broder à fil continu
alternative label: métier à broder automatique
created: 2012-05-16T00:00:00+02:00
related: métier à broder domestique
definition: Machine à orner une étoffe de dessins en relief, réalisés à l'aiguille.
TermeAssocie: métier à broder domestique
status: 1

machine à broder
type: PreferredTerm
modified: 2014-01-10T00:00:00+01:00
created: 2014-01-15T14:54:24+01:00
status: 1

métier à broder Suisse
type: SimpleNonPreferredTerm
modified: 2014-01-10T00:00:00+01:00
created: 2014-01-15T14:54:24+01:00
status: 1

métier à broder domestique
type: Concept
modified: 2014-12-10T14:32:40+01:00
in scheme: Thésaurus de la désignation des objets mobiliers
preferred label: embroidery frames @en-us
broader: objet ou matériel pour les ouvrages textiles
alternative label: métier à broder sur pieds
alternative label: poinçon de brodeuse
alternative label: tambour à broder
alternative label: métier à châssis
alternative label: métier à broder à poser
alternative label: poinçon à broder
alternative label: métier à tambour
alternative label: métier à broder les gants
created: 2012-05-16T00:00:00+02:00
related: machine à broder
definition: Support généralement en bois pour tendre le tissu à broder. Le métier (à tambour ou châssis) est posé sur des pieds ; le tambour à broder est tenu à la main.
TermeAssocie: machine à broder
status: 1
broad match: http://vocab.getty.edu/aat/300163224
broad match: http://data.bnf.fr/ark:/12148/cb119400073

métier à broder à fil continu
type: SimpleNonPreferredTerm
modified: 2014-01-10T00:00:00+01:00
created: 2014-01-15T14:54:24+01:00
status: 1

brodeuse mécanique
type: SimpleNonPreferredTerm
modified: 2014-01-10T00:00:00+01:00
created: 2014-01-15T14:54:24+01:00
status: 1

métier à broder automatique
type: SimpleNonPreferredTerm
modified: 2014-01-10T00:00:00+01:00
created: 2014-01-15T14:54:24+01:00
status: 1

vêtement liturgique de dessous
type: Concept
modified: 2014-12-03T13:09:53+01:00
in scheme: Thésaurus de la désignation des objets mobiliers
preferred label: liturgical undergarments @en-us
preferred label: sottovesti liturgiche @it
preferred label: vestes litúrgicas interiores @pt
narrower: soutane
narrower: tunicelle
narrower: dalmaticelle
narrower: T69-2471
narrower: T69-2466
narrower: T69-2463
broader: vêtement du culte catholique
created: 2012-05-16T00:00:00+02:00
definition: Élément d’habillement, généralement en coton, lin ou chanvre, orné de dentelles ou de broderies et porté par le clerc en dessous des autres vêtements.
status: 1

vêtement du culte catholique
type: PreferredTerm
modified: 2014-10-22T11:06:47+02:00
created: 2014-01-15T14:54:24+01:00
status: 1

textile du culte catholique
type: Concept
modified: 2014-10-21T15:49:38+02:00
in scheme: Thésaurus de la désignation des objets mobiliers
narrower: linge ou garniture du culte catholique
narrower: vêtement du culte catholique
narrower: ornement liturgique catholique
broader: textile religieux
created: 2013-12-05T00:00:00+01:00
status: 1

accessoire du costume liturgique des clercs
type: Concept
modified: 2014-12-03T11:28:16+01:00
in scheme: Thésaurus de la désignation des objets mobiliers
preferred label: accessori delle vesti e dei paramenti liturgici @it
preferred label: accessories for liturgical habits and vestments @en-us
preferred label: acessórios das vestes e paramentos litúrgicos @pt
narrower: voile huméral
narrower: gants pontificaux
narrower: manipule
narrower: étole de clerc
narrower: ceinture de vêtement liturgique
narrower: rabat
narrower: pallium
narrower: colletin
narrower: collet de dalmatique
narrower: aumusse
broader: vêtement du culte catholique
alternative label: cordon de croix pectorale
alternative label: rational
created: 2012-05-16T00:00:00+02:00
definition: Pièce textile de petites dimensions accompagnant le vêtement des clercs et la plupart du temps assorti à celui-ci. Elle fait partie de l’ornement liturgique.
status: 1

placard chauffant
type: PreferredTerm
modified: 2014-12-05T10:59:28+01:00
created: 2014-01-15T14:54:24+01:00
status: 1

bonheur du jour
type: Concept
modified: 2014-12-05T13:50:17+01:00
in scheme: Thésaurus de la désignation des objets mobiliers
preferred label: bonheurs-du-jour @en-us
broader: table pour le bureau ou les loisirs
created: 2012-05-16T00:00:00+02:00
definition: Petite table à écrire, rectangulaire ou ovale, dont l'écritoire est constituée par une tablette tirante et dont le dessus comporte un gradin. Ce meuble peut comporter une tablette d'entrejambe, souvent échancrée, ou un corps inférieur à battants.
status: 1

bonheur du jour
type: PreferredTerm
modified: 2014-12-05T13:50:17+01:00
created: 2014-01-15T14:54:24+01:00
status: 1

écran à feu
type: PreferredTerm
modified: 2014-12-04T15:15:33+01:00
created: 2014-01-15T14:54:24+01:00
status: 1

écran à main
type: Concept
modified: 2014-12-05T14:43:12+01:00
in scheme: Thésaurus de la désignation des objets mobiliers
broader: objet d'âtre
created: 2012-05-16T00:00:00+02:00
related: garniture de meuble
related: écran à feu
definition: Petite plaque munie d'un manche, que l'on tient à la main pour se protéger le visage de la chaleur.
TermeAssocie: garniture de meuble
TermeAssocie: écran à feu
status: 1

machine à décaper
type: PreferredTerm
modified: 2015-10-15T12:00:08+02:00
created: 2014-01-15T14:54:24+01:00
status: 1

ciboire-chrismatoire
type: Concept
modified: 2014-11-27T14:46:26+01:00
in scheme: Thésaurus de la désignation des objets mobiliers
preferred label: pyxes-chrism stocks @en-us
preferred label: pisside-crismatorio @it
preferred label: âmbula-crismatória @pt
broader: ciboire
created: 2012-05-16T00:00:00+02:00
related: ampoule à huile des malades
definition: Ciboire des malades dont la tige, démontable, sert d'ampoule à huile des malades.
TermeAssocie: ampoule à huile des malades
status: 1
broad match: cb11936841q

ciboire-chrismatoire
type: PreferredTerm
modified: 2014-11-27T14:46:26+01:00
created: 2014-01-15T14:54:24+01:00
status: 1

objet lié aux fêtes liturgiques
type: Concept
modified: 2014-01-10T00:00:00+01:00
in scheme: Thésaurus de la désignation des objets mobiliers
narrower: objet lié à Pourim
narrower: objet lié à la fête de Hanouca
narrower: objet lié à la fête des Cabanes
narrower: objet lié à la fête de la Pâque
broader: objet lié au culte domestique
created: 2012-05-16T00:00:00+02:00
status: 1

objet lié au culte domestique
type: Concept
modified: 2014-01-10T00:00:00+01:00
in scheme: Thésaurus de la désignation des objets mobiliers
narrower: objet lié au Shabbat
narrower: objet lié à la prière
narrower: objet lié aux fêtes liturgiques
narrower: objet lié à la vie sociale
narrower: objet lié aux cycles de la vie
narrower: objet lié à la vie communautaire
broader: objet de la religion juive
created: 2012-05-16T00:00:00+02:00
status: 1

objet lié à Pourim
type: Concept
modified: 2014-01-10T00:00:00+01:00
in scheme: Thésaurus de la désignation des objets mobiliers
narrower: rouleau pour la fête d'Esther
narrower: plat de la fête d'Esther
narrower: T69-1997
narrower: T69-1999
broader: objet lié aux fêtes liturgiques
alternative label: objet lié à la fête d'Esther
alternative label: objet lié à la fête des Sorts
created: 2012-05-16T00:00:00+02:00
status: 1

objet lié aux fêtes liturgiques
type: PreferredTerm
modified: 2014-01-10T00:00:00+01:00
created: 2014-01-15T14:54:24+01:00
status: 1

objet lié à la fête de Hanouca
type: Concept
modified: 2014-01-10T00:00:00+01:00
in scheme: Thésaurus de la désignation des objets mobiliers
narrower: chandelier de Hanouca
narrower: toupie de Hanouca
narrower: lampe de Hanouca
broader: objet lié aux fêtes liturgiques
alternative label: objet lié à la fête de l'Inauguration
alternative label: objet lié à la fête des lumières
alternative label: objet lié à Hanoukkah
alternative label: objet lié à la fête de la Reconsécration
created: 2012-05-16T00:00:00+02:00
status: 1

objet lié à la fête des Cabanes
type: Concept
modified: 2014-01-10T00:00:00+01:00
in scheme: Thésaurus de la désignation des objets mobiliers
narrower: boîte à cédrat
broader: objet lié aux fêtes liturgiques
alternative label: objet lié à la fête des Tabernacles
alternative label: objet lié à Soukkot
created: 2012-05-16T00:00:00+02:00
status: 1

objet lié à la fête de la Pâque
type: Concept
modified: 2014-01-10T00:00:00+01:00
in scheme: Thésaurus de la désignation des objets mobiliers
narrower: calendrier pour le décompte de l''Omer
narrower: aiguière et bassin de la Pâque
narrower: coupe de sanctification de la Pâque
narrower: plat de la Pâque
narrower: coupe du prophète Elie
broader: objet lié aux fêtes liturgiques
alternative label: objet lié à Pessa'h
created: 2012-05-16T00:00:00+02:00
status: 1

mobilier de jardin
type: Concept
modified: 2015-02-24T10:50:43+01:00
in scheme: Thésaurus de la désignation des objets mobiliers
preferred label: garden furniture @en-us
broader: édicule et mobilier de jardin
alternative label: table de jardin
alternative label: éclairage de jardin
created: 2012-06-11T00:00:00+02:00
definition: Mobilier spécifiquement destiné aux espaces verts publics ou privés.
status: 1

mobilier de jardin
type: PreferredTerm
modified: 2015-02-24T10:50:43+01:00
created: 2014-01-15T14:54:24+01:00
status: 1

éclairage de jardin
type: SimpleNonPreferredTerm
modified: 2015-02-24T10:50:43+01:00
created: 2014-01-15T14:54:24+01:00
status: 1

table de jardin
type: SimpleNonPreferredTerm
modified: 2015-02-24T10:50:43+01:00
created: 2014-01-15T14:54:24+01:00
status: 1

jeton
type: Concept
modified: 2014-12-30T12:34:35+01:00
in scheme: Thésaurus de la désignation des objets mobiliers
preferred label: tokens (exchange media) @en-us
broader: élément de numismatique
alternative label: méreau
created: 2013-11-29T00:00:00+01:00
related: accessoire de jeu de société
definition: Pièce plate, le plus souvent ronde, parfois trouée en son centre, utilisée pour compter ou pour attester d'une présence.
TermeAssocie: accessoire de jeu de société
status: 1

bijouterie et orfèvrerie civiles, monnaie, médaille
type: Concept
modified: 2013-11-29T00:00:00+01:00
in scheme: Thésaurus de la désignation des objets mobiliers
narrower: bijou
narrower: élément de numismatique
narrower: emblème de pouvoir
narrower: décoration ou insigne civil ou militaire
narrower: marque d'appartenance ou d'autorité
broader: dénomination provisoire
created: 2013-11-29T00:00:00+01:00
related: camée
related: intaille
related: accessoire de l'habillement
related: T69-6512
TermeAssocie: camée
TermeAssocie: intaille
TermeAssocie: accessoire de l'habillement
TermeAssocie: T69-6512
status: 1

élément de numismatique
type: PreferredTerm
modified: 2014-12-30T12:39:17+01:00
created: 2014-01-15T14:54:24+01:00
status: 1

médaille
type: Concept
modified: 2014-12-30T12:36:25+01:00
in scheme: Thésaurus de la désignation des objets mobiliers
preferred label: medals @en-us
broader: élément de numismatique
alternative label: médaillon
created: 2013-07-19T00:00:00+02:00
related: relief
definition: <!--[if gte mso 9]> <o:OfficeDocumentSettings> <o:AllowPNG/> </o:OfficeDocumentSettings> <![endif]-->Pièce fabriquée en l'honneur d'un personnage illustre, dont elle porte l'effigie, ou en souvenir d'un événement, d'une action mémorable, d'un lieu, etc.
TermeAssocie: relief
status: 1

machine à enregistrer
type: Concept
modified: 2015-10-14T17:49:17+02:00
in scheme: Thésaurus de la désignation des objets mobiliers
narrower: machine à restituer
broader: machine à mettre en état
alternative label: pointeuse
alternative label: enregistreur
created: 2013-10-01T00:00:00+02:00
related: appareil d'enregistrement
definition: Machine à recueillir des informations de sources diverses sur un support donné (carte perforée, cylindre, roue dentée, disque, support magnétique, photographique, numérique, etc.) pour les conserver, les exploiter, les reproduire, etc.
TermeAssocie: appareil d'enregistrement
status: 1
narrow match: cb15707947w
narrow match: Pointeuse

appareil d'enregistrement
type: Concept
modified: 2014-01-10T00:00:00+01:00
in scheme: Thésaurus de la désignation des objets mobiliers
broader: appareil d'enregistrement ou de restitution
alternative label: caméra
alternative label: appareil photographique
alternative label: appareil de prise de vue
created: 2012-05-16T00:00:00+02:00
related: machine à enregistrer
TermeAssocie: machine à enregistrer
status: 1

machine à enregistrer
type: PreferredTerm
modified: 2015-10-14T17:49:17+02:00
created: 2014-01-15T14:54:24+01:00
status: 1

enregistreur
type: SimpleNonPreferredTerm
modified: 2015-10-14T17:49:17+02:00
created: 2014-01-15T14:54:24+01:00
status: 1

pointeuse
type: SimpleNonPreferredTerm
modified: 2015-10-14T17:49:17+02:00
created: 2014-01-15T14:54:24+01:00
status: 1

pompe de fontainerie
type: Concept
modified: 2015-02-24T15:43:30+01:00
in scheme: Thésaurus de la désignation des objets mobiliers
preferred label: fountain pumps @en-us
broader: ouvrage lié à l'alimentation en eau
alternative label: pompe à eau
created: 2013-12-09T00:00:00+01:00
related: machine à pomper
definition: Dispositif, le plus souvent manuel, dont on se sert pour puiser l'eau, l'élever et la distribuer.
TermeAssocie: machine à pomper
status: 1
broad match: http://vocab.getty.edu/aat/300024787

ouvrage lié à l'alimentation en eau
type: Concept
modified: 2014-10-15T17:22:31+02:00
in scheme: Thésaurus de la désignation des objets mobiliers
preferred label: water distribution structures @en-us
narrower: pompe de fontainerie
narrower: puits
narrower: T69-506
narrower: T69-503
broader: mobilier monumental ou de l'espace extérieur
created: 2012-05-16T00:00:00+02:00
definition: Aménagement ou mobilier permettant de recueillir ou de faire circuler l’eau.
status: 1
broad match: Adduction d'eau

machine à pomper
type: Concept
modified: 2015-10-14T14:59:45+02:00
in scheme: Thésaurus de la désignation des objets mobiliers
broader: machine à entraîner mécaniquement
alternative label: pompe centrifuge
alternative label: pompe rotative
alternative label: pompe
alternative label: bélier hydraulique
created: 2012-05-16T00:00:00+02:00
related: pompe de fontainerie
related: véhicule de lutte contre l'incendie
definition: Machine à entraîner mécaniquement un fluide par aspiration et refoulement grâce à la pression.
TermeAssocie: pompe de fontainerie
TermeAssocie: véhicule de lutte contre l'incendie
status: 1
narrow match: http://data.bnf.fr/ark:/12148/cb119787961
narrow match: Pompe centrifuge

pompe à eau
type: SimpleNonPreferredTerm
modified: 2015-02-24T15:43:30+01:00
created: 2014-01-15T14:54:24+01:00
status: 1

pompe de fontainerie
type: PreferredTerm
modified: 2015-02-24T15:43:30+01:00
created: 2014-01-15T14:54:24+01:00
status: 1

plafond
type: Concept
modified: 2015-01-07T12:39:28+01:00
in scheme: Thésaurus de la désignation des objets mobiliers
preferred label: ceilings @en-us
broader: couvrement
created: 2012-05-16T00:00:00+02:00
scope note: Voir aussi le Thesaurus de la désignation des œuvres architecturales et des espaces aménagés.
definition: Face intérieure plane et dégagée d'un plancher, d'une voûte plate ou d'une voûte déprimée, formant couvrement. La surface horizontale du plafond peut être raccordée aux murs par un adoucissement qui fait partie du plafond.
status: 1

plafond
type: PreferredTerm
modified: 2015-01-07T12:39:28+01:00
created: 2014-01-15T14:54:24+01:00
status: 1

bordure de toit
type: Concept
modified: 2014-10-15T14:14:55+02:00
in scheme: Thésaurus de la désignation des objets mobiliers
preferred label: fascia boards @en-us
broader: couverture ou accessoire du toit
created: 2012-05-16T00:00:00+02:00
definition: Frise de bois ou de métal découpé destinée à protéger et à orner le bord de la toiture.
status: 1
broad match: http://data.bnf.fr/ark:/12148/cb16217091c

bordure de toit
type: PreferredTerm
modified: 2014-10-15T14:14:55+02:00
created: 2014-01-15T14:54:24+01:00
status: 1

fontaine d'ablutions
type: Concept
modified: 2014-01-10T00:00:00+01:00
in scheme: Thésaurus de la désignation des objets mobiliers
broader: meuble du culte synagogal
alternative label: fontaine rituelle
alternative label: fontaine de synagogue
created: 2012-05-16T00:00:00+02:00
definition: Fontaine ou lavabo situé dans le vestibule de nombreuses synagogues afin que l'on puisse se laver les mains avant d'entrer dans le lieu de culte. En terre d'Islam, et par mimétisme avec la religion musulmane, on s'y lave parfois les pieds et les mains.
status: 1

fontaine d'ablutions
type: PreferredTerm
modified: 2014-01-10T00:00:00+01:00
created: 2014-01-15T14:54:24+01:00
status: 1

fontaine rituelle
type: SimpleNonPreferredTerm
modified: 2014-01-10T00:00:00+01:00
created: 2014-01-15T14:54:24+01:00
status: 1

fontaine de synagogue
type: SimpleNonPreferredTerm
modified: 2014-01-10T00:00:00+01:00
created: 2014-01-15T14:54:24+01:00
status: 1

bandelette de Torah
type: Concept
modified: 2014-01-10T00:00:00+01:00
in scheme: Thésaurus de la désignation des objets mobiliers
broader: linge et garniture liés au culte synagogal
alternative label: mappah
created: 2012-05-16T00:00:00+02:00
definition: Bandelette (pluriel : mappot) en lin ou coton qui sert à attacher le rouleau de Torah pour le maintenir fermé. Les mappot sont brodées d'une inscription précisant le plus souvent le nom du donateur ; des motifs floraux, parfois des personnages, constituent leur iconographie. Les mappot (langes en hébreu) sont souvent confectionnés dans les langes de circoncision (wimpel en yiddish) et on y inscrivait le nom de l'enfant et sa date de naissance.
status: 1

mappah
type: SimpleNonPreferredTerm
modified: 2014-01-10T00:00:00+01:00
created: 2014-01-15T14:54:24+01:00
status: 1

bandelette de Torah
type: PreferredTerm
modified: 2014-01-10T00:00:00+01:00
created: 2014-01-15T14:54:24+01:00
status: 1

veste
type: Concept
modified: 2014-12-11T16:50:11+01:00
in scheme: Thésaurus de la désignation des objets mobiliers
preferred label: jackets @en-us
broader: vêtement d'intérieur ou d'extérieur
alternative label: veston
alternative label: frac
alternative label: redingote
alternative label: habit
created: 2012-05-16T00:00:00+02:00
definition: Vêtement à manches longues couvrant la partie supérieure du corps qui s'ouvre sur le devant et ne descend pas plus bas que les hanches. La veste se porte sur la chemise ou le corsage et sous le manteau, en hiver.
status: 1

veston
type: SimpleNonPreferredTerm
modified: 2014-12-11T16:50:11+01:00
created: 2014-01-15T14:54:24+01:00
status: 1

habit
type: SimpleNonPreferredTerm
modified: 2014-12-11T16:50:11+01:00
created: 2014-01-15T14:54:24+01:00
status: 1

redingote
type: SimpleNonPreferredTerm
modified: 2014-12-11T16:50:11+01:00
created: 2014-01-15T14:54:24+01:00
status: 1

veste
type: PreferredTerm
modified: 2014-12-11T16:50:11+01:00
created: 2014-01-15T14:54:24+01:00
status: 1

vêtement d'intérieur ou d'extérieur
type: Concept
modified: 2014-10-20T10:45:44+02:00
in scheme: Thésaurus de la désignation des objets mobiliers
preferred label: main garments @en-us
narrower: veste
narrower: blouse
narrower: gilet
narrower: jupe
narrower: cravate
narrower: pantalon
narrower: robe
narrower: T69-6480
narrower: T69-9253
narrower: T69-6474
broader: costume civil, professionnel ou militaire
alternative label: plastron
alternative label: barboteuse
alternative label: bustier
alternative label: fichu
alternative label: épaulettes
alternative label: guimpe
alternative label: tunique
alternative label: pagne
alternative label: brassière
alternative label: livrée
alternative label: justaucorps
alternative label: short
alternative label: lange de nourrisson
alternative label: foulard
created: 2012-05-16T00:00:00+02:00
definition: Vêtement qui se porte à l'intérieur de la maison mais avec lequel on peut sortir et se montrer en public sans le cacher par d'autres vêtements.
status: 1

frac
type: SimpleNonPreferredTerm
modified: 2014-12-11T16:50:11+01:00
created: 2014-01-15T14:54:24+01:00
status: 1

dalmatique de confrérie
type: PreferredTerm
modified: 2014-12-03T12:41:39+01:00
created: 2014-01-15T14:54:24+01:00
status: 1

tabard
type: SimpleNonPreferredTerm
modified: 2014-12-03T12:41:39+01:00
created: 2014-01-15T14:54:24+01:00
status: 1

cor à pistons
type: Concept
modified: 2014-10-10T12:00:26+02:00
in scheme: Thésaurus de la désignation des objets mobiliers
preferred label: French horns @en-us
broader: trompette chromatique
alternative label: cor d'harmonie
created: 2012-05-16T00:00:00+02:00
definition: Instrument constitué d'un tuyau en cuivre, enroulé sur lui-même comme le cor et muni de pistons.
status: 1

cor à pistons
type: PreferredTerm
modified: 2014-10-10T12:00:26+02:00
created: 2014-01-15T14:54:24+01:00
status: 1

cor d'harmonie
type: SimpleNonPreferredTerm
modified: 2014-10-10T12:00:26+02:00
created: 2014-01-15T14:54:24+01:00
status: 1

trompette chromatique
type: Concept
modified: 2014-10-10T12:11:03+02:00
in scheme: Thésaurus de la désignation des objets mobiliers
narrower: cor à pistons
narrower: cornet à bouquin
narrower: ophicléide
narrower: trombone
narrower: trompette
narrower: cornet à pistons
narrower: tuba
broader: aérophone à bouche
alternative label: saxhorn
created: 2012-05-16T00:00:00+02:00
definition: Instrument à vent dont le corps sonore est mis en vibration par l'envoi d'un flux d'air dans l'embouchure. Il est muni d'un système de chromatisation (trous, pistons, clés ou coulisse) permettant d'introduire des notes intermédiaires (demi-tons), aux cinq tons de l'échelle diatonique.
status: 1

machine à imprimer en linotype
type: Concept
modified: 2015-10-15T10:56:38+02:00
in scheme: Thésaurus de la désignation des objets mobiliers
broader: machine à imprimer à encre liquide
alternative label: linotype
created: 2013-09-25T00:00:00+02:00
definition: Machine à imprimer permettant, par une succession d'opérations (composition, fonte et distribution), de former une ligne de texte complète en un seul bloc de plomb.
status: 1

linotype
type: SimpleNonPreferredTerm
modified: 2015-10-15T10:56:38+02:00
created: 2014-01-15T14:54:24+01:00
status: 1

machine à imprimer en linotype
type: PreferredTerm
modified: 2015-10-15T10:56:38+02:00
created: 2014-01-15T14:54:24+01:00
status: 1

machine à imprimer à encre liquide
type: Concept
modified: 2015-10-15T10:49:19+02:00
in scheme: Thésaurus de la désignation des objets mobiliers
narrower: machine à imprimer en linotype
narrower: T69-5835
narrower: T69-5837
narrower: T69-5831
narrower: T69-5833
narrower: T69-5829
broader: machine à imprimer
alternative label: presse lithographique à plat
alternative label: presse lithographique
created: 2012-05-16T00:00:00+02:00
definition: Machine à imprimer par pression à l'aide d'une forme encrée.
status: 1
narrow match: Presse lithographique
narrow match: http://vocab.getty.edu/aat/300022767

porte-bouquet d'autel
type: PreferredTerm
modified: 2014-11-27T13:16:40+01:00
created: 2014-01-15T14:54:24+01:00
status: 1

décapotable
type: Concept
modified: 2014-12-30T10:34:02+01:00
in scheme: Thésaurus de la désignation des objets mobiliers
preferred label: convertibles @en-us
broader: voiture automobile
alternative label: cabriolet
created: 2013-11-06T00:00:00+01:00
definition: Voiture automobile dotée d'une couverture (la capote) escamotable.
status: 1

décapotable
type: PreferredTerm
modified: 2014-12-30T10:34:02+01:00
created: 2014-01-15T14:54:24+01:00
status: 1

cabriolet
type: SimpleNonPreferredTerm
modified: 2014-12-30T10:34:02+01:00
created: 2014-01-15T14:54:24+01:00
status: 1

décoration ou insigne civil ou militaire
type: Concept
modified: 2014-12-30T12:33:50+01:00
in scheme: Thésaurus de la désignation des objets mobiliers
broader: bijouterie et orfèvrerie civiles, monnaie, médaille
created: 2014-01-10T00:00:00+01:00
related: vêtement spécifique de militaire
related: vêtement spécifique lié à une fonction civile
TermeAssocie: vêtement spécifique de militaire
TermeAssocie: vêtement spécifique lié à une fonction civile
status: 1

vêtement spécifique de militaire
type: Concept
modified: 2014-12-11T17:02:48+01:00
in scheme: Thésaurus de la désignation des objets mobiliers
preferred label: military uniforms @en-us
broader: costume civil, professionnel ou militaire
alternative label: uniforme militaire
created: 2013-11-13T00:00:00+01:00
related: armement
related: arme défensive
related: décoration ou insigne civil ou militaire
related: protection NBC
definition: Vêtement ou ensemble de pièces, de coupe et de couleur réglementaires imposés pour exercer des fonctions ou activités militaires.
TermeAssocie: armement
TermeAssocie: arme défensive
TermeAssocie: décoration ou insigne civil ou militaire
TermeAssocie: protection NBC
status: 1

vêtement spécifique lié à une fonction civile
type: Concept
modified: 2014-12-12T10:29:23+01:00
in scheme: Thésaurus de la désignation des objets mobiliers
broader: costume civil, professionnel ou militaire
alternative label: tablier maçonnique
alternative label: tenue d'infirmière
alternative label: brassard de la croix rouge
alternative label: uniforme civil
alternative label: équipement de pompier
alternative label: tenue de police
created: 2013-11-14T00:00:00+01:00
related: décoration ou insigne civil ou militaire
definition: Vêtement ou ensemble de pièces, de coupe et de couleur organisés, utilisés (parfois imposés) dans certaines professions, dans l'exercice de certaines fonctions ou activités de la vie civile.
TermeAssocie: décoration ou insigne civil ou militaire
status: 1
broad match: http://vocab.getty.edu/aat/300212393

décoration ou insigne civil ou militaire
type: PreferredTerm
modified: 2014-12-30T12:33:50+01:00
created: 2014-01-15T14:54:24+01:00
status: 1

mouchettes
type: Concept
modified: 2014-12-05T14:32:41+01:00
in scheme: Thésaurus de la désignation des objets mobiliers
broader: instrument ou accessoire pour l'éclairage
alternative label: ciseaux à moucher
alternative label: coupe-mèche
alternative label: mouchettes de voyage
alternative label: ciseau à mèches
created: 2012-05-16T00:00:00+02:00
definition: Ciseaux, dont les branches sont munies de petites cavités, utilisés pour écraser la mèche de la bougie afin de l'éteindre et de recueillir sa partie carbonisée. Les mouchettes sont généralement placées sur un support, un plateau ou dans un étui.
status: 1
broad match: http://data.bnf.fr/ark:/12148/cb11966814f

mouchettes de voyage
type: SimpleNonPreferredTerm
modified: 2014-12-05T14:32:41+01:00
created: 2014-01-15T14:54:24+01:00
status: 1

ciseau à mèches
type: SimpleNonPreferredTerm
modified: 2014-12-05T14:32:41+01:00
created: 2014-01-15T14:54:24+01:00
status: 1

instrument ou accessoire pour l'éclairage
type: Concept
modified: 2014-10-16T12:06:35+02:00
in scheme: Thésaurus de la désignation des objets mobiliers
preferred label: lighting devices @en-us
narrower: mouchettes
narrower: lampe
narrower: globe
narrower: abat-jour
narrower: éteignoir
narrower: écran de lumière
narrower: pendeloques
narrower: bougeoir
narrower: chandelier
narrower: cheminée de lampe
narrower: porte-lampe
narrower: porte-chandelle
narrower: allumoir
narrower: lanterne
narrower: versoir
narrower: porte-pain de chandelle
narrower: boîte à bougies
narrower: pied de lampe
narrower: tire-mèche
narrower: réflecteur
broader: objet civil domestique
alternative label: pelle à suif
alternative label: seau à mèche
created: 2012-05-16T00:00:00+02:00
definition: Instrument ou accessoire lié à l'éclairage.
status: 1

mouchettes
type: PreferredTerm
modified: 2014-12-05T14:32:41+01:00
created: 2014-01-15T14:54:24+01:00
status: 1

coupe-mèche
type: SimpleNonPreferredTerm
modified: 2014-12-05T14:32:41+01:00
created: 2014-01-15T14:54:24+01:00
status: 1

ciseaux à moucher
type: SimpleNonPreferredTerm
modified: 2014-12-05T14:32:41+01:00
created: 2014-01-15T14:54:24+01:00
status: 1

objet de dévotion sous globe
type: Concept
modified: 2014-11-26T16:34:17+01:00
in scheme: Thésaurus de la désignation des objets mobiliers
preferred label: bell jar devotional objects @en-us
preferred label: oggetto devozionale sotto campana di vetro @it
preferred label: objecto devocional sob redoma @pt
broader: objet de dévotion
created: 2012-05-16T00:00:00+02:00
definition: Objet de dévotion en trois dimensions, placé sous un globe de verre. Il s’agit souvent d’une statuette.
status: 1
broad match: cb12233110q
broad match: Dévotions catholiques

objet de dévotion sous globe
type: PreferredTerm
modified: 2014-11-26T16:34:17+01:00
created: 2014-01-15T14:54:24+01:00
status: 1

couronne funéraire
type: SimpleNonPreferredTerm
modified: 2014-11-27T10:59:47+01:00
created: 2014-01-15T14:54:24+01:00
status: 1

couronne mortuaire
type: PreferredTerm
modified: 2014-11-27T10:59:47+01:00
created: 2014-01-15T14:54:24+01:00
status: 1

glaive
type: Concept
modified: 2014-12-12T14:58:36+01:00
in scheme: Thésaurus de la désignation des objets mobiliers
preferred label: gladii @en-us
broader: arme blanche
created: 2012-05-16T00:00:00+02:00
definition: Arme blanche à lame large, assez courte, à deux tranchants séparés par une nervure, emmanchée dans une poignée qui est rarement munie d'une garde. Le glaive s'apparente à une courte épée.
status: 1
broad match: http://data.bnf.fr/ark:/12148/cb119427828

glaive
type: PreferredTerm
modified: 2014-12-12T14:58:36+01:00
created: 2014-01-15T14:54:24+01:00
status: 1

cage à oiseaux
type: SimpleNonPreferredTerm
modified: 2014-12-05T11:13:49+01:00
created: 2014-01-15T14:54:24+01:00
status: 1

meuble pour animal familier
type: PreferredTerm
modified: 2014-12-05T11:13:49+01:00
created: 2014-01-15T14:54:24+01:00
status: 1

niche à chien
type: SimpleNonPreferredTerm
modified: 2014-12-05T11:13:49+01:00
created: 2014-01-15T14:54:24+01:00
status: 1

porte-aquarium
type: SimpleNonPreferredTerm
modified: 2014-12-05T11:13:49+01:00
created: 2014-01-15T14:54:24+01:00
status: 1

perchoir d'intérieur
type: SimpleNonPreferredTerm
modified: 2014-12-05T11:13:49+01:00
created: 2014-01-15T14:54:24+01:00
status: 1

aquarium
type: SimpleNonPreferredTerm
modified: 2014-12-05T11:13:49+01:00
created: 2014-01-15T14:54:24+01:00
status: 1

porte-cage
type: SimpleNonPreferredTerm
modified: 2014-12-05T11:13:49+01:00
created: 2014-01-15T14:54:24+01:00
status: 1

machine à restituer
type: Concept
modified: 2015-09-24T17:39:58+02:00
in scheme: Thésaurus de la désignation des objets mobiliers
broader: machine à enregistrer
created: 2013-10-01T00:00:00+02:00
related: appareil de restitution
definition: Machine à lire des informations enregistrées sur un support quelconque afin de permettre leur exploitation par d'autres machines.
TermeAssocie: appareil de restitution
status: 1

appareil de restitution
type: Concept
modified: 2014-01-10T00:00:00+01:00
in scheme: Thésaurus de la désignation des objets mobiliers
broader: appareil d'enregistrement ou de restitution
alternative label: appareil de projection
alternative label: stéréoscope
alternative label: récepteur TSF
alternative label: électrophone
alternative label: télévision
alternative label: récepteur radio
created: 2012-05-16T00:00:00+02:00
related: machine à restituer
TermeAssocie: machine à restituer
status: 1

machine à restituer
type: PreferredTerm
modified: 2015-09-24T17:39:58+02:00
created: 2014-01-15T14:54:24+01:00
status: 1

clôture de chapelle
type: Concept
modified: 2014-12-01T14:35:23+01:00
in scheme: Thésaurus de la désignation des objets mobiliers
preferred label: parcloses @en-us
preferred label: recinzione di cappella @it
preferred label: grade de capela @pt
broader: clôture et séparation interne d'une église
created: 2012-05-16T00:00:00+02:00
definition: Séparation comportant une porte et permettant d'isoler une chapelle du reste de l'église. Sa partie supérieure peut servir de table de communion.
status: 1

clôture et séparation interne d'une église
type: Concept
modified: 2014-12-01T14:26:08+01:00
in scheme: Thésaurus de la désignation des objets mobiliers
preferred label: church screens and enclosures @en-us
preferred label: recinti e separazioni interne di chiesa @it
preferred label: divisorias do espaço interno da igreja @pt
narrower: clôture de chapelle
narrower: clôture de monument funéraire
narrower: clôture des fonts baptismaux
narrower: clôture de confession
narrower: clôture d'autel
narrower: clôture de dévotion
narrower: clôture de choeur conventuel
narrower: poutre de gloire
narrower: clôture de choeur
narrower: clôture de chaire à prêcher
broader: meuble du culte catholique
alternative label: clôture liturgique
created: 2012-05-16T00:00:00+02:00
related: clôture
definition: Elément vertical, à l’intérieur d’une église, séparant deux espaces aux fonctions différentes.
TermeAssocie: clôture
status: 1
broad match: http://vocab.getty.edu/aat/300003724

clôture de chapelle
type: PreferredTerm
modified: 2014-12-01T14:35:23+01:00
created: 2014-01-15T14:54:24+01:00
status: 1

pied porte-luminaire
type: Concept
modified: 2014-12-04T12:02:32+01:00
in scheme: Thésaurus de la désignation des objets mobiliers
preferred label: ratchet candlestands @en-us
broader: porte-luminaire
created: 2012-05-16T00:00:00+02:00
related: lampe
definition: Support en simple montant posé au sol, de hauteur fixe ou réglable, servant à surélever un luminaire portatif, généralement une lampe.
TermeAssocie: lampe
status: 1
broad match: http://data.bnf.fr/ark:/12148/cb119375685
broad match: Luminaire

pied porte-luminaire
type: PreferredTerm
modified: 2014-12-04T12:02:32+01:00
created: 2014-01-15T14:54:24+01:00
status: 1

lampe
type: Concept
modified: 2014-12-05T14:28:36+01:00
in scheme: Thésaurus de la désignation des objets mobiliers
preferred label: lamps (lighting devices) @en-us
broader: instrument ou accessoire pour l'éclairage
alternative label: lampe de mineur
alternative label: lampe à huile en lanternon
alternative label: lampe à alcool
alternative label: lampe à huile cardan
alternative label: lampe à pompe
alternative label: lampe à huile-flambeau
alternative label: lampe de sécurité
alternative label: lampe astéare
alternative label: tisanière
alternative label: lampe Quinquet
alternative label: lampe à huile horaire
alternative label: lampe couronne astrale
alternative label: veilleuse-réchaud
alternative label: lampe Garnier
alternative label: lampe à bascule
alternative label: lampe à huile à réservoir latéral
alternative label: veilleuse-réflecteur
alternative label: lampe Carcel
alternative label: lampe à modérateur
alternative label: lampe à huile
alternative label: veilleuse-réchaud à bain marie
alternative label: lampe à réservoir mobile renversé
alternative label: lampe à acétylène
alternative label: lampe Pigeon
alternative label: bougie à essence
alternative label: lampe à pétrole
alternative label: veilleuse
alternative label: lampe docymastique
alternative label: lampe hydrostatique
alternative label: lampe à huile de poche
alternative label: lampe sidérale
alternative label: lampe à mécanisme d'horlogerie
alternative label: lampe couronne sinombre
alternative label: lampe solaire
alternative label: lampe à pompe à branches
alternative label: lampe à gaz
created: 2012-05-16T00:00:00+02:00
related: pied porte-luminaire
related: porte-luminaire
related: suspension
related: écran de lumière
definition: Appareil d'éclairage. Il fut d’abord composé d'une mèche ou d'un bec et d'un réservoir contenant le combustible gazeux ou liquide (huile, pétrole, alcool). Il fonctionne aujourd’hui à l’électricité.
TermeAssocie: pied porte-luminaire
TermeAssocie: porte-luminaire
TermeAssocie: suspension
TermeAssocie: écran de lumière
status: 1

porte-luminaire
type: Concept
modified: 2014-12-04T12:00:44+01:00
in scheme: Thésaurus de la désignation des objets mobiliers
preferred label: candlestands (furniture) @en-us
narrower: pied porte-luminaire
narrower: guéridon porte-luminaire
broader: luminaire
created: 2012-05-16T00:00:00+02:00
related: lampe
related: chandelier
related: lanterne
definition: Support posé au sol, en forme de pied de guéridon ou accroché au plafond et qui permet de surélever un luminaire portatif.
TermeAssocie: lampe
TermeAssocie: chandelier
TermeAssocie: lanterne
status: 1
broad match: http://data.bnf.fr/ark:/12148/cb119375685
broad match: Luminaire

machine à défibrer
type: Concept
modified: 2015-10-09T12:53:49+02:00
in scheme: Thésaurus de la désignation des objets mobiliers
broader: machine à décortiquer
alternative label: défibreur
created: 2012-05-16T00:00:00+02:00
definition: Machine à décortiquer le bois ou certaines plantes textiles (lin, chanvre) pour les dépouiller de leurs fibres élémentaires. Dans l'industrie textile, on parle de teilleuse.
status: 1

défibreur
type: SimpleNonPreferredTerm
modified: 2015-10-09T12:53:49+02:00
created: 2014-01-15T14:54:24+01:00
status: 1

machine à défibrer
type: PreferredTerm
modified: 2015-10-09T12:53:49+02:00
created: 2014-01-15T14:54:24+01:00
status: 1

machine à décortiquer
type: Concept
modified: 2015-10-09T12:40:56+02:00
in scheme: Thésaurus de la désignation des objets mobiliers
narrower: machine à défibrer
narrower: machine à égrener
broader: machine à séparer des solides
alternative label: décortiqueuse
created: 2012-05-16T00:00:00+02:00
definition: Machine à séparer les différentes parties constituantes de certains solides végétaux.
status: 1
narrow match: Décortiqueuse de riz

dévidoir domestique
type: Concept
modified: 2014-12-10T14:26:07+01:00
in scheme: Thésaurus de la désignation des objets mobiliers
narrower: tourniquet
narrower: rouet à envider
narrower: renvidoir
broader: objet ou matériel pour les ouvrages textiles
created: 2012-05-16T00:00:00+02:00
related: machine à bobiner
definition: Instrument utilisé pour faire passer le fil d’un support à un autre, pour le laver, le teindre ou le mettre en œuvre.
TermeAssocie: machine à bobiner
status: 1
broad match: http://vocab.getty.edu/aat/300163224
broad match: http://data.bnf.fr/ark:/12148/cb15037337b

machine à bobiner
type: Concept
modified: 2015-10-15T14:58:54+02:00
in scheme: Thésaurus de la désignation des objets mobiliers
broader: machine à organiser
alternative label: bobinoir automatique
alternative label: bobinoir
alternative label: bobineuse
created: 2012-05-16T00:00:00+02:00
related: dévidoir domestique
definition: Machine à arranger par enroulement des fils, des rubans, des câbles, du papier, etc. pour obtenir des bobines de longueur, de poids, ou de forme donnés.
TermeAssocie: dévidoir domestique
status: 1

dévidoir domestique
type: PreferredTerm
modified: 2014-12-10T14:26:07+01:00
created: 2014-01-15T14:54:24+01:00
status: 1

tourniquet
type: Concept
modified: 2014-12-10T14:50:36+01:00
in scheme: Thésaurus de la désignation des objets mobiliers
broader: dévidoir domestique
created: 2012-05-16T00:00:00+02:00
definition: Instrument permettant de passer de l’écheveau à la bobine, à la canette, à la navette ou à la pelote. Le tourniquet peut aussi servir pour des rubans de paille.
status: 1
broad match: http://vocab.getty.edu/aat/300163224
broad match: http://data.bnf.fr/ark:/12148/cb15037337b

rouet à envider
type: Concept
modified: 2014-12-10T14:49:09+01:00
in scheme: Thésaurus de la désignation des objets mobiliers
broader: dévidoir domestique
created: 2012-05-16T00:00:00+02:00
definition: Instrument servant à passer de l’écheveau à la canette, à la bobine, à la navette ou au fuseau de dentellière ou bien encore à assembler différents fils provenant d’une servante sur ces éléments. Il est constitué d’une grande roue actionnée par une manivelle entraînant grâce à une bielle, une petite roue souvent à plusieurs gorges, fixée sur un axe horizontal pointu, sur lequel sont enfilées la canette ou la bobine qui se remplissent progressivement par un fil.
status: 1
broad match: http://data.bnf.fr/ark:/12148/cb155800549

renvidoir
type: Concept
modified: 2014-12-10T14:48:29+01:00
in scheme: Thésaurus de la désignation des objets mobiliers
broader: dévidoir domestique
created: 2012-05-16T00:00:00+02:00
definition: Instrument servant à mettre le fil en écheveau à partir du fuseau, de façon à le laver et le teindre.
status: 1
broad match: http://vocab.getty.edu/aat/300163224
broad match: http://data.bnf.fr/ark:/12148/cb15037337b

tourne-broche
type: Concept
modified: 2014-12-05T15:01:33+01:00
in scheme: Thésaurus de la désignation des objets mobiliers
preferred label: rotisseries @en-us
broader: objet d'âtre pour la cuisson
created: 2012-05-16T00:00:00+02:00
definition: Mécanisme servant à faire tourner la broche de cuisson devant le feu.
status: 1
broad match: cb13337214n

objet d'âtre pour la cuisson
type: Concept
modified: 2014-10-16T14:15:30+02:00
in scheme: Thésaurus de la désignation des objets mobiliers
narrower: trépied
narrower: porte-poêle
narrower: tourne-broche
narrower: servante
narrower: porte-crémaillère
narrower: réflecteur de chaleur
narrower: T69-4515
narrower: T69-4497
narrower: T69-4491
narrower: T69-4503
narrower: T69-4507
broader: objet civil domestique
alternative label: chaîne servante
alternative label: main de fer
alternative label: crochet à couvercle
alternative label: pince à débrocher
alternative label: anse servante
created: 2012-05-16T00:00:00+02:00
definition: Instrument ou dispositif utilisé pour la cuisson des aliments dans la cheminée.
status: 1

tourne-broche
type: PreferredTerm
modified: 2014-12-05T15:01:34+01:00
created: 2014-01-15T14:54:24+01:00
status: 1

plaque toponymique
type: Concept
modified: 2015-02-24T11:36:58+01:00
in scheme: Thésaurus de la désignation des objets mobiliers
broader: édicule ou mobilier de l'espace public ou du génie civil
alternative label: plaque de rue
created: 2012-05-16T00:00:00+02:00
definition: Plaque ou panneau, fixé sur un mur ou un poteau, indiquant le nom d'un lieu, d'une voie, de l’espace public, etc. où l'on se trouve.
status: 1
narrow match: Plaque de rue

plaque toponymique
type: PreferredTerm
modified: 2015-02-24T11:36:58+01:00
created: 2014-01-15T14:54:24+01:00
status: 1

édicule ou mobilier de l'espace public ou du génie civil
type: Concept
modified: 2015-02-24T11:01:17+01:00
in scheme: Thésaurus de la désignation des objets mobiliers
narrower: plaque toponymique
narrower: panneau indicateur
narrower: boîte aux lettres publique
narrower: accessoire de guidage
narrower: borne
narrower: siège public
narrower: horloge publique
narrower: signal
narrower: T69-5291
narrower: T69-6730
narrower: T69-479
narrower: T69-6738
narrower: T69-7936
narrower: T69-6745
narrower: T69-6743
narrower: T69-469
broader: mobilier monumental ou de l'espace extérieur
created: 2012-05-16T00:00:00+02:00
definition: Edicule ou mobilier complémentaire d’un aménagement de génie civil, d’un équipement public ou situé dans l'espace public.
status: 1

plaque de rue
type: SimpleNonPreferredTerm
modified: 2015-02-24T11:36:58+01:00
created: 2014-01-15T14:54:24+01:00
status: 1

porte-encensoir
type: Concept
modified: 2014-12-01T15:51:59+01:00
in scheme: Thésaurus de la désignation des objets mobiliers
preferred label: portaturibolo @it
preferred label: censer stands @en-us
preferred label: porta-turíbulo @pt
broader: meuble de rangement pour objets, linges et vêtements du culte
alternative label: support d'encensoir
created: 2012-05-16T00:00:00+02:00
related: navette à encens
related: seau à eau bénite
related: encensoir
definition: Haut support permettant de suspendre un encensoir lorsqu'il n’est pas utilisé. Il comporte généralement une tablette pour y poser une navette à encens et parfois une patère pour suspendre le seau à eau bénite.
TermeAssocie: navette à encens
TermeAssocie: seau à eau bénite
TermeAssocie: encensoir
status: 1

navette à encens
type: Concept
modified: 2014-11-27T11:49:31+01:00
in scheme: Thésaurus de la désignation des objets mobiliers
preferred label: navicella portaincenso @it
preferred label: incense boats @en-us
preferred label: naveta @pt
broader: objet lié à l'ablution, à l'aspersion et à l'encensement
created: 2012-05-16T00:00:00+02:00
related: porte-encensoir
definition: Récipient, généralement en métal, contenant des grains d'encens. La navette à encens est en forme de petite nef souvent sur pied, avec un couvercle à charnières qui s'ouvre sur tout ou partie de la navette. Elle peut comporter une chaînette à laquelle est attachée une cuiller à encens.
TermeAssocie: porte-encensoir
status: 1

seau à eau bénite
type: Concept
modified: 2014-11-27T11:56:48+01:00
in scheme: Thésaurus de la désignation des objets mobiliers
preferred label: aspersoriums (liturgical vessels) @en-us
preferred label: secchiello per l'acqua benedetta @it
preferred label: caldeirinha de água benta @pt
broader: objet lié à l'ablution, à l'aspersion et à l'encensement
alternative label: situle
alternative label: seau à aspersion
alternative label: bénitier portatif
created: 2012-05-16T00:00:00+02:00
related: chapelle de messe
related: porte-encensoir
related: bénitier
definition: Récipient contenant l'eau bénite utilisée pour les aspersions rituelles. A fond plat ou sur un pied bas, il est muni d'une anse mobile sur le dessus et comporte généralement une doublure intérieure amovible. Il s'accompagne toujours d'un aspersoir. Au Moyen Age, il est en général de grandes dimensions, de forme tronconique et porte le nom de situle.
TermeAssocie: chapelle de messe
TermeAssocie: porte-encensoir
TermeAssocie: bénitier
status: 1
narrow match: cb15974042r

encensoir
type: Concept
modified: 2014-11-27T11:31:49+01:00
in scheme: Thésaurus de la désignation des objets mobiliers
preferred label: censers @en-us
preferred label: turibolo @it
preferred label: turíbulo @pt
broader: objet lié à l'ablution, à l'aspersion et à l'encensement
created: 2012-05-16T00:00:00+02:00
related: porte-encensoir
related: encensoir orthodoxe
definition: Brûle-parfum en métal pour l'encensement, suspendu à trois longues chaînes. L'encens est mis sur les braises contenues dans la partie inférieure, dans une doublure en métal. Depuis le Moyen Age, l'encensoir a généralement un couvercle ajouré attaché à une quatrième chaîne. Il est accompagné d'une navette à encens.
TermeAssocie: porte-encensoir
TermeAssocie: encensoir orthodoxe
status: 1

porte-encensoir
type: PreferredTerm
modified: 2014-12-01T15:51:59+01:00
created: 2014-01-15T14:54:24+01:00
status: 1

support d'encensoir
type: SimpleNonPreferredTerm
modified: 2014-12-01T15:51:59+01:00
created: 2014-01-15T14:54:24+01:00
status: 1

jeton
type: PreferredTerm
modified: 2014-12-30T12:34:35+01:00
created: 2014-01-15T14:54:24+01:00
status: 1

méreau
type: SimpleNonPreferredTerm
modified: 2014-12-30T12:34:35+01:00
created: 2014-01-15T14:54:24+01:00
status: 1

accessoire de jeu de société
type: Concept
modified: 2014-12-30T13:07:57+01:00
in scheme: Thésaurus de la désignation des objets mobiliers
preferred label: board game elements @en-us
broader: jeu de cartes ou de société
alternative label: pion de jeu
alternative label: dé à jouer
alternative label: tapis de jeu
created: 2013-11-29T00:00:00+01:00
related: jeton
definition: Élément ou ensemble incomplet d'éléments utilisés dans un jeu de société.
TermeAssocie: jeton
status: 1
broad match: Jeu de société

embarcation de sauvetage
type: Concept
modified: 2014-12-19T16:26:08+01:00
in scheme: Thésaurus de la désignation des objets mobiliers
broader: équipement embarqué
alternative label: drome de sauvetage
alternative label: radeau de sauvetage
alternative label: canot de sauvetage
created: 2012-05-16T00:00:00+02:00
scope note: Ne pas confondre avec bateau de sauvetage.
definition: Embarcation installée réglementairement sur les bateaux pour la sauvegarde des passagers et de l'équipage. Si c'est un radeau, il peut être gonflable.
status: 1

équipement embarqué
type: Concept
modified: 2014-10-16T10:35:29+02:00
in scheme: Thésaurus de la désignation des objets mobiliers
narrower: embarcation de sauvetage
narrower: équipement de survie maritime
narrower: matériel d'exploration sous-marin
narrower: annexe de bord
broader: matériel de transport nautique
created: 2012-05-16T00:00:00+02:00
definition: Dispositif auxiliaire nécessaire au bon fonctionnement d'un navire en fonction de sa vocation.
status: 1
narrow match: http://vocab.getty.edu/aat/300232888
broad match: Watercraft

canot de sauvetage
type: SimpleNonPreferredTerm
modified: 2014-12-19T16:26:08+01:00
created: 2014-01-15T14:54:24+01:00
status: 1

radeau de sauvetage
type: SimpleNonPreferredTerm
modified: 2014-12-19T16:26:08+01:00
created: 2014-01-15T14:54:24+01:00
status: 1

embarcation de sauvetage
type: PreferredTerm
modified: 2014-12-19T16:26:08+01:00
created: 2014-01-15T14:54:24+01:00
status: 1

drome de sauvetage
type: SimpleNonPreferredTerm
modified: 2014-12-19T16:26:08+01:00
created: 2014-01-15T14:54:24+01:00
status: 1

camping-car
type: Concept
modified: 2014-10-16T11:12:45+02:00
in scheme: Thésaurus de la désignation des objets mobiliers
preferred label: motor homes @en-us
broader: voiture automobile
alternative label: autocaravane
created: 2013-11-06T00:00:00+01:00
definition: Véhicule automobile léger habitable.
status: 1

autocaravane
type: SimpleNonPreferredTerm
modified: 2014-10-16T11:12:45+02:00
created: 2014-01-15T14:54:24+01:00
status: 1

camping-car
type: PreferredTerm
modified: 2014-10-16T11:12:45+02:00
created: 2014-01-15T14:54:24+01:00
status: 1

mitre
type: Concept
modified: 2014-12-03T12:57:13+01:00
in scheme: Thésaurus de la désignation des objets mobiliers
preferred label: mitria @it
preferred label: miters (headgear) @en-us
preferred label: mitra @pt
broader: coiffure liturgique
alternative label: fanons de mitre
alternative label: mitre simple
alternative label: mitre orfrayée
alternative label: mitre précieuse
created: 2012-05-16T00:00:00+02:00
related: voile huméral
definition: Haute coiffure à deux pointes, de forme conique, portée généralement sur une calotte par le pape, les cardinaux, les évêques et les abbés, plus rarement par les autres clercs. Les fanons, sont des bandes de tissu pendant à l'arrière de la mitre. Il existe trois sortes de mitres : la mitre précieuse rehaussée de broderies et de pierres précieuses, la mitre orfrayée, réhaussée de perles et la mitre simple, portée en temps de deuil et de pénitence.
TermeAssocie: voile huméral
status: 1

mitre simple
type: SimpleNonPreferredTerm
modified: 2014-12-03T12:57:13+01:00
created: 2014-01-15T14:54:24+01:00
status: 1

fanons de mitre
type: SimpleNonPreferredTerm
modified: 2014-12-03T12:57:13+01:00
created: 2014-01-15T14:54:24+01:00
status: 1

mitre
type: PreferredTerm
modified: 2014-12-03T12:57:13+01:00
created: 2014-01-15T14:54:24+01:00
status: 1

mitre précieuse
type: SimpleNonPreferredTerm
modified: 2014-12-03T12:57:13+01:00
created: 2014-01-15T14:54:24+01:00
status: 1

mitre orfrayée
type: SimpleNonPreferredTerm
modified: 2014-12-03T12:57:13+01:00
created: 2014-01-15T14:54:24+01:00
status: 1

machine à assembler
type: PreferredTerm
modified: 2015-10-08T11:02:56+02:00
created: 2014-01-15T14:54:24+01:00
status: 1

machine à entrelacer
type: Concept
modified: 2015-10-08T12:30:33+02:00
in scheme: Thésaurus de la désignation des objets mobiliers
narrower: machine à tisser
narrower: machine à tresser
narrower: T69-5433
narrower: T69-5435
narrower: T69-5439
narrower: T69-5431
broader: machine à assembler
created: 2012-05-16T00:00:00+02:00
definition: Machine à assembler, par entrelacement, des fils des brins ou des fibres pour les assujettir les uns aux autres.
status: 1
broad match: http://data.bnf.fr/ark:/12148/cb120214424

machine à agglomérer
type: Concept
modified: 2015-10-08T11:46:54+02:00
in scheme: Thésaurus de la désignation des objets mobiliers
broader: machine à assembler
alternative label: tambour nodulisateur
created: 2012-05-16T00:00:00+02:00
definition: Machine à assembler, avec ou sans liant, en les agglutinant, des matériaux granuleux ou en poudre.
status: 1
broad match: http://data.bnf.fr/ark:/12148/cb120214424

machine liée à la production industrielle
type: Concept
modified: 2015-08-10T15:32:41+02:00
in scheme: Thésaurus de la désignation des objets mobiliers
narrower: machine à dissocier
narrower: machine à mettre en état
narrower: machine à assembler
narrower: machine à contrôler
narrower: outillage et accessoires liés à la production industrielle
narrower: machine à modifier l'état
narrower: machine à façonner
narrower: machine à manutentionner
alternative label: machine
created: 2012-05-16T00:00:00+02:00
related: machine liée à la production artisanale
definition: Machine constituée d'un ensemble d'organes mettant en œuvre de l'énergie mécanique pour assurer une ou plusieurs fonctions dans un cycle de fabrication d'une industrie déterminée.
TermeAssocie: machine liée à la production artisanale
status: 1

machine à ligaturer
type: Concept
modified: 2015-10-08T14:46:24+02:00
in scheme: Thésaurus de la désignation des objets mobiliers
narrower: T69-5471
narrower: T69-5469
narrower: T69-5467
broader: machine à assembler
alternative label: ficeleuse
created: 2012-05-16T00:00:00+02:00
definition: Machine à assembler, grâce à un lien souple ou rigide, des produits soumis à des contraintes de manipulation.
status: 1
broad match: http://data.bnf.fr/ark:/12148/cb120214424

machine à attacher
type: Concept
modified: 2015-10-08T11:48:53+02:00
in scheme: Thésaurus de la désignation des objets mobiliers
narrower: machine à boulonner
narrower: machine à riveter
narrower: machine à cheviller
narrower: machine à visser
narrower: machine à clouer
narrower: machine à coudre industrielle
narrower: machine à agrafer
narrower: machine à enfiler
broader: machine à assembler
created: 2012-05-16T00:00:00+02:00
definition: Machine à assembler des produits avec un lien pénétrant, pour les solidariser.
status: 1
broad match: http://data.bnf.fr/ark:/12148/cb120214424

machine à insérer
type: Concept
modified: 2015-10-08T14:13:26+02:00
in scheme: Thésaurus de la désignation des objets mobiliers
broader: machine à assembler
created: 2012-05-16T00:00:00+02:00
definition: Machine à assembler des éléments en les introduisant en force dans d'autres éléments idnetiques ou non.
status: 1
broad match: http://data.bnf.fr/ark:/12148/cb120214424

boîte à chapeaux
type: SimpleNonPreferredTerm
modified: 2014-12-10T16:43:16+01:00
created: 2014-01-15T14:54:24+01:00
status: 1

boîte à peignes
type: SimpleNonPreferredTerm
modified: 2014-12-10T16:43:16+01:00
created: 2014-01-15T14:54:24+01:00
status: 1

boîte à brosse à cheveux
type: SimpleNonPreferredTerm
modified: 2014-12-10T16:43:16+01:00
created: 2014-01-15T14:54:24+01:00
status: 1

boîte à perruque
type: SimpleNonPreferredTerm
modified: 2014-12-10T16:43:16+01:00
created: 2014-01-15T14:54:24+01:00
status: 1

boîte de toilette
type: PreferredTerm
modified: 2014-12-10T16:43:16+01:00
created: 2014-01-15T14:54:24+01:00
status: 1

boîte à brosses à dents
type: SimpleNonPreferredTerm
modified: 2014-12-10T16:43:16+01:00
created: 2014-01-15T14:54:24+01:00
status: 1

boîte à brosse à dents
type: SimpleNonPreferredTerm
modified: 2014-12-10T16:43:16+01:00
created: 2014-01-15T14:54:24+01:00
status: 1

carré de toilette
type: SimpleNonPreferredTerm
modified: 2014-12-10T16:43:16+01:00
created: 2014-01-15T14:54:24+01:00
status: 1

boîte à mouches
type: SimpleNonPreferredTerm
modified: 2014-12-10T16:43:16+01:00
created: 2014-01-15T14:54:24+01:00
status: 1

boîte à coiffure
type: SimpleNonPreferredTerm
modified: 2014-12-10T16:43:16+01:00
created: 2014-01-15T14:54:24+01:00
status: 1

boîte à épingles de toilette
type: SimpleNonPreferredTerm
modified: 2014-12-10T16:43:16+01:00
created: 2014-01-15T14:54:24+01:00
status: 1

boîte à brosses à cheveux
type: SimpleNonPreferredTerm
modified: 2014-12-10T16:43:16+01:00
created: 2014-01-15T14:54:24+01:00
status: 1

boîte à racines
type: SimpleNonPreferredTerm
modified: 2014-12-10T16:43:16+01:00
created: 2014-01-15T14:54:24+01:00
status: 1

navire de combat
type: Concept
modified: 2014-10-16T10:18:11+02:00
in scheme: Thésaurus de la désignation des objets mobiliers
preferred label: warships @en-us
narrower: croiseur
narrower: frégate
narrower: cuirassé
narrower: sous-marin
narrower: canonnière
narrower: contre-torpilleur
narrower: aviso
narrower: porte aéronefs
narrower: torpilleur
narrower: bateau de débarquement
narrower: chasseur de mines
broader: navire de guerre
alternative label: mouilleur de mines
alternative label: vaisseau de combat
created: 2012-05-16T00:00:00+02:00
definition: Bateau armé pour des actions offensives ou défensives.
status: 1

croiseur
type: Concept
modified: 2014-12-19T12:48:48+01:00
in scheme: Thésaurus de la désignation des objets mobiliers
preferred label: cruisers @en-us
broader: navire de combat
created: 2013-11-04T00:00:00+01:00
definition: Navire rapide de reconnaissance armé de canons de calibre moyen et destiné à éclairer les flottes en formation de combat, avant l'invention du radar.
status: 1

frégate
type: Concept
modified: 2014-12-19T16:00:05+01:00
in scheme: Thésaurus de la désignation des objets mobiliers
preferred label: frigates @en-us
broader: navire de combat
created: 2013-11-04T00:00:00+01:00
definition: Bateau de moyen tonnage constituant une plate-forme de tir équipée soit pour la lutte anti-sous-marine ou anti-aérienne, soit en lance-missiles.
status: 1

cuirassé
type: Concept
modified: 2014-12-19T15:57:11+01:00
in scheme: Thésaurus de la désignation des objets mobiliers
preferred label: battleships @en-us
broader: navire de combat
created: 2013-11-04T00:00:00+01:00
definition: Navire armé de canons de fort calibre et dont la coque et les superstructures sont blindées.
status: 1

sous-marin
type: Concept
modified: 2014-12-19T16:05:10+01:00
in scheme: Thésaurus de la désignation des objets mobiliers
preferred label: submarines @en-us
broader: navire de combat
created: 2012-05-16T00:00:00+02:00
definition: Bateau équipé de torpilles, de missiles et parfois de canons de petit calibre, apte à naviguer sous l'eau durant de longues périodes.
status: 1

canonnière
type: Concept
modified: 2014-12-19T12:43:02+01:00
in scheme: Thésaurus de la désignation des objets mobiliers
preferred label: gunboats @en-us
broader: navire de combat
alternative label: patrouilleur
created: 2013-11-04T00:00:00+01:00
definition: Bateau armé de canons de moyen ou de petit calibre, destiné aux combats sur les fleuves, les estuaires ou près des côtes.
status: 1

navire de guerre
type: Concept
modified: 2014-12-19T16:09:35+01:00
in scheme: Thésaurus de la désignation des objets mobiliers
preferred label: naval ships @en-us
narrower: navire de combat
narrower: T69-6284
broader: bateau
alternative label: bateau militaire
created: 2012-05-16T00:00:00+02:00
related: armement
definition: Bateau destiné à des opérations militaires.
TermeAssocie: armement
status: 1

contre-torpilleur
type: Concept
modified: 2014-12-19T12:46:00+01:00
in scheme: Thésaurus de la désignation des objets mobiliers
preferred label: destroyers @en-us
broader: navire de combat
alternative label: destroyer
created: 2013-11-04T00:00:00+01:00
definition: Bateau armé de canons de moyen et de petit calibre chargé de l'escorte des plus grosses unités.
status: 1

aviso
type: Concept
modified: 2014-12-19T12:40:51+01:00
in scheme: Thésaurus de la désignation des objets mobiliers
preferred label: avisos @en-us
broader: navire de combat
alternative label: corvette
created: 2013-11-04T00:00:00+01:00
definition: Petit bateau chargé d'effectuer les liaisons entre les ports militaires et les escadres et adapté aux combats côtiers.
status: 1

navire de combat
type: PreferredTerm
modified: 2014-10-16T10:18:11+02:00
created: 2014-01-15T14:54:24+01:00
status: 1

porte aéronefs
type: Concept
modified: 2014-12-19T16:01:54+01:00
in scheme: Thésaurus de la désignation des objets mobiliers
preferred label: aircraft carriers @en-us
broader: navire de combat
alternative label: porte-avion
created: 2013-11-04T00:00:00+01:00
definition: Navire dont l'armement est constitué par plusieurs flottilles d'avions ou d'hélicoptères et qui est équipé pour leur maintenance.
status: 1

vaisseau de combat
type: SimpleNonPreferredTerm
modified: 2014-10-16T10:18:11+02:00
created: 2014-01-15T14:54:24+01:00
status: 1

torpilleur
type: Concept
modified: 2014-12-19T16:07:24+01:00
in scheme: Thésaurus de la désignation des objets mobiliers
preferred label: motor torpedo boats @en-us
broader: navire de combat
alternative label: vedette lance-torpilles
created: 2013-11-04T00:00:00+01:00
definition: Bateau de petit tonnage chargé de torpilles.
status: 1

bateau de débarquement
type: Concept
modified: 2014-10-16T10:20:20+02:00
in scheme: Thésaurus de la désignation des objets mobiliers
preferred label: amphibious warships @en-us
broader: navire de combat
alternative label: transport d'assaut
created: 2012-05-16T00:00:00+02:00
definition: Bateau adapté pour le transport et la mise à terre en zone non aménagée de personnel et de véhicules.
status: 1

chasseur de mines
type: Concept
modified: 2014-12-19T12:44:07+01:00
in scheme: Thésaurus de la désignation des objets mobiliers
preferred label: minesweepers @en-us
broader: navire de combat
alternative label: dragueur de mines
created: 2012-05-16T00:00:00+02:00
definition: Bateau équipé pour la recherche et la destruction des mines. Le dragueur de mines dispose de moyens mécaniques (filet ou drague) tandis que le chasseur de mines, de moyens électroacoustiques.
status: 1

mouilleur de mines
type: SimpleNonPreferredTerm
modified: 2014-10-16T10:18:11+02:00
created: 2014-01-15T14:54:24+01:00
status: 1

demi-relief
type: Concept
modified: 2014-12-03T17:09:25+01:00
in scheme: Thésaurus de la désignation des objets mobiliers
preferred label: mezzo rilievo @en-us
broader: relief
alternative label: demi-bosse
created: 2012-05-16T00:00:00+02:00
definition: Relief dont les formes en saillie représentent plus de la moitié du volume réel d'un corps ou d'un objet.
status: 1
broad match: http://data.bnf.fr/ark:/12148/cb119776281

tableautin d'autel
type: Concept
modified: 2014-12-01T14:25:14+01:00
in scheme: Thésaurus de la désignation des objets mobiliers
preferred label: devotional scenes @en-us
preferred label: quadro d'altare @it
broader: autel et son environnement
created: 2012-05-16T00:00:00+02:00
related: tableau
related: relief
definition: Petit tableau ou relief représentant une image pieuse de dévotion : Vierge de douleur, Sacré Cœur de Jésus, etc., posé au centre de l'autel et souvent au-dessus du tabernacle, généralement sous le tableau d'autel. Le tableautin d'autel est enchâssé dans un cadre qui peut comporter deux petits pieds pour en assurer la stabilité et deux bras porte-chandelles.
TermeAssocie: tableau
TermeAssocie: relief
status: 1
broad match: Autel (christianisme)

masque sculpté
type: Concept
modified: 2014-12-03T17:18:29+01:00
in scheme: Thésaurus de la désignation des objets mobiliers
broader: relief
alternative label: masque de théâtre
alternative label: masque funéraire
created: 2012-05-16T00:00:00+02:00
definition: Représentation en bas, en demi ou en haut-relief de la partie antérieure de la tête ou visage.
status: 1

relief
type: PreferredTerm
modified: 2014-12-03T16:49:45+01:00
created: 2014-01-15T14:54:24+01:00
status: 1

haut-relief
type: Concept
modified: 2014-12-03T17:13:46+01:00
in scheme: Thésaurus de la désignation des objets mobiliers
preferred label: high reliefs (sculpture) @en-us
broader: relief
created: 2012-05-16T00:00:00+02:00
definition: Relief dont les formes en saillie représentent plus de la moitié du volume réel d'un corps ou d'un objet sans excéder les trois quarts de son volume.
status: 1

relief gravé
type: Concept
modified: 2014-12-03T17:20:02+01:00
in scheme: Thésaurus de la désignation des objets mobiliers
broader: relief
created: 2012-05-16T00:00:00+02:00
definition: Relief dont les différences de profondeur sont à peine suggérées : un tracé en creux, y délimite les formes représentées sur une surface plane (plan d'épannelage d'une dalle, d'un parement, surface d'un vase, etc.).
status: 1
broad match: http://data.bnf.fr/ark:/12148/cb119776281
broad match: http://vocab.getty.edu/aat/300047230
broad match: Relief (sculpture)

objet de représentation d'un organisme vivant
type: Concept
modified: 2014-09-09T17:19:48+02:00
in scheme: Thésaurus de la désignation des objets mobiliers
narrower: écorché
broader: objet de représentation scientifique et pédagogique
alternative label: modèle d'organe
alternative label: cire pathologique
created: 2012-05-16T00:00:00+02:00
related: relief
related: ronde-bosse
definition: Objet de représentation volumique d'organismes ou de parties d'organismes, élaborés en cire, en plâtre, en celluloïd, en latex peints, à l'exclusion des animaux naturalisés ou empaillés.
TermeAssocie: relief
TermeAssocie: ronde-bosse
status: 1
narrow match: cb12046087m

tableau d'autel
type: Concept
modified: 2014-12-01T14:23:01+01:00
in scheme: Thésaurus de la désignation des objets mobiliers
preferred label: altarpieces @en-us
preferred label: pala d'altare @it
preferred label: quadro de altar @pt
broader: autel et son environnement
created: 2012-05-16T00:00:00+02:00
related: relief
definition: Figuration religieuse peinte ou en relief, posée sur un autel ou derrière celui-ci, sur un mur, généralement dans un cadre ou dans un retable. Une lunette d’autel ou une prédelle peut faire partie ou être un élément démembré d'un tableau d'autel.
TermeAssocie: relief
status: 1

camée
type: Concept
modified: 2014-12-03T17:05:55+01:00
in scheme: Thésaurus de la désignation des objets mobiliers
preferred label: cameos @en-us
broader: relief
created: 2013-07-19T00:00:00+02:00
related: bijouterie et orfèvrerie civiles, monnaie, médaille
definition: Pierre fine gravée en relief.
TermeAssocie: bijouterie et orfèvrerie civiles, monnaie, médaille
status: 1

retable
type: Concept
modified: 2014-12-01T14:16:06+01:00
in scheme: Thésaurus de la désignation des objets mobiliers
preferred label: mostra d'altare @it
preferred label: reredoses (screens) @en-us
preferred label: retábulo @pt
broader: autel et son environnement
created: 2012-05-16T00:00:00+02:00
related: tableau
related: relief
related: T69-683
definition: Structure comportant une ou plusieurs représentations religieuses figurées, généralement peintes ou sculptées, placées dans un cadre, à l'arrière de la table d'autel ou derrière l'autel. Le retable est très souvent architecturé avec des colonnes, des architraves, etc. Il peut s'agir d'un polyptyque. Une prédelle, un tableau d'autel ou une lunette d’autel peuvent faire partie ou être des éléments démembrés d'un retable.
TermeAssocie: tableau
TermeAssocie: relief
TermeAssocie: T69-683
status: 1

intaille
type: Concept
modified: 2014-12-03T17:15:10+01:00
in scheme: Thésaurus de la désignation des objets mobiliers
preferred label: intaglios (sculptural objects) @en-us
broader: relief
created: 2013-07-19T00:00:00+02:00
related: bijouterie et orfèvrerie civiles, monnaie, médaille
definition: Pierre gravée en creux.
TermeAssocie: bijouterie et orfèvrerie civiles, monnaie, médaille
status: 1

bas-relief
type: Concept
modified: 2014-12-03T16:51:23+01:00
in scheme: Thésaurus de la désignation des objets mobiliers
preferred label: bas-reliefs (sculpture) @en-us
narrower: relief écrasé
narrower: relief semi-méplat
narrower: relief méplat
broader: relief
alternative label: basse-taille
created: 2012-05-16T00:00:00+02:00
definition: Relief dont les différentes formes en saillie représentent moins de la moitié du volume réel d'un corps ou d'un objet.
status: 1

mascaron
type: Concept
modified: 2014-12-03T17:16:36+01:00
in scheme: Thésaurus de la désignation des objets mobiliers
preferred label: mascarons @en-us
broader: relief
created: 2012-05-16T00:00:00+02:00
definition: Ornement sculpté représentant une face fantastique ou grotesque.
status: 1

hotte (panier)
type: Concept
modified: 2014-01-10T00:00:00+01:00
in scheme: Thésaurus de la désignation des objets mobiliers
broader: matériel de manutention
created: 2013-12-16T00:00:00+01:00
status: 1

matériel de manutention
type: Concept
modified: 2014-01-10T00:00:00+01:00
in scheme: Thésaurus de la désignation des objets mobiliers
narrower: hotte (panier)
broader: matériel artisanal
alternative label: porte-seau
alternative label: brancard à sortir le fumier
created: 2013-12-16T00:00:00+01:00
related: T69-8854
TermeAssocie: T69-8854
status: 1

hotte (panier)
type: PreferredTerm
modified: 2014-01-10T00:00:00+01:00
created: 2014-01-15T14:54:24+01:00
status: 1

oratoire
type: Concept
modified: 2015-02-24T12:18:40+01:00
in scheme: Thésaurus de la désignation des objets mobiliers
preferred label: oratorio @it
preferred label: oratories @en-us
broader: édicule religieux chrétien
alternative label: tabernacle de voie publique
alternative label: tabernacle de chemin
alternative label: oratoire de chemin
created: 2012-05-16T00:00:00+02:00
scope note: Voir aussi le Thesaurus de la désignation des œuvres architecturales et des espaces aménagés.
definition: Petit édifice ou édicule où l'on se retire pour faire oraison : contrairement à la chapelle l’oratoire n'a pas d'autel consacré. Il peut aussi consister en une peinture ou une sculpture placée dans une niche, sous un dais ou sur un support spécifique.
status: 1

édicule religieux chrétien
type: Concept
modified: 2014-10-15T16:57:27+02:00
in scheme: Thésaurus de la désignation des objets mobiliers
narrower: oratoire
narrower: mont calvaire
narrower: mont des Oliviers
narrower: grotte de Lourdes
narrower: lanterne des morts
narrower: T69-442
narrower: T69-431
narrower: T69-427
narrower: T69-461
narrower: T69-463
broader: mobilier monumental ou de l'espace extérieur
created: 2012-05-16T00:00:00+02:00
scope note: Voir aussi le Thesaurus de la désignation des œuvres architecturales et des espaces aménagés.
related: objet de dévotion
definition: Construction autonome non habitable liée à la religion chrétienne.
TermeAssocie: objet de dévotion
status: 1
broad match: cb11935697j
broad match: http://vocab.getty.edu/aat/300120364

oratoire
type: PreferredTerm
modified: 2015-02-24T12:18:40+01:00
created: 2014-01-15T14:54:24+01:00
status: 1

tabernacle de voie publique
type: SimpleNonPreferredTerm
modified: 2015-02-24T12:18:40+01:00
created: 2014-01-15T14:54:24+01:00
status: 1

tabernacle de chemin
type: SimpleNonPreferredTerm
modified: 2015-02-24T12:18:40+01:00
created: 2014-01-15T14:54:24+01:00
status: 1

oratoire de chemin
type: SimpleNonPreferredTerm
modified: 2015-02-24T12:18:40+01:00
created: 2014-01-15T14:54:24+01:00
status: 1

récipient pour les cendres
type: Concept
modified: 2014-12-01T11:21:10+01:00
in scheme: Thésaurus de la désignation des objets mobiliers
preferred label: contenitore per le ceneri @it
preferred label: ash receptacles @en-us
preferred label: reservatório das cinzas @pt
broader: objet lié aux temps de Noël et de Carême
alternative label: boîte à cendres
created: 2012-05-16T00:00:00+02:00
related: plateau de communion
related: plat de quête
definition: Récipient servant à recueillir les cendres des rameaux bénits de l'année précédente pour les apposer sur le front des fidèles et des prêtres le mercredi des Cendres, premier jour du Carême, en signe de pénitence. Des plateaux de communion ou des plats de quête peuvent être utilisés à cet usage.
TermeAssocie: plateau de communion
TermeAssocie: plat de quête
status: 1
broad match: cb13184671j
broad match: http://vocab.getty.edu/aat/300194500

boîte à cendres
type: SimpleNonPreferredTerm
modified: 2014-12-01T11:21:10+01:00
created: 2014-01-15T14:54:24+01:00
status: 1

récipient pour les cendres
type: PreferredTerm
modified: 2014-12-01T11:21:10+01:00
created: 2014-01-15T14:54:24+01:00
status: 1

plat de quête
type: Concept
modified: 2014-11-27T15:54:31+01:00
in scheme: Thésaurus de la désignation des objets mobiliers
preferred label: alms dishes @en-us
preferred label: piatto per elemosine @it
preferred label: salva de ofertório @pt
broader: objet lié à l'offrande et à la quête
alternative label: assiette à quêter
alternative label: corbeille à quêter
alternative label: assiette de quête
alternative label: plateau à aumônes
alternative label: plat à quêter
alternative label: corbeille de quête
alternative label: bassin de quête
alternative label: bassin à quêter
created: 2012-05-16T00:00:00+02:00
related: récipient pour les cendres
definition: Plat, assiette ou bassin, souvent en métal, utilisé pour faire la quête. Il peut comporter au centre un support saillant pour maintenir un élément dont l'iconographie est en relation avec l'objet de la quête ou un binet pour une bougie. Il peut encore avoir des cloisons pour séparer le produit des différentes quêtes.
TermeAssocie: récipient pour les cendres
status: 1

bateau de pêche à la drague
type: Concept
modified: 2014-12-19T11:00:34+01:00
in scheme: Thésaurus de la désignation des objets mobiliers
preferred label: dredging vessels @en-us
broader: bateau de pêche
alternative label: coquillier (bateau)
created: 2013-11-04T00:00:00+01:00
definition: Bateau de pêche utilisé pour draguer, principalement la coquille Saint-Jacques.
status: 1
narrow match: Coquillier

bateau de pêche à la drague
type: PreferredTerm
modified: 2014-12-19T11:00:34+01:00
created: 2014-01-15T14:54:24+01:00
status: 1

coquillier (bateau)
type: SimpleNonPreferredTerm
modified: 2014-12-19T11:00:34+01:00
created: 2014-01-15T14:54:24+01:00
status: 1

diapason
type: Concept
modified: 2014-10-10T11:24:48+02:00
in scheme: Thésaurus de la désignation des objets mobiliers
preferred label: tuning forks @en-us
broader: accessoire du musicien
alternative label: diapason à pompe
created: 2012-05-16T00:00:00+02:00
related: instrument de démonstration en acoustique
definition: Instrument en acier, de petite taille et en forme de fourche à deux dents, qui donne le "la" de l'octave moyenne lorsqu'on le fait vibrer. Le diapason à pompe est une sorte de flûte à bec qui permettait de donner la notre aux musiciens ou aux chanteurs.
TermeAssocie: instrument de démonstration en acoustique
status: 1

instrument de démonstration en acoustique
type: Concept
modified: 2014-12-15T14:08:31+01:00
in scheme: Thésaurus de la désignation des objets mobiliers
broader: instrument de démonstration de phénomènes physiques
created: 2012-05-16T00:00:00+02:00
related: diapason
related: générateur d'ondes mécaniques
definition: Instrument scientifique destiné à la mise en évidence de phénomènes liés à l'acoustique, ou étude de mouvements ondulatoires mécaniques.
TermeAssocie: diapason
TermeAssocie: générateur d'ondes mécaniques
status: 1

diapason à pompe
type: SimpleNonPreferredTerm
modified: 2014-10-10T11:24:48+02:00
created: 2014-01-15T14:54:24+01:00
status: 1

diapason
type: PreferredTerm
modified: 2014-10-10T11:24:48+02:00
created: 2014-01-15T14:54:24+01:00
status: 1

table de cuisine
type: Concept
modified: 2014-12-05T13:37:15+01:00
in scheme: Thésaurus de la désignation des objets mobiliers
preferred label: kitchen tables @en-us
broader: table pour l'alimentation
created: 2012-05-16T00:00:00+02:00
definition: Table longue mais rarement large servant aux travaux de cuisine. Elle se compose d’un plateau épais, à pieds assemblés directement dans le plateau, ou d’un plateau ordinaire à ceinture ouverte.
status: 1

table de cuisine
type: PreferredTerm
modified: 2014-12-05T13:37:15+01:00
created: 2014-01-15T14:54:24+01:00
status: 1

barge ostréicole
type: SimpleNonPreferredTerm
modified: 2014-12-18T11:41:46+01:00
created: 2014-01-15T14:54:24+01:00
status: 1

barge
type: PreferredTerm
modified: 2014-12-18T11:41:46+01:00
created: 2014-01-15T14:54:24+01:00
status: 1

machine à contrôler le comportement dynamique
type: Concept
modified: 2015-08-11T12:37:27+02:00
in scheme: Thésaurus de la désignation des objets mobiliers
broader: machine à contrôler
alternative label: machine à contrôler l'usure
alternative label: machine à contrôler la fiabilité
created: 2012-05-16T00:00:00+02:00
definition: Machine à contrôler le comportement d'un produit soumis à des contraintes normales ou exceptionnelles d'utilisation.
status: 1

machine à contrôler le comportement dynamique
type: PreferredTerm
modified: 2015-08-11T12:37:27+02:00
created: 2014-01-15T14:54:24+01:00
status: 1

machine à contrôler la fiabilité
type: SimpleNonPreferredTerm
modified: 2015-08-11T12:37:27+02:00
created: 2014-01-15T14:54:24+01:00
status: 1

machine à contrôler
type: Concept
modified: 2015-10-08T15:01:19+02:00
in scheme: Thésaurus de la désignation des objets mobiliers
narrower: machine à contrôler le comportement dynamique
narrower: machine à contrôler la qualité
narrower: machine à réaliser des essais
narrower: machine à mesurer des paramètres mécaniques
narrower: T69-5499
narrower: T69-5501
narrower: T69-5475
broader: machine liée à la production industrielle
created: 2012-05-16T00:00:00+02:00
definition: Machine à vérifier la conformité, la qualité, la quantité des matériaux et des produits.
status: 1

machine à contrôler l'usure
type: SimpleNonPreferredTerm
modified: 2015-08-11T12:37:27+02:00
created: 2014-01-15T14:54:24+01:00
status: 1

équipement embarqué
type: PreferredTerm
modified: 2014-10-16T10:35:29+02:00
created: 2014-01-15T14:54:24+01:00
status: 1

équipement de survie maritime
type: Concept
modified: 2014-12-19T16:41:07+01:00
in scheme: Thésaurus de la désignation des objets mobiliers
preferred label: life preservers @en-us
broader: équipement embarqué
alternative label: gilet de sauvetage
alternative label: bouée de sauvetage
alternative label: brassière de sauvetage
alternative label: bateau de survie
created: 2012-05-16T00:00:00+02:00
definition: Equipement individuel destiné à faciliter la survie en cas de naufrage ou de chute à la mer.
status: 1
narrow match: cb16565533n

matériel d'exploration sous-marin
type: Concept
modified: 2014-12-19T16:28:30+01:00
in scheme: Thésaurus de la désignation des objets mobiliers
broader: équipement embarqué
alternative label: cloche à plongeur
alternative label: scaphandre
created: 2012-05-16T00:00:00+02:00
definition: Equipement embarqué, non auto propulsé, destiné à l'exploration des fonds marins.
status: 1
narrow match: cb11946955w
narrow match: Scaphandre

annexe de bord
type: Concept
modified: 2014-12-19T16:23:46+01:00
in scheme: Thésaurus de la désignation des objets mobiliers
broader: équipement embarqué
alternative label: canot de service
created: 2012-05-16T00:00:00+02:00
definition: Embarcation permettant de faire les allers retours entre le port ou le rivage et un plus gros bateau en mouillage au large. L'annexe peut également aider à la pêche.
status: 1
broad match: cb12425444g
broad match: http://vocab.getty.edu/aat/300232888

moule à sorbet
type: SimpleNonPreferredTerm
modified: 2014-10-16T16:53:17+02:00
created: 2014-01-15T14:54:24+01:00
status: 1

paneton
type: Concept
modified: 2014-12-08T12:50:48+01:00
in scheme: Thésaurus de la désignation des objets mobiliers
preferred label: dough baskets @en-us
broader: récipient pour la préparation des aliments
alternative label: banneton
created: 2012-05-16T00:00:00+02:00
definition: Récipient en bois ou en vannerie garni intérieurement de toile, dans lequel on fait reposer et lever la pâte à pain et qui lui donne sa forme.
status: 1
broad match: Proofing (baking technique)

bassin à blancs d'œuf
type: SimpleNonPreferredTerm
modified: 2014-11-18T14:41:11+01:00
created: 2014-01-15T14:54:24+01:00
status: 1

vire-omelette
type: Concept
modified: 2014-10-16T17:04:48+02:00
in scheme: Thésaurus de la désignation des objets mobiliers
broader: récipient pour la préparation des aliments
alternative label: plat vire-poisson
created: 2012-05-16T00:00:00+02:00
definition: Terrine basse, en poterie plombifère, à profil intérieur en V très ouvert, posée sur un pied bas, dans laquelle on bat les œufs en omelette et avec laquelle on tourne celle-ci pour la cuire sur ses deux faces. La terrine peut aussi servir à égoutter ou retourner d'autres aliments (plat vire-poisson).
status: 1
broad match: Récipient

passoire
type: Concept
modified: 2014-12-08T12:52:06+01:00
in scheme: Thésaurus de la désignation des objets mobiliers
preferred label: colanders @en-us
broader: récipient pour la préparation des aliments
alternative label: couloir à lait
alternative label: passe-lait
alternative label: chinois
alternative label: panier à salade
alternative label: passoire à macérer
created: 2012-05-16T00:00:00+02:00
related: pilon
definition: Récipient, entièrement ou partiellement ajouré, qui peut comporter des éléments de prise et un ou plusieurs pieds.
TermeAssocie: pilon
status: 1
broad match: cb11956938h

puisoir
type: SimpleNonPreferredTerm
modified: 2014-10-16T16:53:17+02:00
created: 2014-01-15T14:54:24+01:00
status: 1

pot à présure
type: SimpleNonPreferredTerm
modified: 2014-10-16T16:53:17+02:00
created: 2014-01-15T14:54:24+01:00
status: 1

sorbetière
type: SimpleNonPreferredTerm
modified: 2014-10-16T16:53:17+02:00
created: 2014-01-15T14:54:24+01:00
status: 1

cannelon
type: SimpleNonPreferredTerm
modified: 2014-10-16T16:53:17+02:00
created: 2014-01-15T14:54:24+01:00
status: 1

galetier
type: SimpleNonPreferredTerm
modified: 2014-10-16T16:53:17+02:00
created: 2014-01-15T14:54:24+01:00
status: 1

pot à filtrer
type: Concept
modified: 2014-12-08T12:55:39+01:00
in scheme: Thésaurus de la désignation des objets mobiliers
broader: récipient pour la préparation des aliments
alternative label: pot à filtrer l'eau-de-vie
alternative label: pot à filtrer les macérations
alternative label: pot à tisane
created: 2012-05-16T00:00:00+02:00
definition: Récipient en terre cuite souvent sans glaçure, dans lequel on filtre une macération ou une décoction ; il est constitué d'un corps plus ou moins pansu, muni d'une anse latérale et d'un goulot, et fermé par une paroi perforée concave sur laquelle sont retenus les aliments ayant macéré.
status: 1
broad match: cb12330782p
broad match: http://vocab.getty.edu/aat/300198758

égouttoir à galettes
type: SimpleNonPreferredTerm
modified: 2014-10-16T16:53:17+02:00
created: 2014-01-15T14:54:24+01:00
status: 1

terrine
type: Concept
modified: 2014-12-08T12:56:27+01:00
in scheme: Thésaurus de la désignation des objets mobiliers
preferred label: mixing bowls @en-us
broader: récipient pour la préparation des aliments
alternative label: terrine à lait
created: 2012-05-16T00:00:00+02:00
definition: Récipient en céramique, en forme de tronc de cône renversé, très évasé et à rebord épais, destiné à préparer des aliments, faire monter la crème ou faire lever la pâte. La terrine peut comporter un bec, une ou deux petites anses et faire partie d'une série. Elle peut aussi servir à l'entretien de la maison.
status: 1
broad match: cb13184671j

pot à cailler
type: SimpleNonPreferredTerm
modified: 2014-10-16T16:53:17+02:00
created: 2014-01-15T14:54:24+01:00
status: 1

récipient pour la préparation des aliments
type: PreferredTerm
modified: 2014-10-16T16:53:17+02:00
created: 2014-01-15T14:54:24+01:00
status: 1

planche à découper
type: Concept
modified: 2014-12-08T12:53:57+01:00
in scheme: Thésaurus de la désignation des objets mobiliers
preferred label: chopping trays @en-us
broader: récipient pour la préparation des aliments
alternative label: planche à hacher
created: 2012-05-16T00:00:00+02:00
definition: Epaisse planche de bois, parfois munie d'une poignée et d'une rigole aboutissant ou non à une cavité qui recueille le jus des viandes ou des légumes qu'on y découpe ou qu'on y hache.
status: 1
broad match: cb11956938h

crêpier
type: SimpleNonPreferredTerm
modified: 2014-10-16T16:53:17+02:00
created: 2014-01-15T14:54:24+01:00
status: 1

pot à crémer
type: Concept
modified: 2014-12-08T12:55:00+01:00
in scheme: Thésaurus de la désignation des objets mobiliers
broader: récipient pour la préparation des aliments
alternative label: terrine à crémer
alternative label: baquet à écrémer
alternative label: verrine à crémer
alternative label: baquet à crémer
alternative label: pot à égoutter la crème
alternative label: écrémeuse
alternative label: pot à écrémer
created: 2012-05-16T00:00:00+02:00
definition: Large récipient en céramique ou en bois dans lequel on laisse reposer le lait pour faire monter la crème. Plus ou moins cylindrique ou hémisphérique, à fond plat et généralement évasé, il est muni d'un bec verseur ou d'un large goulot et parfois d'une ou deux anses latérales verticales. Il peut parfois être en forme de baquet ou de terrine.
status: 1
broad match: cb12330782p

moule à glace
type: SimpleNonPreferredTerm
modified: 2014-10-16T16:53:17+02:00
created: 2014-01-15T14:54:24+01:00
status: 1

caillère
type: SimpleNonPreferredTerm
modified: 2014-10-16T16:53:17+02:00
created: 2014-01-15T14:54:24+01:00
status: 1

écope
type: SimpleNonPreferredTerm
modified: 2014-10-16T16:53:17+02:00
created: 2014-01-15T14:54:24+01:00
status: 1

stèle
type: Concept
modified: 2015-02-24T15:33:52+01:00
in scheme: Thésaurus de la désignation des objets mobiliers
preferred label: stelae @en-us
preferred label: stele funebre @it
broader: monument
alternative label: cippe
alternative label: stèle funéraire
created: 2012-05-16T00:00:00+02:00
definition: Monument monolithe en forme de pierre dressée, funéraire, votif, juridique ou sacerdotal ayant pour fonction de conserver, par l'image et le texte, le souvenir d'événements ou de personnages.
status: 1

cippe
type: SimpleNonPreferredTerm
modified: 2015-02-24T15:33:52+01:00
created: 2014-01-15T14:54:24+01:00
status: 1

stèle funéraire
type: SimpleNonPreferredTerm
modified: 2015-02-24T15:33:52+01:00
created: 2014-01-15T14:54:24+01:00
status: 1

stèle
type: PreferredTerm
modified: 2015-02-24T15:33:52+01:00
created: 2014-01-15T14:54:24+01:00
status: 1

camionnette
type: Concept
modified: 2014-12-30T10:30:24+01:00
in scheme: Thésaurus de la désignation des objets mobiliers
preferred label: vans (cargo vehicles) @en-us
broader: voiture automobile
alternative label: fourgonnette
alternative label: pick-up
created: 2013-11-06T00:00:00+01:00
definition: Véhicule automobile léger pour le transport rapide des marchandises.
status: 1

fourgonnette
type: SimpleNonPreferredTerm
modified: 2014-12-30T10:30:24+01:00
created: 2014-01-15T14:54:24+01:00
status: 1

camionnette
type: PreferredTerm
modified: 2014-12-30T10:30:24+01:00
created: 2014-01-15T14:54:24+01:00
status: 1

pick-up
type: SimpleNonPreferredTerm
modified: 2014-12-30T10:30:24+01:00
created: 2014-01-15T14:54:24+01:00
status: 1

rouleau pour la fête d'Esther
type: Concept
modified: 2014-01-10T00:00:00+01:00
in scheme: Thésaurus de la désignation des objets mobiliers
broader: objet lié à Pourim
alternative label: megillat Ester
created: 2012-05-16T00:00:00+02:00
definition: Rouleau de parchemin sur lequel est inscrit le récit de l'histoire des Juifs en exil en Perse, sauvés par Esther et Mardochée, et qui est lu lors de la fête de Pourim.
status: 1

megillat Ester
type: SimpleNonPreferredTerm
modified: 2014-01-10T00:00:00+01:00
created: 2014-01-15T14:54:24+01:00
status: 1

rouleau pour la fête d'Esther
type: PreferredTerm
modified: 2014-01-10T00:00:00+01:00
created: 2014-01-15T14:54:24+01:00
status: 1

boîte de ciboire
type: Concept
modified: 2014-11-26T12:27:32+01:00
in scheme: Thésaurus de la désignation des objets mobiliers
preferred label: ciborium cases @en-us
preferred label: custodia di pisside @it
preferred label: estojo de píxide @pt
broader: boîte et coffret pour le rangement des objets liturgiques
alternative label: boîte à ciboire
alternative label: écrin de ciboire
alternative label: étui de ciboire
created: 2012-05-16T00:00:00+02:00
related: ciboire
definition: Coffret dans lequel est rangé un ciboire. Il doit être doublé à l'intérieur. L'extérieur peut être recouvert de cuir, de toile ou encore être peint.
TermeAssocie: ciboire
status: 1
broad match: http://data.bnf.fr/ark:/12148/cb121380601
broad match: http://vocab.getty.edu/aat/300198813

boîte de ciboire
type: PreferredTerm
modified: 2014-11-26T12:27:33+01:00
created: 2014-01-15T14:54:24+01:00
status: 1

étui de ciboire
type: SimpleNonPreferredTerm
modified: 2014-11-26T12:27:33+01:00
created: 2014-01-15T14:54:24+01:00
status: 1

boîte à ciboire
type: SimpleNonPreferredTerm
modified: 2014-11-26T12:27:32+01:00
created: 2014-01-15T14:54:24+01:00
status: 1

écrin de ciboire
type: SimpleNonPreferredTerm
modified: 2014-11-26T12:27:32+01:00
created: 2014-01-15T14:54:24+01:00
status: 1

télescope
type: Concept
modified: 2014-12-15T14:02:03+01:00
in scheme: Thésaurus de la désignation des objets mobiliers
preferred label: telescopes @en-us
broader: instrument d'observation
alternative label: télescope Newton
alternative label: télescope Cassegrain
alternative label: télescope réflecteur
alternative label: télescope Gregory
created: 2012-05-16T00:00:00+02:00
definition: Instrument d'observation astronomique dont l'objectif est un miroir. Le télescope diffère de la lunette par le fait que l'objectif est un miroir et non une lentille (ou une combinaison de lentilles).
status: 1

télescope réflecteur
type: SimpleNonPreferredTerm
modified: 2014-12-15T14:02:03+01:00
created: 2014-01-15T14:54:24+01:00
status: 1

télescope
type: PreferredTerm
modified: 2014-12-15T14:02:03+01:00
created: 2014-01-15T14:54:24+01:00
status: 1

télescope Newton
type: SimpleNonPreferredTerm
modified: 2014-12-15T14:02:03+01:00
created: 2014-01-15T14:54:24+01:00
status: 1

télescope Cassegrain
type: SimpleNonPreferredTerm
modified: 2014-12-15T14:02:03+01:00
created: 2014-01-15T14:54:24+01:00
status: 1

télescope Gregory
type: SimpleNonPreferredTerm
modified: 2014-12-15T14:02:03+01:00
created: 2014-01-15T14:54:24+01:00
status: 1

goupillon
type: Concept
modified: 2014-11-27T11:36:41+01:00
in scheme: Thésaurus de la désignation des objets mobiliers
preferred label: aspergilla @en-us
preferred label: aspersorio @it
preferred label: hissope @pt
broader: objet lié à l'ablution, à l'aspersion et à l'encensement
alternative label: aspersoir
created: 2012-05-16T00:00:00+02:00
related: chapelle de messe
definition: Instrument utilisé pour l'aspersion de l'eau bénite. Il est composé d'un manche en bois ou en métal muni soit d'une boule de métal ajourée contenant une éponge, soit d'une touffe de poils ou de végétal. Il accompagne toujours un seau à eau bénite.
TermeAssocie: chapelle de messe
status: 1
broad match: cb11936841q

aspersoir
type: SimpleNonPreferredTerm
modified: 2014-11-27T11:36:41+01:00
created: 2014-01-15T14:54:24+01:00
status: 1

goupillon
type: PreferredTerm
modified: 2014-11-27T11:36:41+01:00
created: 2014-01-15T14:54:24+01:00
status: 1

cloche de sacristie
type: Concept
modified: 2014-12-15T12:21:29+01:00
in scheme: Thésaurus de la désignation des objets mobiliers
preferred label: campanella di sacrestia @it
preferred label: sacristy bells @en-us
broader: cloche
created: 2012-05-16T00:00:00+02:00
related: sonnette d'autel
definition: Petite cloche suspendue près de la porte d'une sacristie, que le servant de messe actionne dès que le prêtre en sort, pour avertir qu'un office va être célébré.
TermeAssocie: sonnette d'autel
status: 1
broad match: http://data.bnf.fr/ark:/12148/cb119472107
broad match: Cloche

cloche de sacristie
type: PreferredTerm
modified: 2014-12-15T12:21:29+01:00
created: 2014-01-15T14:54:24+01:00
status: 1

cloche
type: Concept
modified: 2014-12-15T12:17:34+01:00
in scheme: Thésaurus de la désignation des objets mobiliers
preferred label: campana @it
preferred label: bells @en-us
narrower: cloche de sacristie
narrower: cloche de choeur
narrower: bourdon
broader: idiophone à émission par percussion directe
created: 2012-05-16T00:00:00+02:00
definition: Instrument suspendu, en métal essentiellement. De forme creuse, il émet un son, quand il est frappé, par la vibration de toute sa masse.
status: 1

machine à revêtir
type: Concept
modified: 2014-01-10T00:00:00+01:00
in scheme: Thésaurus de la désignation des objets mobiliers
narrower: machine à revêtir par enrobage
narrower: machine à revêtir par projection
narrower: machine à revêtir par dépôt
narrower: machine à revêtir par placage
broader: machine à donner un aspect
created: 2012-05-16T00:00:00+02:00
definition: Machine à déposer un revêtement sur un produit pour le protéger ou lui donner un aspect ou des qualités particulières.
status: 1

machine à revêtir par enrobage
type: Concept
modified: 2014-01-10T00:00:00+01:00
in scheme: Thésaurus de la désignation des objets mobiliers
broader: machine à revêtir
created: 2012-05-16T00:00:00+02:00
definition: Machine à revêtir un produit en le plongeant dans une substance protectrice durcissante.
status: 1

machine à revêtir par projection
type: Concept
modified: 2014-01-10T00:00:00+01:00
in scheme: Thésaurus de la désignation des objets mobiliers
broader: machine à revêtir
created: 2012-05-16T00:00:00+02:00
definition: Machine à revêtir un produit par projection d'un liquide durcissant.
status: 1

machine à revêtir par dépôt
type: Concept
modified: 2015-09-25T10:58:20+02:00
in scheme: Thésaurus de la désignation des objets mobiliers
broader: machine à revêtir
created: 2012-05-16T00:00:00+02:00
definition: Machine à revêtir un produit par un dépôt fixé à l'aide d'un procédé électrostatique, électrolytique ou mécanique.
status: 1

machine à revêtir par placage
type: Concept
modified: 2014-01-10T00:00:00+01:00
in scheme: Thésaurus de la désignation des objets mobiliers
broader: machine à revêtir
created: 2012-05-16T00:00:00+02:00
definition: Machine à revêtir un produit par l'application d'une mince couche de matière souple ou rigide.
status: 1

machine à revêtir
type: PreferredTerm
modified: 2014-01-10T00:00:00+01:00
created: 2014-01-15T14:54:24+01:00
status: 1

coffre à bois
type: Concept
modified: 2014-10-13T10:44:25+02:00
in scheme: Thésaurus de la désignation des objets mobiliers
preferred label: woodbins @en-us
broader: coffre
created: 2012-05-16T00:00:00+02:00
definition: Coffre destiné à contenir le bois à brûler. En milieu rural, il ne comporte pas de dessus, le panneau postérieur est plus élevé que le panneau antérieur, les côtés forment éventuellement un raccord entre les deux niveaux et le panneau antérieur peut être sommé d'une petite tablette horizontale servant accessoirement de siège.
status: 1
broad match: cb13162914n
broad match: Coffre

coffre à bois
type: PreferredTerm
modified: 2014-10-13T10:44:25+02:00
created: 2014-01-15T14:54:24+01:00
status: 1

machine à agglomérer
type: PreferredTerm
modified: 2015-10-08T11:46:54+02:00
created: 2014-01-15T14:54:24+01:00
status: 1

tambour nodulisateur
type: SimpleNonPreferredTerm
modified: 2015-10-08T11:46:54+02:00
created: 2014-01-15T14:54:24+01:00
status: 1

globe
type: Concept
modified: 2014-10-16T12:39:50+02:00
in scheme: Thésaurus de la désignation des objets mobiliers
preferred label: globes (lighting device components) @en-us
broader: instrument ou accessoire pour l'éclairage
created: 2012-05-16T00:00:00+02:00
related: suspension
definition: Accessoire sphérique ou hémisphérique prolongé d’une cheminée, en papier huilé ou en verre généralement dépoli, placé autour d'une source lumineuse pour protéger la flamme, tamiser et diffuser la lumière.
TermeAssocie: suspension
status: 1
broad match: cb11978573t

suspension
type: Concept
modified: 2014-12-04T12:04:34+01:00
in scheme: Thésaurus de la désignation des objets mobiliers
preferred label: hanging lamps @en-us
broader: luminaire
created: 2012-05-16T00:00:00+02:00
related: lustre d'église
related: lampe
related: globe
related: abat-jour
related: lustre de synagogue
definition: Lampe à huile, à pétrole, à acétylène, maintenue dans une monture en métal et suspendue au crochet ou au cul-de-lampe accroché au plafond. Les suspensions comportent en général une ou deux sources lumineuses et peuvent être complétées par un système de contrepoids, des abats-jours, des globes et parfois des branches rayonnantes supportant des binets pour bougies permettant aussi de combiner les deux types d'éclairage.
TermeAssocie: lustre d'église
TermeAssocie: lampe
TermeAssocie: globe
TermeAssocie: abat-jour
TermeAssocie: lustre de synagogue
status: 1

globe
type: PreferredTerm
modified: 2014-10-16T12:39:50+02:00
created: 2014-01-15T14:54:24+01:00
status: 1

trumeau de cheminée
type: Concept
modified: 2015-01-07T15:58:34+01:00
in scheme: Thésaurus de la désignation des objets mobiliers
preferred label: overmantels (interior wall components) @en-us
broader: hotte de cheminée
alternative label: cheminée de glace
created: 2012-05-16T00:00:00+02:00
related: sculpture
related: peinture
related: glace de trumeau
definition: Pan de mur entre deux baies situées au même niveau. Par extension, le terme désigne la peinture ou le panneau de glace qui l'occupe. Par extension encore, le terme s'applique à la partie saillante de la hotte de cheminée, souvent ornée d'une glace et/ou d'un tableau.
TermeAssocie: sculpture
TermeAssocie: peinture
TermeAssocie: glace de trumeau
status: 1
broad match: cb11931172v

hotte de cheminée
type: PreferredTerm
modified: 2015-01-07T16:01:04+01:00
created: 2014-01-15T14:54:24+01:00
status: 1

croix du Vendredi saint
type: Concept
modified: 2014-12-01T11:19:25+01:00
in scheme: Thésaurus de la désignation des objets mobiliers
preferred label: croce del Venerdì santo @it
preferred label: Good Friday crosses @en-us
preferred label: cruz de Sexta-feira Santa @pt
broader: objet lié aux temps de Noël et de Carême
created: 2012-05-16T00:00:00+02:00
related: linge ou garniture liés aux temps de Carême
related: croix
related: croix-reliquaire
definition: Croix, généralement de taille importante, souvent noire et sans crucifix, que l'on pose au sol, sur le coussin du Vendredi saint, lors de la cérémonie de l'adoration de la croix qui a lieu ce jour-là. Il s'agit parfois d'une croix-reliquaire.
TermeAssocie: linge ou garniture liés aux temps de Carême
TermeAssocie: croix
TermeAssocie: croix-reliquaire
status: 1
broad match: http://vocab.getty.edu/aat/300235443

croix-reliquaire
type: Concept
modified: 2014-11-26T17:14:54+01:00
in scheme: Thésaurus de la désignation des objets mobiliers
preferred label: reliquiario a croce @it
preferred label: cross reliquaries @en-us
preferred label: cruz-relicário @pt
broader: reliquaire
created: 2012-05-16T00:00:00+02:00
related: pied de croix d'autel
related: croix
related: croix du Vendredi saint
related: T69-1732
definition: Reliquaire en forme de croix sur pied à simple ou double traverse.
TermeAssocie: pied de croix d'autel
TermeAssocie: croix
TermeAssocie: croix du Vendredi saint
TermeAssocie: T69-1732
status: 1

croix du Vendredi saint
type: PreferredTerm
modified: 2014-12-01T11:19:25+01:00
created: 2014-01-15T14:54:24+01:00
status: 1

machine à imprimer à encre sèche
type: Concept
modified: 2015-10-15T11:48:16+02:00
in scheme: Thésaurus de la désignation des objets mobiliers
broader: machine à imprimer
alternative label: machine xérographie
created: 2012-05-16T00:00:00+02:00
definition: Machine à imprimer par procédé électrostatique ou thermique, permettant de reproduire à sec des documents à l'aide d'encres en poudre.
status: 1
broad match: Électrophotographie
broad match: http://vocab.getty.edu/aat/300167852
broad match: cb11949949p

machine à imprimer à encre sèche
type: PreferredTerm
modified: 2015-10-15T11:48:16+02:00
created: 2014-01-15T14:54:24+01:00
status: 1

machine xérographie
type: SimpleNonPreferredTerm
modified: 2015-10-15T11:48:16+02:00
created: 2014-01-15T14:54:24+01:00
status: 1

machine à imprimer
type: Concept
modified: 2015-10-15T10:42:13+02:00
in scheme: Thésaurus de la désignation des objets mobiliers
narrower: machine à imprimer à encre liquide
narrower: machine à imprimer à encre sèche
broader: machine à mettre en état
alternative label: machine à imprimer à sec
created: 2012-05-16T00:00:00+02:00
definition: Machine permettant de reproduire à volonté des textes ou des images par différentes méthodes d'impression.
status: 1
narrow match: http://vocab.getty.edu/aat/300022763

servante
type: Concept
modified: 2014-10-16T14:26:41+02:00
in scheme: Thésaurus de la désignation des objets mobiliers
broader: objet d'âtre pour la cuisson
created: 2012-05-16T00:00:00+02:00
definition: Armature, suspendue à la crémaillère, utilisée pour porter au dessus du feu une marmite dépourvue d’anse supérieure.
status: 1
broad match: cb11931172v
broad match: http://vocab.getty.edu/aat/300200422

servante
type: PreferredTerm
modified: 2014-10-16T14:26:41+02:00
created: 2014-01-15T14:54:24+01:00
status: 1

dais de lit
type: Concept
modified: 2014-12-04T11:11:40+01:00
in scheme: Thésaurus de la désignation des objets mobiliers
preferred label: testers & canopies (bed components) @en-us
broader: lit
alternative label: baldaquin
created: 2012-05-16T00:00:00+02:00
definition: Structure en bois garnie ou non de tissu et de tentures, qui surplombe le meuble. Le dais peut être soutenu par le meuble lui-même ou suspendu au plafond.
status: 1

lit de jour
type: Concept
modified: 2014-12-04T11:21:57+01:00
in scheme: Thésaurus de la désignation des objets mobiliers
preferred label: couches (reclining furniture) @en-us
narrower: T69-2711
narrower: T69-2707
narrower: T69-2709
narrower: T69-2705
broader: lit
created: 2012-05-16T00:00:00+02:00
related: garniture de lit
definition: Meuble de repos diurne, peu large, et présentant des garnitures fixes ou à coussins rapportés. Certains lits de jour peuvent servir de sièges à plusieurs places.
TermeAssocie: garniture de lit
status: 1
broad match: http://data.bnf.fr/ark:/12148/cb131627263
broad match: Lit (mobilier)

lit
type: PreferredTerm
modified: 2014-12-04T11:45:56+01:00
created: 2014-01-15T14:54:24+01:00
status: 1

garniture de lit
type: Concept
modified: 2014-12-12T12:25:18+01:00
in scheme: Thésaurus de la désignation des objets mobiliers
preferred label: coverings and hangings for sleeping and reclining furniture @en-us
narrower: couverture de lit
broader: garniture de meuble
alternative label: couvre-lit
alternative label: dessus de lit
alternative label: courtine de lit
alternative label: ciel de lit
created: 2012-05-16T00:00:00+02:00
related: lit
related: lit de jour
definition: Ensemble des pièces qui peuvent s'ajouter à la literie pour rendre la couche plus confortable en la protégeant du froid. La garniture comprend généralement un ciel de lit, un dossier, des pentes de lit, des courtines de lit, etc.
TermeAssocie: lit
TermeAssocie: lit de jour
status: 1

lit-alcôve
type: SimpleNonPreferredTerm
modified: 2014-12-04T11:45:56+01:00
created: 2014-01-15T14:54:24+01:00
status: 1

lit-clos
type: SimpleNonPreferredTerm
modified: 2014-12-04T11:45:56+01:00
created: 2014-01-15T14:54:24+01:00
status: 1

lit d'enfant
type: Concept
modified: 2014-12-04T11:13:09+01:00
in scheme: Thésaurus de la désignation des objets mobiliers
preferred label: children's beds @en-us
narrower: berceau
narrower: porte-berceau
broader: lit
created: 2012-05-16T00:00:00+02:00
definition: Grande caisse de plan rectangulaire, montée sur pieds et servant à coucher un enfant. Les côtés, le fond et les chevets sont pleins et/ou ajourés. Il peut comporter une capote, un dais fixe, un archet porte-voile, un pan mobile, etc.
status: 1

pot-pourri
type: Concept
modified: 2014-12-10T15:56:47+01:00
in scheme: Thésaurus de la désignation des objets mobiliers
preferred label: potpourri vases @en-us
broader: objet pour l'entretien de la maison
alternative label: pot-pourri vase à oignons
alternative label: pot-pourri pique-fleurs
alternative label: pot-pourri à bobèches
created: 2012-05-16T00:00:00+02:00
related: pique-fleurs
related: pot à pharmacie
definition: Récipient couvert comportant des ajours et contenant des matières odoriférantes liquides ou solides, qui parfument l'air ambiant. Les pots-pourris vont souvent par paire.
TermeAssocie: pique-fleurs
TermeAssocie: pot à pharmacie
status: 1

pot-pourri
type: PreferredTerm
modified: 2014-12-10T15:56:47+01:00
created: 2014-01-15T14:54:24+01:00
status: 1

pot-pourri à bobèches
type: SimpleNonPreferredTerm
modified: 2014-12-10T15:56:47+01:00
created: 2014-01-15T14:54:24+01:00
status: 1

pot-pourri vase à oignons
type: SimpleNonPreferredTerm
modified: 2014-12-10T15:56:47+01:00
created: 2014-01-15T14:54:24+01:00
status: 1

pique-fleurs
type: Concept
modified: 2014-12-05T15:25:24+01:00
in scheme: Thésaurus de la désignation des objets mobiliers
preferred label: flower frogs @en-us
broader: objet décoratif ou de rangement ou pour les plantes et les fleurs
alternative label: tulipière
alternative label: caisse pique-fleurs
alternative label: commode pique-fleurs
created: 2012-05-16T00:00:00+02:00
related: pot-pourri
definition: Récipient comportant des trous ou des goulots dans lesquels on place les tiges de fleurs.
TermeAssocie: pot-pourri
status: 1

pot-pourri pique-fleurs
type: SimpleNonPreferredTerm
modified: 2014-12-10T15:56:47+01:00
created: 2014-01-15T14:54:24+01:00
status: 1

pot à pharmacie
type: Concept
modified: 2014-01-10T00:00:00+01:00
in scheme: Thésaurus de la désignation des objets mobiliers
broader: instrument ou matériel de pharmacie
alternative label: pot-canon
alternative label: vase de pharmacie
alternative label: pot à thériaque
alternative label: albarello
alternative label: pot de monstre
alternative label: boîte à pharmacie
alternative label: bouteille de pharmacie
alternative label: pilulier
alternative label: chevrette
alternative label: pot à onguent
created: 2012-05-16T00:00:00+02:00
related: pot-pourri
TermeAssocie: pot-pourri
status: 1

panneau indicateur
type: Concept
modified: 2015-02-24T11:33:53+01:00
in scheme: Thésaurus de la désignation des objets mobiliers
preferred label: direction signs @en-us
broader: édicule ou mobilier de l'espace public ou du génie civil
created: 2012-05-16T00:00:00+02:00
definition: Plaque, positionnée à un carrefour ou le long d’une voie, indiquant la direction et parfois la distance des lieux accessibles à partir du point où l’on se trouve. Elle peut être dotée d’un éclairage propre.
status: 1

panneau indicateur
type: PreferredTerm
modified: 2015-02-24T11:33:53+01:00
created: 2014-01-15T14:54:24+01:00
status: 1

bassin de fontaine
type: PreferredTerm
modified: 2014-12-10T16:39:21+01:00
created: 2014-01-15T14:54:24+01:00
status: 1

bassin à eaux sales
type: SimpleNonPreferredTerm
modified: 2014-12-10T16:39:21+01:00
created: 2014-01-15T14:54:24+01:00
status: 1

porte-fontaine lavabo
type: Concept
modified: 2014-12-04T12:31:17+01:00
in scheme: Thésaurus de la désignation des objets mobiliers
preferred label: basin stands @en-us
broader: lavabo domestique
created: 2012-05-16T00:00:00+02:00
related: fontaine de toilette
related: bassin de fontaine
definition: Support d’applique, d’encoignure ou, rarement, de milieu, servant à porter un réservoir de fontaine surmontant un bassin, pour le lavage essentiellement des mains.
TermeAssocie: fontaine de toilette
TermeAssocie: bassin de fontaine
status: 1
broad match: http://data.bnf.fr/ark:/12148/cb119415458

fontaine de sacristie
type: Concept
modified: 2014-12-01T16:12:25+01:00
in scheme: Thésaurus de la désignation des objets mobiliers
preferred label: sacristy reservoirs @en-us
preferred label: fontana di sacrestia @it
preferred label: fonte de sacristia @pt
broader: meuble lié à l'ablution, à l'aspersion et à l'encensement
created: 2012-05-16T00:00:00+02:00
related: bassin de fontaine
definition: Réservoir d'eau muni d'un robinet, parfois placé au-dessus du lavabo de sacristie ou ensemble composé d'un réservoir de fontaine et d'un bassin de fontaine.
TermeAssocie: bassin de fontaine
status: 1
broad match: http://data.bnf.fr/ark:/12148/cb155956055
broad match: http://vocab.getty.edu/aat/300007381

porte-fontaine à eau potable
type: Concept
modified: 2014-09-11T17:09:07+02:00
in scheme: Thésaurus de la désignation des objets mobiliers
broader: T69-3235
created: 2012-05-16T00:00:00+02:00
related: bassin de fontaine
definition: Support en forme de petite table basse circulaire ou rectangulaire, avec rebord dans la masse, ou cadre monté sur trois pieds bas, servant à recevoir la fontaine à eau potable laquelle comporte un (ou des) robinet(s) inférieur(s). Elle est placée dans la cuisine.
TermeAssocie: bassin de fontaine
status: 1
broad match: http://vocab.getty.edu/aat/300006181

tympanon
type: Concept
modified: 2014-12-15T12:05:12+01:00
in scheme: Thésaurus de la désignation des objets mobiliers
preferred label: dulcimers @en-us
broader: cithare à cordes frappées ou pincées
alternative label: dulcimer
alternative label: cymbalum
created: 2012-05-16T00:00:00+02:00
definition: Instrument en bois de forme trapézoïdale qui possède une vingtaine de chœurs de deux à six cordes pour chacun, et plusieurs chevalets ; le nombre des roses varie. Les cordes sont frappées avec de petits maillets ou pincées avec un plectre. L'instrument est joué posé sur une table ou sur les genoux ou appuyé sur la poitrine.
status: 1

tympanon
type: PreferredTerm
modified: 2014-12-15T12:05:12+01:00
created: 2014-01-15T14:54:24+01:00
status: 1

dulcimer
type: SimpleNonPreferredTerm
modified: 2014-12-15T12:05:12+01:00
created: 2014-01-15T14:54:24+01:00
status: 1

cymbalum
type: SimpleNonPreferredTerm
modified: 2014-12-15T12:05:12+01:00
created: 2014-01-15T14:54:24+01:00
status: 1

oratoire domestique
type: Concept
modified: 2014-11-26T16:37:01+01:00
in scheme: Thésaurus de la désignation des objets mobiliers
preferred label: domestic shrines @en-us
preferred label: oratorio domestico @it
preferred label: oratório doméstico @pt
broader: objet de dévotion
alternative label: autel domestique
created: 2012-05-16T00:00:00+02:00
related: chapelle à Vierge
definition: Représentation d'un sujet religieux, utilisée pour la dévotion privée. Il s’agit souvent d'une boîte ouvrante vitrée ou d'une niche abritant un ou plusieurs personnages religieux ou une croix.
TermeAssocie: chapelle à Vierge
status: 1

oratoire domestique
type: PreferredTerm
modified: 2014-11-26T16:37:01+01:00
created: 2014-01-15T14:54:24+01:00
status: 1

chapelle à Vierge
type: Concept
modified: 2014-10-13T13:40:09+02:00
in scheme: Thésaurus de la désignation des objets mobiliers
broader: meuble lié aux coutumes et cultes domestiques
created: 2012-05-16T00:00:00+02:00
related: oratoire domestique
definition: Niche ou petite armoire suspendue, à battant plein ou vitré, destinée à abriter une statuette de la Vierge servant au culte domestique et placée dans la pièce commune.
TermeAssocie: oratoire domestique
status: 1

autel domestique
type: SimpleNonPreferredTerm
modified: 2014-11-26T16:37:01+01:00
created: 2014-01-15T14:54:24+01:00
status: 1

cyclomoteur
type: SimpleNonPreferredTerm
modified: 2014-12-30T10:26:19+01:00
created: 2014-01-15T14:54:24+01:00
status: 1

véhicule motorisé à deux ou trois roues
type: PreferredTerm
modified: 2014-12-30T10:26:19+01:00
created: 2014-01-15T14:54:24+01:00
status: 1

scooter
type: SimpleNonPreferredTerm
modified: 2014-12-30T10:26:19+01:00
created: 2014-01-15T14:54:24+01:00
status: 1

motocyclette
type: SimpleNonPreferredTerm
modified: 2014-12-30T10:26:19+01:00
created: 2014-01-15T14:54:24+01:00
status: 1

jeu de cartes ou de société
type: Concept
modified: 2014-12-30T13:13:01+01:00
in scheme: Thésaurus de la désignation des objets mobiliers
preferred label: cards, table and board game sets @en-us
narrower: accessoire de jeu de société
narrower: jeu d'échecs
narrower: jeu de dames
broader: jeu, jouet et sport
alternative label: jeu de tables
alternative label: jeu de l'oie
alternative label: jeu de domino
alternative label: jeu de plateau
created: 2012-05-16T00:00:00+02:00
definition: Ensemble cohérent d'éléments (plateau, cartes, pions, etc.) nécessaires à la pratique de certains jeux faisant essentiellement appel aux capacités intellectuelles de réflexion, d'observation, de vivacité, de dissimulation, etc.
status: 1

pion de jeu
type: SimpleNonPreferredTerm
modified: 2014-12-30T13:07:57+01:00
created: 2014-01-15T14:54:24+01:00
status: 1

accessoire de jeu de société
type: PreferredTerm
modified: 2014-12-30T13:07:57+01:00
created: 2014-01-15T14:54:24+01:00
status: 1

dé à jouer
type: SimpleNonPreferredTerm
modified: 2014-12-30T13:07:57+01:00
created: 2014-01-15T14:54:24+01:00
status: 1

tapis de jeu
type: SimpleNonPreferredTerm
modified: 2014-12-30T13:07:57+01:00
created: 2014-01-15T14:54:24+01:00
status: 1

canot de service
type: SimpleNonPreferredTerm
modified: 2014-12-19T16:23:46+01:00
created: 2014-01-15T14:54:24+01:00
status: 1

annexe de bord
type: PreferredTerm
modified: 2014-12-19T16:23:46+01:00
created: 2014-01-15T14:54:24+01:00
status: 1

carte de visite
type: SimpleNonPreferredTerm
modified: 2014-12-03T15:08:37+01:00
created: 2014-01-15T14:54:24+01:00
status: 1

carte postale
type: SimpleNonPreferredTerm
modified: 2014-12-03T15:08:37+01:00
created: 2014-01-15T14:54:24+01:00
status: 1

document imprimé
type: PreferredTerm
modified: 2014-12-03T15:08:37+01:00
created: 2014-01-15T14:54:24+01:00
status: 1

faire-part
type: SimpleNonPreferredTerm
modified: 2014-12-03T15:08:37+01:00
created: 2014-01-15T14:54:24+01:00
status: 1

carte de vœux
type: SimpleNonPreferredTerm
modified: 2014-12-03T15:08:37+01:00
created: 2014-01-15T14:54:24+01:00
status: 1

timbre
type: SimpleNonPreferredTerm
modified: 2014-12-03T15:08:37+01:00
created: 2014-01-15T14:54:24+01:00
status: 1

partition
type: SimpleNonPreferredTerm
modified: 2014-12-03T15:08:37+01:00
created: 2014-01-15T14:54:24+01:00
status: 1

cornet à bouquin
type: Concept
modified: 2014-10-10T12:01:36+02:00
in scheme: Thésaurus de la désignation des objets mobiliers
preferred label: cornetts @en-us
narrower: T69-5155
broader: trompette chromatique
created: 2012-05-16T00:00:00+02:00
definition: Instrument généralement en bois recouvert de cuir ou de parchemin. Il est formé d'un corps (le cornet) percé de 6 ou 7 trous et d'une embouchure démontable (le bouquin) en forme de coupe, qui le rapproche du cornet à pistons moderne. Il se joue généralement au coin de la bouche.
status: 1

saxhorn
type: SimpleNonPreferredTerm
modified: 2014-10-10T12:11:03+02:00
created: 2014-01-15T14:54:24+01:00
status: 1

ophicléide
type: Concept
modified: 2014-12-15T10:47:05+01:00
in scheme: Thésaurus de la désignation des objets mobiliers
preferred label: ophicleides @en-us
broader: trompette chromatique
alternative label: contrebasse d'harmonie
alternative label: basson russe
alternative label: basse d'harmonie
created: 2012-05-16T00:00:00+02:00
definition: Instrument en cuivre muni généralement de onze clés. Constitué d'un long tuyau replié sur lui-même, il a la forme d'un U étroit. Le basson russe est en bois et peut avoir une embouchure zoomorphe.
status: 1

trombone
type: Concept
modified: 2014-12-15T10:48:04+01:00
in scheme: Thésaurus de la désignation des objets mobiliers
preferred label: trombones (trumpets) @en-us
broader: trompette chromatique
alternative label: trombone à pistons
alternative label: trombone à coulisse
alternative label: sacqueboute
created: 2012-05-16T00:00:00+02:00
definition: Instrument en cuivre dessinant un S dont l'embouchure est en forme de cuvette et le pavillon évasé. Dans le trombone à coulisse, la hauteur du son varie en fonction de la position de la coulisse télescopique qui est remplacée par des pistons dans le trombone à pistons.
status: 1

trompette
type: Concept
modified: 2014-12-15T10:50:01+01:00
in scheme: Thésaurus de la désignation des objets mobiliers
preferred label: trumpets (aerophones) @en-us
broader: trompette chromatique
alternative label: trombone à clés
alternative label: trompette d'harmonie
alternative label: trompette à pistons
alternative label: trompette à coulisse
created: 2012-05-16T00:00:00+02:00
definition: Instrument en cuivre à tuyau enroulé sur lui-même, à embouchure et pavillon. La trompette possède une coulisse ou des pistons.
status: 1

cornet à pistons
type: Concept
modified: 2014-10-10T12:04:00+02:00
in scheme: Thésaurus de la désignation des objets mobiliers
preferred label: cornets @en-us
broader: trompette chromatique
created: 2012-05-16T00:00:00+02:00
definition: Instrument en cuivre à deux puis trois pistons ; le tube qui prolonge l'embouchure est très long et s'enroule plusieurs fois sur lui-même ; le pavillon est très évasé. L'instrument est plus court et plus ramassé que la trompette et il est utilisé surtout dans les orchestres et les fanfares.
status: 1

trompette chromatique
type: PreferredTerm
modified: 2014-10-10T12:11:03+02:00
created: 2014-01-15T14:54:24+01:00
status: 1

tuba
type: Concept
modified: 2014-10-10T12:12:00+02:00
in scheme: Thésaurus de la désignation des objets mobiliers
preferred label: tubas @en-us
broader: trompette chromatique
alternative label: hélicon
created: 2012-05-16T00:00:00+02:00
definition: Instrument en cuivre à trois ou six pistons, très rarement sept, constitué d'un tuyau enroulé sur lui-même à embouchure assez profonde et à pavillon. D'une tonalité proche de celle du serpent ou du basson russe, il est utilisé comme basse dans les orchestres. L'hélicon, sorte de grand tuba contrebasse, est utilisé dans les fanfares.
status: 1

pupitre d'autel
type: PreferredTerm
modified: 2014-11-27T13:22:07+01:00
created: 2014-01-15T14:54:24+01:00
status: 1

voile de pupitre d'autel
type: Concept
modified: 2014-12-02T16:12:50+01:00
in scheme: Thésaurus de la désignation des objets mobiliers
preferred label: missal stand covers @en-us
preferred label: coprileggio d'altare @it
preferred label: pano de estante de missal @pt
broader: linge ou garniture liés à l'autel
alternative label: couverture de porte-missel
alternative label: voile épistolier
created: 2012-05-16T00:00:00+02:00
related: pupitre d'autel
definition: Bande de tissu rectangulaire ou housse de la couleur du temps liturgique, utilisée pour recouvrir un pupitre d'autel.
TermeAssocie: pupitre d'autel
status: 1

trépied d'autel
type: SimpleNonPreferredTerm
modified: 2014-11-27T13:22:07+01:00
created: 2014-01-15T14:54:24+01:00
status: 1

porte-missel
type: SimpleNonPreferredTerm
modified: 2014-11-27T13:22:07+01:00
created: 2014-01-15T14:54:24+01:00
status: 1

épée
type: Concept
modified: 2014-12-12T14:56:11+01:00
in scheme: Thésaurus de la désignation des objets mobiliers
preferred label: swords @en-us
broader: arme blanche
alternative label: rapière
created: 2012-05-16T00:00:00+02:00
definition: Arme blanche formée d'une longue lame (fusée) symétrique, à deux tranchants affilés, et pourvue d'une gouttière ou d'une nervure, d'une poignée et généralement d'une garde.
status: 1

épée
type: PreferredTerm
modified: 2014-12-12T14:56:11+01:00
created: 2014-01-15T14:54:24+01:00
status: 1

rapière
type: SimpleNonPreferredTerm
modified: 2014-12-12T14:56:11+01:00
created: 2014-01-15T14:54:24+01:00
status: 1

relief écrasé
type: Concept
modified: 2014-10-17T16:18:53+02:00
in scheme: Thésaurus de la désignation des objets mobiliers
broader: bas-relief
alternative label: schiacciato
created: 2012-05-16T00:00:00+02:00
definition: Bas-relief dont les formes modelées ont très peu de saillie et se dégagent très faiblement du fond sur lequel elles sont sculptées.
status: 1
broad match: http://vocab.getty.edu/aat/300184633

relief semi-méplat
type: Concept
modified: 2014-12-03T17:03:43+01:00
in scheme: Thésaurus de la désignation des objets mobiliers
broader: bas-relief
created: 2012-05-16T00:00:00+02:00
definition: Bas-relief composé de deux plans seulement comme le relief méplat, mais qui présente un léger modelé et dont les formes ont des contours arrondis et non des arêtes vives.
status: 1
broad match: http://vocab.getty.edu/aat/300184633
broad match: Bas-relief

bas-relief
type: PreferredTerm
modified: 2014-12-03T16:51:23+01:00
created: 2014-01-15T14:54:24+01:00
status: 1

relief méplat
type: Concept
modified: 2014-12-03T16:53:51+01:00
in scheme: Thésaurus de la désignation des objets mobiliers
broader: bas-relief
created: 2012-05-16T00:00:00+02:00
definition: Bas-relief composé de deux plans seulement : le plan des formes et celui du fond. Ces reliefs à arêtes vives et de faible épaisseur sont dépourvus de modelé.
status: 1
broad match: http://vocab.getty.edu/aat/300184633
broad match: Bas-relief

basse-taille
type: SimpleNonPreferredTerm
modified: 2014-12-03T16:51:23+01:00
created: 2014-01-15T14:54:24+01:00
status: 1

clef d'accord
type: Concept
modified: 2014-09-03T16:16:12+02:00
in scheme: Thésaurus de la désignation des objets mobiliers
broader: accessoire du musicien
alternative label: clé d'accord
alternative label: accordoir
created: 2012-05-16T00:00:00+02:00
definition: Instrument d'accordeur avec lequel on accorde harpes, orgues et pianos. Pour les orgues, il peut se présenter sous la forme d'un cône creux pour écarter ou refermer les extrémités des tuyaux des orgues ou sous celle d'une lame lourde pour baisser ou relever des rasettes d'anches. Pour les pianos ou les harpes, il s'agit d'une clef qui permet de tourner les têtes des chevilles pour tendre les cordes.
status: 1
broad match: http://data.bnf.fr/ark:/12148/cb119367821
broad match: http://vocab.getty.edu/aat/300222997

clé d'accord
type: SimpleNonPreferredTerm
modified: 2014-09-03T16:16:12+02:00
created: 2014-01-15T14:54:24+01:00
status: 1

clef d'accord
type: PreferredTerm
modified: 2014-09-03T16:16:12+02:00
created: 2014-01-15T14:54:24+01:00
status: 1

accordoir
type: SimpleNonPreferredTerm
modified: 2014-09-03T16:16:12+02:00
created: 2014-01-15T14:54:24+01:00
status: 1

bateau de débarquement
type: PreferredTerm
modified: 2014-10-16T10:20:20+02:00
created: 2014-01-15T14:54:24+01:00
status: 1

transport d'assaut
type: SimpleNonPreferredTerm
modified: 2014-10-16T10:20:20+02:00
created: 2014-01-15T14:54:24+01:00
status: 1

berline
type: Concept
modified: 2014-12-30T10:27:57+01:00
in scheme: Thésaurus de la désignation des objets mobiliers
preferred label: sedans @en-us
broader: voiture automobile
alternative label: limousine
alternative label: break
created: 2013-11-06T00:00:00+01:00
definition: Voiture automobile fermée comportant deux ou quatre portières.
status: 1

limousine
type: SimpleNonPreferredTerm
modified: 2014-12-30T10:27:57+01:00
created: 2014-01-15T14:54:24+01:00
status: 1

berline
type: PreferredTerm
modified: 2014-12-30T10:27:57+01:00
created: 2014-01-15T14:54:24+01:00
status: 1

break
type: SimpleNonPreferredTerm
modified: 2014-12-30T10:27:57+01:00
created: 2014-01-15T14:54:24+01:00
status: 1

chaland
type: PreferredTerm
modified: 2014-12-18T11:43:53+01:00
created: 2014-01-15T14:54:24+01:00
status: 1

allège
type: SimpleNonPreferredTerm
modified: 2014-12-18T11:43:53+01:00
created: 2014-01-15T14:54:24+01:00
status: 1

machine à insérer
type: PreferredTerm
modified: 2015-10-08T14:13:26+02:00
created: 2014-01-15T14:54:24+01:00
status: 1

casque d'armure
type: Concept
modified: 2014-12-12T12:41:25+01:00
in scheme: Thésaurus de la désignation des objets mobiliers
preferred label: body armor : helmets @en-us
broader: armure ou élément d'armure
alternative label: bacinet
alternative label: armet
alternative label: morion
alternative label: bourguignotte
created: 2012-05-16T00:00:00+02:00
definition: Pièce d'armure destinée à protéger la tête du combattant.
status: 1

armure ou élément d'armure
type: Concept
modified: 2014-12-12T12:39:21+01:00
in scheme: Thésaurus de la désignation des objets mobiliers
preferred label: armors or armor components @en-us
narrower: casque d'armure
broader: arme défensive
alternative label: plastron d'armure
alternative label: jambière d'armure
alternative label: cubitière
alternative label: grève
alternative label: harnois
alternative label: hausse-col
alternative label: soleret
created: 2012-05-16T00:00:00+02:00
definition: Pièce ou ensemble de pièces, généralement métalliques, qui protègent le corps du combattant des coups portés par l'adversaire.
status: 1

casque d'armure
type: PreferredTerm
modified: 2014-12-12T12:41:25+01:00
created: 2014-01-15T14:54:24+01:00
status: 1

armet
type: SimpleNonPreferredTerm
modified: 2014-12-12T12:41:25+01:00
created: 2014-01-15T14:54:24+01:00
status: 1

bacinet
type: SimpleNonPreferredTerm
modified: 2014-12-12T12:41:25+01:00
created: 2014-01-15T14:54:24+01:00
status: 1

morion
type: SimpleNonPreferredTerm
modified: 2014-12-12T12:41:25+01:00
created: 2014-01-15T14:54:24+01:00
status: 1

bourguignotte
type: SimpleNonPreferredTerm
modified: 2014-12-12T12:41:25+01:00
created: 2014-01-15T14:54:24+01:00
status: 1

schiacciato
type: SimpleNonPreferredTerm
modified: 2014-10-17T16:18:53+02:00
created: 2014-01-15T14:54:24+01:00
status: 1

relief écrasé
type: PreferredTerm
modified: 2014-10-17T16:18:53+02:00
created: 2014-01-15T14:54:24+01:00
status: 1

gemme
type: Concept
modified: 2014-10-23T11:06:10+02:00
in scheme: Thésaurus de la désignation des objets mobiliers
preferred label: gemstone @en-us
broader: élément minéral
created: 2013-11-29T00:00:00+01:00
definition: Matière dure, minérale (pierre précieuse ou fine) ou organique (perle, ambre, corail, nacre, nacre, jais, etc.), attrayante par sa couleur et sa rareté. Lorsqu'il est taillé, le gemme est principalement utilisé pour la joaillerie et l'orfèvrerie.
status: 1

élément minéral
type: Concept
modified: 2014-12-15T16:09:56+01:00
in scheme: Thésaurus de la désignation des objets mobiliers
preferred label: mineral @en-us
narrower: gemme
narrower: T69-9445
broader: T69-9441
created: 2013-12-20T00:00:00+01:00
definition: Élément provenant d’une substance inorganique formée naturellement (mais parfois synthétisée artificiellement).
status: 1

gemme
type: PreferredTerm
modified: 2014-10-23T11:06:10+02:00
created: 2014-01-15T14:54:24+01:00
status: 1

presse à fromage
type: PreferredTerm
modified: 2014-12-04T15:09:46+01:00
created: 2014-01-15T14:54:24+01:00
status: 1

linge ou garniture liés aux rites funéraires
type: Concept
modified: 2014-12-03T10:41:50+01:00
in scheme: Thésaurus de la désignation des objets mobiliers
preferred label: lini e coperture per i riti funerari @it
preferred label: linen and ornaments for funeral rites @en-us
preferred label: guarnições relacionadas com os ritos funerários @pt
narrower: bannière funéraire
narrower: tenture funéraire
narrower: parure de cheval de corbillard
narrower: coussin mortuaire
narrower: garniture de dais funéraire
narrower: garniture de corbillard
narrower: tenture de catafalque
narrower: drap mortuaire
broader: linge ou garniture du culte catholique
created: 2012-05-16T00:00:00+02:00
definition: Pièce textile de couleur violette ou noire le plus souvent, utilisée exclusivement au moment des cérémonies funéraires. Elle peut présenter des motifs funéraires.
status: 1

linge ou garniture liés aux rites funéraires
type: PreferredTerm
modified: 2014-12-03T10:41:50+01:00
created: 2014-01-15T14:54:24+01:00
status: 1

parure de cheval de corbillard
type: Concept
modified: 2014-12-03T10:50:07+01:00
in scheme: Thésaurus de la désignation des objets mobiliers
preferred label: funeral caparisons @en-us
preferred label: bardatura funebre @it
preferred label: jaezes fúnebres @pt
broader: linge ou garniture liés aux rites funéraires
alternative label: carapaçon de corbillard
alternative label: couverture pour cheval de corbillard
created: 2012-05-16T00:00:00+02:00
related: T69-8144
definition: Etoffes parant le cheval ou les chevaux qui tirent un corbillard : caparaçon ou couverture d’apparat, camail (pour la tête et l’encolure), bandes de tissu (pour couvrir les guides), écharpe de guide, et plumets.
TermeAssocie: T69-8144
status: 1

coussin mortuaire
type: Concept
modified: 2014-12-03T10:44:03+01:00
in scheme: Thésaurus de la désignation des objets mobiliers
preferred label: cuscino funebre @it
preferred label: funeral cushions @en-us
preferred label: almofada funerária @pt
broader: linge ou garniture liés aux rites funéraires
alternative label: coussin funéraire
created: 2012-05-16T00:00:00+02:00
definition: Coussin sur lequel sont présentés les insignes et les décorations d'un défunt durant la cérémonie funèbre. Il est alors posé au-dessus du drap mortuaire.
status: 1

garniture de dais funéraire
type: Concept
modified: 2014-12-03T10:49:15+01:00
in scheme: Thésaurus de la désignation des objets mobiliers
preferred label: guarnizione del baldacchino funebre @it
preferred label: funeral canopy hangings @en-us
preferred label: ornamento de baldaquino fúnebre @pt
broader: linge ou garniture liés aux rites funéraires
alternative label: rideau de dais funéraire
alternative label: pente de dais funéraire
alternative label: ciel de dais funéraire
created: 2012-05-16T00:00:00+02:00
related: catafalque
related: dais funéraire
definition: Garnitures et décors d'amortissement (boules, panaches, etc.) d'un dais funéraire : pentes souvent garnies de franges et de pompons, ciel de dais funéraire et rideaux placés aux angles.
TermeAssocie: catafalque
TermeAssocie: dais funéraire
status: 1

garniture de corbillard
type: Concept
modified: 2014-12-03T10:48:31+01:00
in scheme: Thésaurus de la désignation des objets mobiliers
preferred label: guarnizione del carro funebre @it
preferred label: hearse hangings @en-us
preferred label: ornamento de carro funerário @pt
broader: linge ou garniture liés aux rites funéraires
alternative label: rideau de corbillard
alternative label: housse de siège de corbillard
alternative label: pente de corbillard
created: 2012-05-16T00:00:00+02:00
related: T69-8144
definition: Garnitures et décors d'amortissement d'amortissement (boules, panaches, etc.) d'un corbillard : pentes garnies de franges et de pompons, rideaux placés aux angles et housse de siège.
TermeAssocie: T69-8144
status: 1

tenture de catafalque
type: Concept
modified: 2014-12-03T10:51:50+01:00
in scheme: Thésaurus de la désignation des objets mobiliers
preferred label: catafalque hangings @en-us
preferred label: coltre del catafalco @it
preferred label: ornamento de catafalco @pt
broader: linge ou garniture liés aux rites funéraires
alternative label: pente de catafalque
alternative label: ciel de catafalque
alternative label: rideau de catafalque
created: 2012-05-16T00:00:00+02:00
related: catafalque
definition: Etoffes recouvrant la plate-forme d'un catafalque et, le cas échéant, son baldaquin : ciel, pente ou rideau de catafalque.
TermeAssocie: catafalque
status: 1

drap mortuaire
type: Concept
modified: 2014-12-03T10:46:47+01:00
in scheme: Thésaurus de la désignation des objets mobiliers
preferred label: funeral palls @en-us
preferred label: coltre funebre @it
preferred label: pano mortuário @pt
broader: linge ou garniture liés aux rites funéraires
alternative label: drap funéraire
alternative label: poêle funéraire
created: 2012-05-16T00:00:00+02:00
related: catafalque
related: cercueil
definition: Drap orné d’une grande croix, destiné à recouvrir, durant la cérémonie funèbre, un cercueil ou la partie d'un catafalque imitant un cercueil.
TermeAssocie: catafalque
TermeAssocie: cercueil
status: 1

plat vire-poisson
type: SimpleNonPreferredTerm
modified: 2014-10-16T17:04:48+02:00
created: 2014-01-15T14:54:24+01:00
status: 1

vire-omelette
type: PreferredTerm
modified: 2014-10-16T17:04:48+02:00
created: 2014-01-15T14:54:24+01:00
status: 1

thabor
type: Concept
modified: 2014-11-27T15:40:48+01:00
in scheme: Thésaurus de la désignation des objets mobiliers
preferred label: thabors @en-us
preferred label: espositorio eucaristico @it
preferred label: base para ostensório @pt
broader: objet lié à l'Eucharistie
created: 2012-05-16T00:00:00+02:00
related: pupitre-thabor
definition: Support en métal ou en bois, destiné à surélever l'ostensoir lors de l'exposition du saint sacrement. Il est mobile ou fixé sur le tabernacle et souvent orné de représentations ou de symboles eucharistiques.
TermeAssocie: pupitre-thabor
status: 1
broad match: http://vocab.getty.edu/aat/300234147

thabor porte-missel
type: SimpleNonPreferredTerm
modified: 2014-11-27T13:25:32+01:00
created: 2014-01-15T14:54:24+01:00
status: 1

pupitre-thabor
type: PreferredTerm
modified: 2014-11-27T13:25:32+01:00
created: 2014-01-15T14:54:24+01:00
status: 1

épinette des Vosges
type: Concept
modified: 2014-10-10T13:10:01+02:00
in scheme: Thésaurus de la désignation des objets mobiliers
preferred label: épinettes des Vosges @en-us
broader: cithare à cordes frappées ou pincées
created: 2012-05-16T00:00:00+02:00
definition: CIthare sur caisse de forme parallélépipédique très allongée (qui évoque le manche d'un instrument à cordes) dont les cordes sont en partie mélodique, en partie bourdon. La table d'harmonie comporte de nombreuses frettes (barrettes) et deux ouvertures. On appuie sur les cordes de l'instrument, posé sur une table, avec un bâtonnet tenu dans la main gauche tandis que la main droite pince les cordes à l'aide d'un plectre.
status: 1

cordophone simple
type: Concept
modified: 2014-10-10T13:01:41+02:00
in scheme: Thésaurus de la désignation des objets mobiliers
preferred label: zitherlike chordophones @en-us
narrower: cithare à cordes frappées ou pincées
narrower: cithare à clavier
broader: T69-5014
alternative label: cithare
alternative label: harpe éolienne
alternative label: pluriarc
alternative label: arc musical
created: 2012-05-16T00:00:00+02:00
definition: Instrument de formes variées constitué d'un support et de cordes. Celles-ci peuvent être fixées à un bâton, un tube, un radeau (assemblage de bâton), une planche, un cadre. Il peut comprendre un élément résonant, table d'harmonie ou caisse de résonance, qui est alors indépendant. On utilise parfois improprement le terme générique cithare (traduction littérale de l'allemand Zither) pour qualifier les cordophones simples.
status: 1
broad match: Instrument à cordes

bûche des Flandres
type: SimpleNonPreferredTerm
modified: 2014-10-10T13:08:58+02:00
created: 2014-01-15T14:54:24+01:00
status: 1

cithare à cordes frappées ou pincées
type: PreferredTerm
modified: 2014-10-10T13:08:58+02:00
created: 2014-01-15T14:54:24+01:00
status: 1

tambourin à cordes
type: SimpleNonPreferredTerm
modified: 2014-10-10T13:08:58+02:00
created: 2014-01-15T14:54:24+01:00
status: 1

tambourin ossalois
type: SimpleNonPreferredTerm
modified: 2014-10-10T13:08:58+02:00
created: 2014-01-15T14:54:24+01:00
status: 1

tambourin souletin
type: SimpleNonPreferredTerm
modified: 2014-10-10T13:08:58+02:00
created: 2014-01-15T14:54:24+01:00
status: 1

tambourin de Béarn
type: SimpleNonPreferredTerm
modified: 2014-10-10T13:08:58+02:00
created: 2014-01-15T14:54:24+01:00
status: 1

tambourin de Gascogne
type: SimpleNonPreferredTerm
modified: 2014-10-10T13:08:58+02:00
created: 2014-01-15T14:54:24+01:00
status: 1

bâton de chantre
type: Concept
modified: 2014-11-26T13:50:28+01:00
in scheme: Thésaurus de la désignation des objets mobiliers
preferred label: cantor's staffs @en-us
preferred label: mazza corale @it
preferred label: maça coral @pt
broader: insigne ecclésiastique
alternative label: bâton cantoral
alternative label: crosse de pré-chantre
created: 2012-05-16T00:00:00+02:00
definition: Insigne tenu par le chantre dans la main droite pour indiquer sa dignité, diriger le chant, ou faire respecter l'ordre à l'intérieur du chœur. Généralement en matériaux précieux, et porté par une hampe, il peut avoir la forme d’une férule, d’un tau ou présenter au sommet une statuette, etc.
status: 1

plateau de présentation
type: Concept
modified: 2014-11-26T14:11:32+01:00
in scheme: Thésaurus de la désignation des objets mobiliers
preferred label: presentation trays @en-us
preferred label: piatto portaguanti @it
preferred label: salva de apresentação @pt
broader: insigne ecclésiastique
alternative label: plateau à gants et à anneau
created: 2012-05-16T00:00:00+02:00
related: anneau pastoral
related: gants pontificaux
definition: Plateau utilisé notamment lors des messes pontificales pour déposer à l'Offertoire les gants pontificaux et l'anneau de l'évêque qui assiste à la messe. Il porte souvent les armoiries de l'évêque pour lequel il a été fabriqué.
TermeAssocie: anneau pastoral
TermeAssocie: gants pontificaux
status: 1

insigne ecclésiastique
type: PreferredTerm
modified: 2014-11-26T12:37:59+01:00
created: 2014-01-15T14:54:24+01:00
status: 1

bâton pastoral
type: Concept
modified: 2014-11-26T13:54:31+01:00
in scheme: Thésaurus de la désignation des objets mobiliers
preferred label: pastoral staffs @en-us
preferred label: bastone pastorale @it
preferred label: bastão pastoral @pt
narrower: T69-1843
broader: insigne ecclésiastique
alternative label: croix pastorale
alternative label: tau
alternative label: férule
alternative label: croix papale
created: 2012-05-16T00:00:00+02:00
related: voile huméral
related: croix de procession
definition: Bâton porté comme insigne de sa dignité par un haut dignitaire ecclésiastique, qui peut avoir la forme d’une crosse ou croix pastorale, d’une férule (en forme de sceptre, terminé par un pommeau surmonté d’une croix), ou d’un tau (en forme de T). La croix pastorale est portée devant le pape ou un archevêque. La croix papale a souvent trois traverses.
TermeAssocie: voile huméral
TermeAssocie: croix de procession
status: 1

boîte de chapelle de messe
type: Concept
modified: 2014-11-26T12:25:47+01:00
in scheme: Thésaurus de la désignation des objets mobiliers
broader: boîte et coffret pour le rangement des objets liturgiques
alternative label: coffret de chapelle de messe
created: 2012-05-16T00:00:00+02:00
definition: Coffret contenant et protégeant l’ensemble des objets liturgiques et vases sacrés compris dans une chapelle de messe. Des compartiments intérieurs épousant la forme des objets contenus permettent de les maintenir.
status: 1
broad match: http://vocab.getty.edu/aat/300194500

boîte de chapelle de messe
type: PreferredTerm
modified: 2014-11-26T12:25:47+01:00
created: 2014-01-15T14:54:24+01:00
status: 1

coffret de chapelle de messe
type: SimpleNonPreferredTerm
modified: 2014-11-26T12:25:47+01:00
created: 2014-01-15T14:54:24+01:00
status: 1

polyptyque en boîte à volets
type: Concept
modified: 2014-12-01T13:06:15+01:00
in scheme: Thésaurus de la désignation des objets mobiliers
preferred label: retablo ad ante @it
preferred label: retable-tabernacle @en-us
preferred label: políptico de caixa com volantes @pt
broader: polyptyque
created: 2012-05-16T00:00:00+02:00
definition: Retable constitué de volets articulés sur un fond, formant une caisse et renfermant une statue ou un groupe sculpté représentant la Vierge à l'Enfant placée au centre. Les polyptyques en boîte à volets étaient généralement posés au sommet de retables.
status: 1
broad match: http://data.bnf.fr/ark:/12148/cb133240296
broad match: http://vocab.getty.edu/aat/300178235
broad match: Polyptyque

polyptyque en boîte à volets
type: PreferredTerm
modified: 2014-12-01T13:06:15+01:00
created: 2014-01-15T14:54:24+01:00
status: 1

matériel scientifique ou d'aide à la navigation flottant
type: Concept
modified: 2014-10-16T10:56:54+02:00
in scheme: Thésaurus de la désignation des objets mobiliers
preferred label: aids to navigation @en-us
narrower: bateau phare
narrower: balise maritime
broader: matériel flottant stationnaire
created: 2012-05-16T00:00:00+02:00
definition: Matériel flottant facilitant la navigation ou permettant une meilleure connaissance du milieu marin.
status: 1

matériel scientifique ou d'aide à la navigation flottant
type: PreferredTerm
modified: 2014-10-16T10:56:54+02:00
created: 2014-01-15T14:54:24+01:00
status: 1

bateau phare
type: Concept
modified: 2014-12-19T16:42:47+01:00
in scheme: Thésaurus de la désignation des objets mobiliers
preferred label: lightships @en-us
broader: matériel scientifique ou d'aide à la navigation flottant
alternative label: bateau-feu
created: 2013-11-04T00:00:00+01:00
definition: Bateau mouillé en un point déterminé qui porte un phare aidant à la navigation.
status: 1

matériel flottant stationnaire
type: Concept
modified: 2014-09-17T17:15:29+02:00
in scheme: Thésaurus de la désignation des objets mobiliers
narrower: équipement portuaire flottant
narrower: matériel scientifique ou d'aide à la navigation flottant
narrower: T69-6327
narrower: T69-6343
narrower: T69-6341
broader: matériel de transport nautique
created: 2012-05-16T00:00:00+02:00
definition: Matériel flottant immobilisé en raison de sa fonction.
status: 1

balise maritime
type: Concept
modified: 2014-12-19T16:40:59+01:00
in scheme: Thésaurus de la désignation des objets mobiliers
preferred label: buoys @en-us
broader: matériel scientifique ou d'aide à la navigation flottant
alternative label: bouée océanographique
alternative label: bouée de signalisation
alternative label: bouée hydrographique
alternative label: bouée météorologique
created: 2013-11-04T00:00:00+01:00
definition: Matériel flottant ancré servant à des mesures scientifiques, de repère, de signal ou de marque de parcours.
status: 1

machine à contrôler la qualité
type: Concept
modified: 2015-08-11T12:32:07+02:00
in scheme: Thésaurus de la désignation des objets mobiliers
broader: machine à contrôler
alternative label: banc d'essai
created: 2012-05-16T00:00:00+02:00
definition: Machine à contrôler la présence d'anomalies.
status: 1
narrow match: Banc de test

machine à contrôler la qualité
type: PreferredTerm
modified: 2015-08-11T12:32:07+02:00
created: 2014-01-15T14:54:24+01:00
status: 1

banc d'essai
type: SimpleNonPreferredTerm
modified: 2015-08-11T12:32:07+02:00
created: 2014-01-15T14:54:24+01:00
status: 1

bateau d'exploration maritime
type: Concept
modified: 2014-10-16T10:11:48+02:00
in scheme: Thésaurus de la désignation des objets mobiliers
broader: bateau scientifique
alternative label: bateau de forage
created: 2012-05-16T00:00:00+02:00
definition: Bateau conçu et aménagé pour des explorations en vue de la connaissance et la mise en valeur du sol marin.
status: 1
broad match: http://vocab.getty.edu/aat/300232884

bateau de forage
type: SimpleNonPreferredTerm
modified: 2014-10-16T10:11:48+02:00
created: 2014-01-15T14:54:24+01:00
status: 1

bateau scientifique
type: Concept
modified: 2014-10-16T10:10:38+02:00
in scheme: Thésaurus de la désignation des objets mobiliers
preferred label: research vessels @en-us
narrower: bateau d'exploration maritime
narrower: matériel d'intervention sous-marin habité
narrower: T69-8750
broader: bateau
alternative label: bateau de recherches archéologiques
alternative label: bateau hydrographique
alternative label: bateau météorologique
alternative label: bateau océanographique
created: 2012-05-16T00:00:00+02:00
definition: Bateau conçu et équipé pour la connaissance scientifique du milieu marin, fluvial ou lacustre.
status: 1

bateau d'exploration maritime
type: PreferredTerm
modified: 2014-10-16T10:11:48+02:00
created: 2014-01-15T14:54:24+01:00
status: 1

tourniquet
type: PreferredTerm
modified: 2014-12-10T14:50:36+01:00
created: 2014-01-15T14:54:24+01:00
status: 1

santon
type: PreferredTerm
modified: 2014-12-01T11:18:14+01:00
created: 2014-01-15T14:54:24+01:00
status: 1

tabouret de pied
type: Concept
modified: 2014-12-04T12:07:37+01:00
in scheme: Thésaurus de la désignation des objets mobiliers
preferred label: footstools (stools) @en-us
broader: meuble annexe des sièges
created: 2012-05-16T00:00:00+02:00
definition: Meuble généralement de même structure que le tabouret ou le banc, mais plus bas : on y pose les pieds quand on est assis.
status: 1
broad match: cb13185166t

tabouret de pied
type: PreferredTerm
modified: 2014-12-04T12:07:37+01:00
created: 2014-01-15T14:54:24+01:00
status: 1

lambris de hauteur
type: PreferredTerm
modified: 2015-01-16T16:31:57+01:00
created: 2014-01-15T14:54:24+01:00
status: 1

abat-jour
type: Concept
modified: 2014-12-05T14:16:00+01:00
in scheme: Thésaurus de la désignation des objets mobiliers
preferred label: lampshades @en-us
broader: instrument ou accessoire pour l'éclairage
created: 2012-05-16T00:00:00+02:00
related: suspension
definition: Écran fixé tout autour, ou sur un côté seulement, de la source lumineuse pour en rabattre les rayons et tamiser la lumière.
TermeAssocie: suspension
status: 1

lustre de synagogue
type: Concept
modified: 2014-01-10T00:00:00+01:00
in scheme: Thésaurus de la désignation des objets mobiliers
broader: T69-1041
created: 2012-05-16T00:00:00+02:00
related: lustre d'église
related: suspension
related: lustre
related: couronne de lumières
definition: Lustre situé dans une synagogue ; il peut adopter une forme ou une décoration spécifique.
TermeAssocie: lustre d'église
TermeAssocie: suspension
TermeAssocie: lustre
TermeAssocie: couronne de lumières
status: 1

suspension
type: PreferredTerm
modified: 2014-12-04T12:04:34+01:00
created: 2014-01-15T14:54:24+01:00
status: 1

péniche-citerne
type: SimpleNonPreferredTerm
modified: 2014-12-18T11:45:15+01:00
created: 2014-01-15T14:54:24+01:00
status: 1

péniche
type: PreferredTerm
modified: 2014-12-18T11:45:15+01:00
created: 2014-01-15T14:54:24+01:00
status: 1

guimbarde
type: Concept
modified: 2014-10-10T14:32:31+02:00
in scheme: Thésaurus de la désignation des objets mobiliers
preferred label: Jew's harps @en-us
broader: idiophone à émission par pincement
alternative label: trompe du Béarn
created: 2012-05-16T00:00:00+02:00
definition: Instrument consistant en une languette, généralement en métal, placée dans un cadre que l'on tient au creux de la main ; la languette est mise en mouvement manuellement, la bouche du joueur sert de résonateur.
status: 1

trompe du Béarn
type: SimpleNonPreferredTerm
modified: 2014-10-10T14:32:31+02:00
created: 2014-01-15T14:54:24+01:00
status: 1

idiophone à émission par pincement
type: Concept
modified: 2014-10-10T14:30:58+02:00
in scheme: Thésaurus de la désignation des objets mobiliers
preferred label: plucked idiophones @en-us
narrower: guimbarde
narrower: boîte à musique
broader: idiophone
alternative label: lamellophone
created: 2012-05-16T00:00:00+02:00
definition: Idiophone dont le son est produit par la mise en vibration mécanique de lamelles ou d'une languette.
status: 1
broad match: Idiophone

guimbarde
type: PreferredTerm
modified: 2014-10-10T14:32:31+02:00
created: 2014-01-15T14:54:24+01:00
status: 1

coffre à charbon
type: Concept
modified: 2014-10-13T10:46:16+02:00
in scheme: Thésaurus de la désignation des objets mobiliers
preferred label: coalbins @en-us
broader: coffre
alternative label: bac à charbon
alternative label: caisse à charbon
created: 2012-05-16T00:00:00+02:00
definition: Meuble en forme de caisse ou de bac ou récipient ouvert ou fermé servant à la provision journalière du charbon.
status: 1
broad match: cb13162914n

caisse à charbon
type: SimpleNonPreferredTerm
modified: 2014-10-13T10:46:16+02:00
created: 2014-01-15T14:54:24+01:00
status: 1

coffre à charbon
type: PreferredTerm
modified: 2014-10-13T10:46:16+02:00
created: 2014-01-15T14:54:24+01:00
status: 1

bac à charbon
type: SimpleNonPreferredTerm
modified: 2014-10-13T10:46:16+02:00
created: 2014-01-15T14:54:24+01:00
status: 1

voiturette
type: SimpleNonPreferredTerm
modified: 2014-12-30T10:38:30+01:00
created: 2014-01-15T14:54:24+01:00
status: 1

coupé automobile
type: Concept
modified: 2014-10-16T11:13:31+02:00
in scheme: Thésaurus de la désignation des objets mobiliers
preferred label: coupés @en-us
broader: voiture automobile
created: 2013-07-22T00:00:00+02:00
definition: Voiture automobile fermée comportant deux portières et dotée d'une carrosserie au profil aérodynamique, à l'imitation des voitures de sport.
status: 1
broad match: http://vocab.getty.edu/aat/300227922

véhicule motorisé léger à quatre roues
type: SimpleNonPreferredTerm
modified: 2014-12-30T10:38:30+01:00
created: 2014-01-15T14:54:24+01:00
status: 1

voiture de compétition
type: Concept
modified: 2014-12-30T10:36:06+01:00
in scheme: Thésaurus de la désignation des objets mobiliers
preferred label: racing cars @en-us
broader: voiture automobile
alternative label: voiture de sport
alternative label: voiture de course
created: 2013-11-06T00:00:00+01:00
definition: Véhicule léger destiné à la compétition automobile sur circuit, sur route ou sur piste.
status: 1
broad match: Compétition automobile

monospace
type: Concept
modified: 2014-10-16T11:15:03+02:00
in scheme: Thésaurus de la désignation des objets mobiliers
preferred label: minivans @en-us
broader: voiture automobile
created: 2013-11-06T00:00:00+01:00
definition: Voiture automobile fermée possédant une capacité supérieure d'habitabilité, en termes de nombre de sièges ou d'espace intérieur, par rapport aux autres véhicules automobiles légers.
status: 1
broad match: http://vocab.getty.edu/aat/300227922

voiture automobile
type: PreferredTerm
modified: 2014-12-30T10:38:30+01:00
created: 2014-01-15T14:54:24+01:00
status: 1

cloche de choeur
type: Concept
modified: 2015-03-09T10:55:50+01:00
in scheme: Thésaurus de la désignation des objets mobiliers
preferred label: campanella del coro @it
preferred label: chancel bells @en-us
broader: cloche
alternative label: cloche de chœur
created: 2012-05-16T00:00:00+02:00
related: sonnette d'autel
TermeAssocie: sonnette d'autel
status: 1
broad match: http://data.bnf.fr/ark:/12148/cb119472107
broad match: Cloche

cloche de chœur
type: SimpleNonPreferredTerm
modified: 2015-03-09T10:55:50+01:00
created: 2014-01-15T14:54:24+01:00
status: 1

machine à égrener
type: Concept
modified: 2014-01-10T00:00:00+01:00
in scheme: Thésaurus de la désignation des objets mobiliers
broader: machine à décortiquer
alternative label: égreneuse
created: 2012-05-16T00:00:00+02:00
definition: Machine à décortiquer un épi, une cosse, une grappe, etc. pour en séparer les grains.
status: 1

égreneuse
type: SimpleNonPreferredTerm
modified: 2014-01-10T00:00:00+01:00
created: 2014-01-15T14:54:24+01:00
status: 1

machine à égrener
type: PreferredTerm
modified: 2014-01-10T00:00:00+01:00
created: 2014-01-15T14:54:24+01:00
status: 1

coussin mortuaire
type: PreferredTerm
modified: 2014-12-03T10:44:03+01:00
created: 2014-01-15T14:54:24+01:00
status: 1

coussin funéraire
type: SimpleNonPreferredTerm
modified: 2014-12-03T10:44:03+01:00
created: 2014-01-15T14:54:24+01:00
status: 1

antéfixe
type: Concept
modified: 2014-12-15T16:45:33+01:00
in scheme: Thésaurus de la désignation des objets mobiliers
preferred label: antefixes @en-us
broader: couverture ou accessoire du toit
created: 2012-05-16T00:00:00+02:00
definition: Ornement généralement en céramique, dressé au bas des versants et masquant l'extrémité des files de tuiles creuses ou mécaniques de recouvrement.
status: 1

antéfixe
type: PreferredTerm
modified: 2014-12-15T16:45:33+01:00
created: 2014-01-15T14:54:24+01:00
status: 1

éteignoir
type: Concept
modified: 2014-12-05T14:24:23+01:00
in scheme: Thésaurus de la désignation des objets mobiliers
preferred label: extinguishers @en-us
broader: instrument ou accessoire pour l'éclairage
created: 2012-05-16T00:00:00+02:00
definition: Petit cône, muni ou non d'un élément de prise, avec lequel on coiffe une bougie ou une mèche pour l'éteindre.
status: 1
broad match: http://data.bnf.fr/ark:/12148/cb11966814f

éteignoir
type: PreferredTerm
modified: 2014-12-05T14:24:23+01:00
created: 2014-01-15T14:54:24+01:00
status: 1

linge et garniture liés au culte synagogal
type: PreferredTerm
modified: 2014-01-10T00:00:00+01:00
created: 2014-01-15T14:54:24+01:00
status: 1

garniture de pupitre d'officiant
type: Concept
modified: 2014-01-10T00:00:00+01:00
in scheme: Thésaurus de la désignation des objets mobiliers
broader: linge et garniture liés au culte synagogal
alternative label: tapis de pupitre d'officiant
created: 2012-05-16T00:00:00+02:00
related: T69-1052
definition: Linge brodé qui est utilisé pour recouvrir le pupitre de l'officiant.
TermeAssocie: T69-1052
status: 1

textile de la religion juive
type: Concept
modified: 2013-02-15T00:00:00+01:00
in scheme: Thésaurus de la désignation des objets mobiliers
narrower: linge et garniture liés au culte synagogal
narrower: linge et garniture liés aux cycles de la vie
narrower: linge et garniture liés aux fêtes liturgiques et au culte domestique
narrower: garniture et vêtement liés à la prière
broader: textile religieux
created: 2012-05-16T00:00:00+02:00
definition: Vêtement, linge ou garniture lié au judaïsme.
status: 1

couverture de Torah
type: Concept
modified: 2014-01-10T00:00:00+01:00
in scheme: Thésaurus de la désignation des objets mobiliers
broader: linge et garniture liés au culte synagogal
created: 2012-05-16T00:00:00+02:00
related: couverture de livre liturgique
TermeAssocie: couverture de livre liturgique
status: 1

rideau d'arche sainte
type: Concept
modified: 2014-01-10T00:00:00+01:00
in scheme: Thésaurus de la désignation des objets mobiliers
broader: linge et garniture liés au culte synagogal
alternative label: parokhet
created: 2012-05-16T00:00:00+02:00
definition: Dans les traditions française et italienne, ce rideau se place devant les portes de l'arche sainte, en référence à celui du Temple antique, voire des époques antérieures, qui isolait le saint des saints.
status: 1

manteau de Torah
type: Concept
modified: 2014-01-10T00:00:00+01:00
in scheme: Thésaurus de la désignation des objets mobiliers
broader: linge et garniture liés au culte synagogal
alternative label: me'il
created: 2012-05-16T00:00:00+02:00
definition: Pièce de tissu richement brodée qui remplace parfois le coffre de Torah ou le recouvre dans les synagogues ashkénazes ou italiennes.
status: 1

plat de quête protestant
type: Concept
modified: 2014-01-10T00:00:00+01:00
in scheme: Thésaurus de la désignation des objets mobiliers
broader: récipient pour la quête protestant
alternative label: plat à quêter protestant
created: 2012-05-16T00:00:00+02:00
definition: Plat, assiette ou bassin, souvent en métal, utilisé pour faire la quête à la fin des offices protestants.
status: 1

plat à quêter protestant
type: SimpleNonPreferredTerm
modified: 2014-01-10T00:00:00+01:00
created: 2014-01-15T14:54:24+01:00
status: 1

plat de quête protestant
type: PreferredTerm
modified: 2014-01-10T00:00:00+01:00
created: 2014-01-15T14:54:24+01:00
status: 1

récipient pour la quête protestant
type: Concept
modified: 2014-01-10T00:00:00+01:00
in scheme: Thésaurus de la désignation des objets mobiliers
narrower: plat de quête protestant
broader: objet du culte protestant
created: 2012-05-16T00:00:00+02:00
definition: Récipient de forme et de matériaux divers destiné à recueillir le denier du culte protestant.
status: 1

classeur à archives
type: PreferredTerm
modified: 2014-12-05T10:20:05+01:00
created: 2014-01-15T14:54:24+01:00
status: 1

rangement lié aux activités de bureau et de loisirs
type: Concept
modified: 2014-09-11T15:35:52+02:00
in scheme: Thésaurus de la désignation des objets mobiliers
narrower: classeur à archives
narrower: T69-6888
broader: meuble de rangement et d'exposition
alternative label: gradin de bureau
alternative label: bout-de-bureau
alternative label: casier à disques
alternative label: casier géographique
alternative label: casier à musique
created: 2012-07-19T00:00:00+02:00
definition: Meuble servant à classer ou entreposer des documents ou des objets liés aux activités de bureau ou aux divertissements.
status: 1
broad match: http://vocab.getty.edu/aat/300164528

cartonnier
type: Concept
modified: 2014-12-05T10:21:00+01:00
in scheme: Thésaurus de la désignation des objets mobiliers
broader: classeur à archives
created: 2012-05-16T00:00:00+02:00
definition: Classeur à archives constitué de tiroirs en carton souvent recouverts de cuir, parfois numérotés ou porteurs d'inscriptions. Ces cartons, une fois tirés, présentent un dessus mobile.
status: 1
broad match: http://vocab.getty.edu/aat/300038936

os
type: Concept
modified: 2014-12-15T16:07:46+01:00
in scheme: Thésaurus de la désignation des objets mobiliers
preferred label: bone (material) @en-us
broader: élément animal
alternative label: squelette
created: 2013-11-29T00:00:00+01:00
related: relique
definition: Elément dur, rigide, de couleur blanchâtre servant de soutien aux parties molles du corps de l'homme et des vertébrés (à l'exception de certains poissons). L'ensemble des os forme le système osseux ou squelette.
TermeAssocie: relique
status: 1

relique
type: Concept
modified: 2014-11-27T10:39:16+01:00
in scheme: Thésaurus de la désignation des objets mobiliers
preferred label: relics @en-us
broader: objet de dévotion
created: 2012-05-16T00:00:00+02:00
related: os
definition: Reste du corps d'un saint ou d'un martyr après sa mort, objet ayant été à son contact ou encore instrument de son supplice. Une relique est un objet sacré auquel on rend un culte.
TermeAssocie: os
status: 1

squelette
type: SimpleNonPreferredTerm
modified: 2014-12-15T16:07:46+01:00
created: 2014-01-15T14:54:24+01:00
status: 1

os
type: PreferredTerm
modified: 2014-12-15T16:07:46+01:00
created: 2014-01-15T14:54:24+01:00
status: 1

élément animal
type: Concept
modified: 2014-12-15T15:56:03+01:00
in scheme: Thésaurus de la désignation des objets mobiliers
preferred label: animal or human components @en-us
narrower: os
narrower: coquille de mollusque
narrower: T69-9442
broader: T69-9441
alternative label: écaille
alternative label: dent
alternative label: défense animale
alternative label: collection d'entomologie
alternative label: plume d'oiseau
alternative label: carapace
alternative label: œuf
alternative label: corne d'animal
created: 2013-12-20T00:00:00+01:00
definition: Élément issu d’un animal (être vivant hétérotrophe - se nourrissant de substances organiques - doué de sensibilité et de mobilité) mort.
status: 1
broad match: Animal

blouse
type: Concept
modified: 2014-12-11T16:29:31+01:00
in scheme: Thésaurus de la désignation des objets mobiliers
preferred label: smocks (protective wear) @en-us
broader: vêtement d'intérieur ou d'extérieur
alternative label: tablier-écolier
alternative label: sarrau
created: 2013-11-14T00:00:00+01:00
definition: Habillement du tronc et des bras, ouvert sur toute la hauteur, généralement devant, parfois derrière. La blouse recouvre le pantalon, la chemise, la robe, la jupe ou le corsage et sert généralement pour le travail et les travaux domestiques.
status: 1

tablier-écolier
type: SimpleNonPreferredTerm
modified: 2014-12-11T16:29:31+01:00
created: 2014-01-15T14:54:24+01:00
status: 1

sarrau
type: SimpleNonPreferredTerm
modified: 2014-12-11T16:29:31+01:00
created: 2014-01-15T14:54:24+01:00
status: 1

blouse
type: PreferredTerm
modified: 2014-12-11T16:29:31+01:00
created: 2014-01-15T14:54:24+01:00
status: 1

cartonnier
type: PreferredTerm
modified: 2014-12-05T10:21:00+01:00
created: 2014-01-15T14:54:24+01:00
status: 1

louche
type: Concept
modified: 2014-12-05T16:16:30+01:00
in scheme: Thésaurus de la désignation des objets mobiliers
preferred label: ladles @en-us
broader: instrument pour la préparation - le service ou la consommation des aliments et des boissons
alternative label: louche à punch
alternative label: poche à eau
alternative label: louche à eau
alternative label: louche à crème
created: 2012-05-16T00:00:00+02:00
related: dosseret de cuisine
related: jatte à punch
definition: Instrument de service constitué par un cuilleron appelé louchon, plus ou moins hémisphérique et fixé dans le prolongement d'un long manche ou perpendiculairement à lui.
TermeAssocie: dosseret de cuisine
TermeAssocie: jatte à punch
status: 1
broad match: cb11956938h

jatte à punch
type: Concept
modified: 2014-10-17T10:45:38+02:00
in scheme: Thésaurus de la désignation des objets mobiliers
preferred label: punch bowls @en-us
broader: récipient pour le service et la consommation des boissons
alternative label: bol à punch
alternative label: seau à punch
created: 2012-05-16T00:00:00+02:00
related: mortier de cuisine
related: louche
related: jatte
definition: Grand récipient circulaire ou seau, en porcelaine, métal ou cristal, parfois sur pied, utilisé pour préparer et servir le punch. Il peut faire partie d’un service à punch.
TermeAssocie: mortier de cuisine
TermeAssocie: louche
TermeAssocie: jatte
status: 1
broad match: cb11970743h

louche
type: PreferredTerm
modified: 2014-12-05T16:16:30+01:00
created: 2014-01-15T14:54:24+01:00
status: 1

louche à eau
type: SimpleNonPreferredTerm
modified: 2014-12-05T16:16:30+01:00
created: 2014-01-15T14:54:24+01:00
status: 1

poche à eau
type: SimpleNonPreferredTerm
modified: 2014-12-05T16:16:30+01:00
created: 2014-01-15T14:54:24+01:00
status: 1

louche à crème
type: SimpleNonPreferredTerm
modified: 2014-12-05T16:16:30+01:00
created: 2014-01-15T14:54:24+01:00
status: 1

louche à punch
type: SimpleNonPreferredTerm
modified: 2014-12-05T16:16:30+01:00
created: 2014-01-15T14:54:24+01:00
status: 1

costume de suisse
type: Concept
modified: 2014-12-03T12:40:37+01:00
in scheme: Thésaurus de la désignation des objets mobiliers
preferred label: Swiss guard uniforms @en-us
preferred label: costume dell svizzero @it
preferred label: uniforme de guarda-suiço @pt
broader: autre vêtement catholique
alternative label: bicorne de suisse
alternative label: baudrier de suisse
alternative label: épée de suisse
alternative label: chapeau de suisse
alternative label: hallebarde de suisse
alternative label: épaulette de suisse
alternative label: bas de suisse
alternative label: culotte de suisse
alternative label: souliers de suisse
alternative label: canne de suisse
alternative label: capote de suisse
alternative label: gilet de suisse
alternative label: nœud d'épaule de suisse
created: 2012-05-16T00:00:00+02:00
definition: Tenue réservée au suisse, employé laïc chargé de faire régner l'ordre dans l’église. La "petite tenue" comprend des souliers et un pantalon ordinaires, une capote ou une redingote avec éventuellement un nœud d'épaule, une épaulette, un bicorne simple ou chapeau de suisse, un baudrier auquel est suspendue une épée, une hallebarde et une canne à pommeau. La "grande tenue" comporte en plus des souliers à boucles, des bas, une culotte à la française, un gilet, un habit agrémenté d'une épaulette et d'un nœud d'épaule, d'un bicorne de cérémonie, etc.
status: 1
broad match: Catégorie:Costume religieux

baudrier de suisse
type: SimpleNonPreferredTerm
modified: 2014-12-03T12:40:37+01:00
created: 2014-01-15T14:54:24+01:00
status: 1

canne de suisse
type: SimpleNonPreferredTerm
modified: 2014-12-03T12:40:37+01:00
created: 2014-01-15T14:54:24+01:00
status: 1

épée de suisse
type: SimpleNonPreferredTerm
modified: 2014-12-03T12:40:37+01:00
created: 2014-01-15T14:54:24+01:00
status: 1

nœud d'épaule de suisse
type: SimpleNonPreferredTerm
modified: 2014-12-03T12:40:37+01:00
created: 2014-01-15T14:54:24+01:00
status: 1

costume de suisse
type: PreferredTerm
modified: 2014-12-03T12:40:37+01:00
created: 2014-01-15T14:54:24+01:00
status: 1

culotte de suisse
type: SimpleNonPreferredTerm
modified: 2014-12-03T12:40:37+01:00
created: 2014-01-15T14:54:24+01:00
status: 1

chapeau de suisse
type: SimpleNonPreferredTerm
modified: 2014-12-03T12:40:37+01:00
created: 2014-01-15T14:54:24+01:00
status: 1

hallebarde de suisse
type: SimpleNonPreferredTerm
modified: 2014-12-03T12:40:37+01:00
created: 2014-01-15T14:54:24+01:00
status: 1

bas de suisse
type: SimpleNonPreferredTerm
modified: 2014-12-03T12:40:37+01:00
created: 2014-01-15T14:54:24+01:00
status: 1

souliers de suisse
type: SimpleNonPreferredTerm
modified: 2014-12-03T12:40:37+01:00
created: 2014-01-15T14:54:24+01:00
status: 1

bicorne de suisse
type: SimpleNonPreferredTerm
modified: 2014-12-03T12:40:37+01:00
created: 2014-01-15T14:54:24+01:00
status: 1

gilet de suisse
type: SimpleNonPreferredTerm
modified: 2014-12-03T12:40:37+01:00
created: 2014-01-15T14:54:24+01:00
status: 1

capote de suisse
type: SimpleNonPreferredTerm
modified: 2014-12-03T12:40:37+01:00
created: 2014-01-15T14:54:24+01:00
status: 1

épaulette de suisse
type: SimpleNonPreferredTerm
modified: 2014-12-03T12:40:37+01:00
created: 2014-01-15T14:54:24+01:00
status: 1

bateau drague
type: Concept
modified: 2014-12-19T12:17:02+01:00
in scheme: Thésaurus de la désignation des objets mobiliers
preferred label: dredgers (watercraft) @en-us
broader: bateau de génie civil
created: 2012-05-16T00:00:00+02:00
definition: Bateau équipé d'un engin servant à racler le fond (drague aspirante ou drague à godets) utilisé pour le creusement et l'entretien des chenaux, des bassins ou pour le prélèvement de matériaux.
status: 1

bateau drague
type: PreferredTerm
modified: 2014-12-19T12:17:02+01:00
created: 2014-01-15T14:54:24+01:00
status: 1

anneau sigillaire
type: Concept
modified: 2014-12-30T12:46:29+01:00
in scheme: Thésaurus de la désignation des objets mobiliers
preferred label: signet rings @en-us
broader: marque d'appartenance ou d'autorité
alternative label: bague sigillaire
alternative label: chevalière
created: 2013-11-29T00:00:00+01:00
related: anneau pastoral
related: bague
definition: Bague portant sceau.
TermeAssocie: anneau pastoral
TermeAssocie: bague
status: 1

gants pontificaux
type: Concept
modified: 2014-12-03T11:42:13+01:00
in scheme: Thésaurus de la désignation des objets mobiliers
preferred label: pontifical gloves @en-us
preferred label: guanti pontificali @it
preferred label: luvas pontificais @pt
broader: accessoire du costume liturgique des clercs
alternative label: gants liturgiques
alternative label: plaques de gants pontificaux
alternative label: chirothèques
alternative label: gants épiscopaux
created: 2012-05-16T00:00:00+02:00
related: anneau pastoral
related: plateau de présentation
definition: Généralement en soie et de la couleur du temps liturgique (sauf le noir), ces gants portés par les hauts dignitaires ecclésiastiques, sont ornés sur le dessus de broderies ou d'un décor rapporté : pierres précieuses, verroteries, plaques en métal décoré ou émaillé (plaque de gants pontificaux). Ils ont souvent aux poignets des manchettes élargies se terminant parfois par des boutons ou des pompons.
TermeAssocie: anneau pastoral
TermeAssocie: plateau de présentation
status: 1

anneau épiscopal
type: SimpleNonPreferredTerm
modified: 2014-11-26T12:38:55+01:00
created: 2014-01-15T14:54:24+01:00
status: 1

bague d'évêque
type: SimpleNonPreferredTerm
modified: 2014-11-26T12:38:55+01:00
created: 2014-01-15T14:54:24+01:00
status: 1

bague
type: Concept
modified: 2014-12-30T12:26:17+01:00
in scheme: Thésaurus de la désignation des objets mobiliers
preferred label: rings (jewelry) @en-us
broader: bijou
alternative label: alliance
created: 2013-11-29T00:00:00+01:00
related: anneau pastoral
related: anneau sigillaire
definition: Bijou qui se porte au doigt, constitué d’un anneau, souvent en métal précieux, qui est parfois serti de pierres.
TermeAssocie: anneau pastoral
TermeAssocie: anneau sigillaire
status: 1

anneau papal
type: SimpleNonPreferredTerm
modified: 2014-11-26T12:38:55+01:00
created: 2014-01-15T14:54:24+01:00
status: 1

anneau du pêcheur
type: SimpleNonPreferredTerm
modified: 2014-11-26T12:38:55+01:00
created: 2014-01-15T14:54:24+01:00
status: 1

anneau cardinalice
type: SimpleNonPreferredTerm
modified: 2014-11-26T12:38:55+01:00
created: 2014-01-15T14:54:24+01:00
status: 1

anneau pastoral
type: PreferredTerm
modified: 2014-11-26T12:38:55+01:00
created: 2014-01-15T14:54:24+01:00
status: 1

anneau de cardinal
type: SimpleNonPreferredTerm
modified: 2014-11-26T12:38:55+01:00
created: 2014-01-15T14:54:24+01:00
status: 1

anneau abbatial
type: SimpleNonPreferredTerm
modified: 2014-11-26T12:38:55+01:00
created: 2014-01-15T14:54:24+01:00
status: 1

anneau pontifical
type: SimpleNonPreferredTerm
modified: 2014-11-26T12:38:55+01:00
created: 2014-01-15T14:54:24+01:00
status: 1

carton de vitrail
type: SimpleNonPreferredTerm
modified: 2014-12-03T15:06:00+01:00
created: 2014-01-15T14:54:24+01:00
status: 1

poncif
type: SimpleNonPreferredTerm
modified: 2014-12-03T15:06:00+01:00
created: 2014-01-15T14:54:24+01:00
status: 1

dessin
type: PreferredTerm
modified: 2014-12-03T15:06:00+01:00
created: 2014-01-15T14:54:24+01:00
status: 1

carton de tapisserie
type: SimpleNonPreferredTerm
modified: 2014-12-03T15:06:00+01:00
created: 2014-01-15T14:54:24+01:00
status: 1

machine à tresser
type: Concept
modified: 2015-10-08T14:08:37+02:00
in scheme: Thésaurus de la désignation des objets mobiliers
broader: machine à entrelacer
alternative label: tresseuse
created: 2012-05-16T00:00:00+02:00
definition: Machine à entrelacer des brins, des fibres, des fils ou des rubans.
status: 1

tresseuse
type: SimpleNonPreferredTerm
modified: 2015-10-08T14:08:37+02:00
created: 2014-01-15T14:54:24+01:00
status: 1

machine à tresser
type: PreferredTerm
modified: 2015-10-08T14:08:37+02:00
created: 2014-01-15T14:54:24+01:00
status: 1

manipule
type: Concept
modified: 2014-12-03T11:45:18+01:00
in scheme: Thésaurus de la désignation des objets mobiliers
preferred label: maniples @en-us
preferred label: manipolo @it
preferred label: manípulo @pt
broader: accessoire du costume liturgique des clercs
created: 2012-05-16T00:00:00+02:00
related: ornement liturgique catholique
related: étole de clerc
related: chasuble
definition: Bande d'étoffe portée par tous les clercs sur l’avant-bras gauche, exclusivement lors des messes. Le manipule est assorti à la chasuble et à l’étole dont il reprend les caractéristiques (motif de croix en son centre et aux extrémités évasées). Il est généralement terminé par des franges et mesure, plié, environ 50 cm de long.
TermeAssocie: ornement liturgique catholique
TermeAssocie: étole de clerc
TermeAssocie: chasuble
status: 1
broad match: cb11941484w

étole de clerc
type: Concept
modified: 2014-12-03T11:41:17+01:00
in scheme: Thésaurus de la désignation des objets mobiliers
preferred label: stoles (vestments) @en-us
preferred label: stola @it
preferred label: estola @pt
broader: accessoire du costume liturgique des clercs
alternative label: étole de viatique
alternative label: étole large
alternative label: étole diaconale
alternative label: stolon
alternative label: étole pastorale
created: 2012-05-16T00:00:00+02:00
related: ornement liturgique catholique
related: manipule
related: chasuble
related: colletin
related: écharpe
definition: Longue bande d'étoffe, généralement doublée, portée autour du cou par toute la hiérarchie ecclésiastique, lors des cérémonies. L'étole porte une croix au milieu de sa longueur et souvent une autre près de ses extrémités, plus larges, généralement terminées par des franges. L’étole est généralement assortie à la chasuble. L'étole pastorale possède au tiers supérieur de sa hauteur une patte d'étoffe, un ruban ou un cordon généralement terminé par des glands ou des pompons, réunissant ses deux moitiés. L'étole diaconale, attachée à ses extrémités, est portée en sautoir sur l'épaule gauche et sous le bras droit, comporte parfois deux rubans ou un cordon à environ 50 cm des extrémités, pour mieux la maintenir en place. L'étole large, ou stolon, est portée par le diacre pour les messes des temps de pénitence ou de deuil en alternance avec une chasuble pliée ; elle est en soie violette, sans frange ni croix, de largeur constante, environ 25 cm. L'étole de viatique est de dimensions plus de couleur blanche sur une face et violette sur l'autre.
TermeAssocie: ornement liturgique catholique
TermeAssocie: manipule
TermeAssocie: chasuble
TermeAssocie: colletin
TermeAssocie: écharpe
status: 1
broad match: cb11941484w

manipule
type: PreferredTerm
modified: 2014-12-03T11:45:18+01:00
created: 2014-01-15T14:54:24+01:00
status: 1

chasuble
type: Concept
modified: 2014-12-03T14:36:04+01:00
in scheme: Thésaurus de la désignation des objets mobiliers
preferred label: chasubles (liturgical vestments) @en-us
preferred label: pianeta @it
preferred label: casula @pt
broader: vêtement liturgique de dessus
alternative label: chasuble pliée
alternative label: planète
created: 2012-05-16T00:00:00+02:00
related: ornement liturgique catholique
related: manipule
related: étole de clerc
related: colletin
definition: Vêtement ouvert sur les côtés et s'enfilant par la tête, porté par-dessus tous les autres par tout clerc qui célèbre la messe. Elle est généralement ornée de motifs formés par un galon ou un tissu différent, dessinant au dos une croix (parfois à branches en V) ou, plus rarement, une simple bande verticale, et sur le devant une bande verticale ou un motif en forme de T.
TermeAssocie: ornement liturgique catholique
TermeAssocie: manipule
TermeAssocie: étole de clerc
TermeAssocie: colletin
status: 1

bateau de pêche au filet ou à la traîne
type: Concept
modified: 2014-12-19T11:26:59+01:00
in scheme: Thésaurus de la désignation des objets mobiliers
preferred label: net fishing vessels @en-us
broader: bateau de pêche
alternative label: bateau de pêche aux lignes
alternative label: palangrier
alternative label: cordier à ligne traînante
alternative label: chalutier
created: 2012-05-16T00:00:00+02:00
definition: Bateau utilisant des fils de pêche ou un filet flottant (chalut), dérivants ou traînés.
status: 1
narrow match: Chalutier

bateau usine
type: Concept
modified: 2014-10-16T09:41:55+02:00
in scheme: Thésaurus de la désignation des objets mobiliers
preferred label: factory ships @en-us
broader: bateau de pêche
created: 2012-05-16T00:00:00+02:00
definition: Navire de grande pêche qui a la possibilité de traiter, de conditionner et de conserver en mer (par congélation ou salage) les produits de sa pêche.
status: 1
broad match: cb11942185n

bateau
type: Concept
modified: 2015-03-19T12:25:26+01:00
in scheme: Thésaurus de la désignation des objets mobiliers
preferred label: boats @en-us
narrower: bateau de service
narrower: bateau de pêche
narrower: bateau de commerce pour marchandises
narrower: navire de guerre
narrower: bateau scientifique
narrower: bateau de plaisance
narrower: bateau polyvalent de très faible tonnage
narrower: bateau de commerce pour passagers
broader: matériel de transport nautique
created: 2012-05-16T00:00:00+02:00
definition: Construction flottante destinée à la navigation.
status: 1

bateau de pêche aux casiers
type: Concept
modified: 2014-12-19T11:30:01+01:00
in scheme: Thésaurus de la désignation des objets mobiliers
preferred label: trapping vessels @en-us
broader: bateau de pêche
alternative label: caseyeur
alternative label: homardier
alternative label: langoustier
created: 2012-05-16T00:00:00+02:00
definition: Bateau de pêche équipé de pièges en forme de cage ou de panier, employés pour la pêche des crustacés.
status: 1

bateau de pêche
type: PreferredTerm
modified: 2014-12-19T12:11:15+01:00
created: 2014-01-15T14:54:24+01:00
status: 1

goémonier
type: SimpleNonPreferredTerm
modified: 2014-12-19T12:11:15+01:00
created: 2014-01-15T14:54:24+01:00
status: 1

croix funéraire de vêtement
type: Concept
modified: 2014-11-27T11:01:28+01:00
in scheme: Thésaurus de la désignation des objets mobiliers
preferred label: funerary vestment crosses @en-us
preferred label: crocetta bratteata @it
preferred label: cruzinha funerária @pt
broader: objet funéraire
alternative label: petite croix funéraire
alternative label: croix funéraire objet
created: 2012-05-16T00:00:00+02:00
definition: Petite croix constituée de lamelles d'or ou de métal doré, parfois sur une âme de bois placée, dans le cercueil ou le sarcophage d'un défunt, généralement cousue sur ses vêtements. Il s'agit habituellement d'une croix grecque dotée de petits trous sur le pourtour pour pouvoir être cousue.
status: 1
broad match: cb12647480k

petite croix funéraire
type: SimpleNonPreferredTerm
modified: 2014-11-27T11:01:28+01:00
created: 2014-01-15T14:54:24+01:00
status: 1

croix funéraire de vêtement
type: PreferredTerm
modified: 2014-11-27T11:01:28+01:00
created: 2014-01-15T14:54:24+01:00
status: 1

croix funéraire objet
type: SimpleNonPreferredTerm
modified: 2014-11-27T11:01:28+01:00
created: 2014-01-15T14:54:24+01:00
status: 1

véhicule routier motorisé militaire
type: Concept
modified: 2014-12-30T10:54:01+01:00
in scheme: Thésaurus de la désignation des objets mobiliers
preferred label: military vehicles @en-us
broader: véhicule terrestre motorisé
alternative label: autocanon
alternative label: tank
alternative label: automitrailleuse
alternative label: char d'assaut
alternative label: char de combat
created: 2013-11-06T00:00:00+01:00
related: armement
definition: Véhicule motorisé, à roues ou à chenilles, le plus souvent tout-terrain, blindé ou protégé, équipé des armes nécessaires à la réalisation d'opérations militaires terrestres.
TermeAssocie: armement
status: 1

tank
type: SimpleNonPreferredTerm
modified: 2014-12-30T10:54:01+01:00
created: 2014-01-15T14:54:24+01:00
status: 1

automitrailleuse
type: SimpleNonPreferredTerm
modified: 2014-12-30T10:54:01+01:00
created: 2014-01-15T14:54:24+01:00
status: 1

autocanon
type: SimpleNonPreferredTerm
modified: 2014-12-30T10:54:01+01:00
created: 2014-01-15T14:54:24+01:00
status: 1

char d'assaut
type: SimpleNonPreferredTerm
modified: 2014-12-30T10:54:01+01:00
created: 2014-01-15T14:54:24+01:00
status: 1

véhicule routier motorisé militaire
type: PreferredTerm
modified: 2014-12-30T10:54:01+01:00
created: 2014-01-15T14:54:24+01:00
status: 1

char de combat
type: SimpleNonPreferredTerm
modified: 2014-12-30T10:54:01+01:00
created: 2014-01-15T14:54:24+01:00
status: 1

astérisque
type: Concept
modified: 2014-11-27T13:41:47+01:00
in scheme: Thésaurus de la désignation des objets mobiliers
preferred label: asterisco @it
preferred label: asterisks (liturgical objects) @en-us
broader: objet lié à l'Eucharistie
created: 2012-05-16T00:00:00+02:00
related: patène
definition: Objet rare, en métal précieux doré ou en or, servant à maintenir en place une hostie sur la patène. L'astérisque est utilisée lors des messes en plein air. Employée autrefois dans le cadre de la liturgie papale, l'astérisque était alors en or et en forme d'étoile.
TermeAssocie: patène
status: 1
broad match: cb11936841q

patène funéraire
type: Concept
modified: 2014-11-27T11:06:53+01:00
in scheme: Thésaurus de la désignation des objets mobiliers
preferred label: patena funeraria @it
preferred label: tomb patens @en-us
preferred label: patena funerária @pt
broader: objet funéraire
created: 2012-05-16T00:00:00+02:00
related: patène
related: calice funéraire
definition: Patène non consacrée, en matériaux non précieux et sans dorure intérieure, destinée à être déposée dans la tombe d'un ecclésiastique et non à être utilisée pour l'Eucharistie.
TermeAssocie: patène
TermeAssocie: calice funéraire
status: 1

boîte de patène
type: Concept
modified: 2014-11-26T12:29:20+01:00
in scheme: Thésaurus de la désignation des objets mobiliers
preferred label: custodia di patena @it
preferred label: paten cases @en-us
preferred label: estojo de patena @pt
broader: boîte et coffret pour le rangement des objets liturgiques
alternative label: écrin de patène
alternative label: boîte à patène
alternative label: étui de patène
created: 2012-05-16T00:00:00+02:00
related: patène
definition: Ecrin ou étui dans lequel est rangée une patène. Il doit être doublé à l'intérieur. L'extérieur peut être recouvert de cuir, de toile ou encore être peint.
TermeAssocie: patène
status: 1
broad match: http://vocab.getty.edu/aat/300198942

patène
type: PreferredTerm
modified: 2014-11-27T15:24:31+01:00
created: 2014-01-15T14:54:24+01:00
status: 1

patène de viatique
type: SimpleNonPreferredTerm
modified: 2014-11-27T15:24:31+01:00
created: 2014-01-15T14:54:24+01:00
status: 1

écrin
type: SimpleNonPreferredTerm
modified: 2014-12-05T15:13:13+01:00
created: 2014-01-15T14:54:24+01:00
status: 1

trousse
type: SimpleNonPreferredTerm
modified: 2014-12-05T15:13:13+01:00
created: 2014-01-15T14:54:24+01:00
status: 1

boîte à bijoux
type: SimpleNonPreferredTerm
modified: 2014-12-05T15:13:13+01:00
created: 2014-01-15T14:54:24+01:00
status: 1

étui
type: PreferredTerm
modified: 2014-12-05T15:13:13+01:00
created: 2014-01-15T14:54:24+01:00
status: 1

étui à livres
type: SimpleNonPreferredTerm
modified: 2014-12-05T15:13:13+01:00
created: 2014-01-15T14:54:24+01:00
status: 1

bicorne
type: Concept
modified: 2014-12-10T18:08:08+01:00
in scheme: Thésaurus de la désignation des objets mobiliers
preferred label: bicornes @en-us
broader: chapeau ou coiffure
created: 2012-05-16T00:00:00+02:00
definition: Coiffure à deux pointes qui se porte perpendiculairement ou parallèlement à la ligne des épaules.
status: 1
broad match: cb11935470z

bicorne
type: PreferredTerm
modified: 2014-12-10T18:08:08+01:00
created: 2014-01-15T14:54:24+01:00
status: 1

relief méplat
type: PreferredTerm
modified: 2014-12-03T16:53:51+01:00
created: 2014-01-15T14:54:24+01:00
status: 1

outillage et accessoires liés à la production industrielle
type: Concept
modified: 2015-10-16T13:04:23+02:00
in scheme: Thésaurus de la désignation des objets mobiliers
narrower: moule industriel
narrower: cuve industrielle
narrower: modèle industriel
narrower: prototype industriel
broader: machine liée à la production industrielle
created: 2012-05-16T00:00:00+02:00
definition: Outillage ou matériel rentrant dans le processus de fabrication industrielle.
status: 1

machine liée à la production artisanale
type: Concept
modified: 2014-01-10T00:00:00+01:00
in scheme: Thésaurus de la désignation des objets mobiliers
narrower: foyer de forge
narrower: alambic artisanal
narrower: presse à relier
narrower: meule à aiguiser
narrower: meule à broyer
broader: matériel artisanal
alternative label: métier à tresser les cordes
created: 2013-12-16T00:00:00+01:00
related: objet ou matériel pour les ouvrages textiles
related: machine liée à la production industrielle
related: pressoir à fruits
TermeAssocie: objet ou matériel pour les ouvrages textiles
TermeAssocie: machine liée à la production industrielle
TermeAssocie: pressoir à fruits
status: 1

machine liée à la production industrielle
type: PreferredTerm
modified: 2015-08-10T15:32:41+02:00
created: 2014-01-15T14:54:24+01:00
status: 1

machine à modifier l'état
type: Concept
modified: 2015-09-24T17:50:33+02:00
in scheme: Thésaurus de la désignation des objets mobiliers
narrower: machine à changer d'état
narrower: machine à modifier l'état physique
narrower: machine à conformer
narrower: T69-6005
narrower: T69-5909
broader: machine liée à la production industrielle
created: 2012-05-16T00:00:00+02:00
definition: Machine à réaliser une modification des caractéristiques physiques ou structurelles d'un produit en vue de sa finition, de sa commercialisation, de son exploitation, etc.
status: 1

machine à façonner
type: Concept
modified: 2015-10-14T10:35:46+02:00
in scheme: Thésaurus de la désignation des objets mobiliers
narrower: machine à modeler
narrower: machine à usiner
narrower: machine à découper
narrower: machine à former
narrower: T69-5643
broader: machine liée à la production industrielle
created: 2012-05-16T00:00:00+02:00
definition: Machine à donner à un produit une forme de dimensions prédéfinies.
status: 1

machine à manutentionner
type: Concept
modified: 2015-10-14T15:00:58+02:00
in scheme: Thésaurus de la désignation des objets mobiliers
narrower: machine à entraîner
narrower: T69-5711
narrower: T69-5691
narrower: T69-5719
broader: machine liée à la production industrielle
created: 2012-05-16T00:00:00+02:00
definition: Machine à changer de place, de lieu ou de position des matériaux ou des produits.
status: 1

machine
type: SimpleNonPreferredTerm
modified: 2015-08-10T15:32:41+02:00
created: 2014-01-15T14:54:24+01:00
status: 1

tronc à quêter protestant
type: Concept
modified: 2014-01-10T00:00:00+01:00
in scheme: Thésaurus de la désignation des objets mobiliers
broader: objet du culte protestant
created: 2012-05-16T00:00:00+02:00
definition: Tronc portatif destiné à recueillir le denier du culte protestant.
status: 1

tronc à quêter protestant
type: PreferredTerm
modified: 2014-01-10T00:00:00+01:00
created: 2014-01-15T14:54:24+01:00
status: 1

instrument de démonstration en statique des fluides
type: Concept
modified: 2014-12-15T14:17:27+01:00
in scheme: Thésaurus de la désignation des objets mobiliers
broader: instrument de démonstration en mécanique des fluides
alternative label: tube capillaire
alternative label: balance hydrostatique
alternative label: vases communicants
alternative label: tourniquet hydraulique
alternative label: ludion
created: 2012-05-16T00:00:00+02:00
related: instrument de mesure des forces des poids ou des pressions
definition: Instrument d'étude des propriétés des fluides immobiles, notamment de leur pression exercée sur des parois.
TermeAssocie: instrument de mesure des forces des poids ou des pressions
status: 1
narrow match: Ludion (physique)
broad match: http://data.bnf.fr/ark:/12148/cb15577164c
broad match: http://vocab.getty.edu/aat/300122283

instrument de démonstration en mécanique des fluides
type: PreferredTerm
modified: 2014-12-15T14:14:49+01:00
created: 2014-01-15T14:54:24+01:00
status: 1

instrument de démonstration en dynamique des fluides
type: Concept
modified: 2014-12-15T14:16:02+01:00
in scheme: Thésaurus de la désignation des objets mobiliers
broader: instrument de démonstration en mécanique des fluides
alternative label: fontaine intermittente
created: 2012-05-16T00:00:00+02:00
definition: Instrument d'étude des propriétés des fluides en mouvement.
status: 1
broad match: http://vocab.getty.edu/aat/300122283

machine à sécher
type: Concept
modified: 2015-10-15T17:39:44+02:00
in scheme: Thésaurus de la désignation des objets mobiliers
broader: machine à modifier la siccité
created: 2012-05-16T00:00:00+02:00
definition: Machine à modifier la siccité d'un produit ou d'un matériau en en ôtant l'humidité.
status: 1

machine à modifier la siccité
type: Concept
modified: 2014-01-10T00:00:00+01:00
in scheme: Thésaurus de la désignation des objets mobiliers
narrower: machine à sécher
narrower: machine à humidifier
broader: machine à modifier l'état physique
created: 2012-05-16T00:00:00+02:00
definition: Machine à modifier l'état physique d'un matériau ou d'un produit en en changeant le degré d'hygrométrie.
status: 1

machine à sécher
type: PreferredTerm
modified: 2015-10-15T17:39:44+02:00
created: 2014-01-15T14:54:24+01:00
status: 1

piano mécanique
type: Concept
modified: 2014-12-15T11:59:21+01:00
in scheme: Thésaurus de la désignation des objets mobiliers
preferred label: player piano @en-us
broader: cithare à clavier
alternative label: pleyela
alternative label: pianola
created: 2012-05-16T00:00:00+02:00
definition: Piano dont le clavier n'est pas actionné par un musicien, mais par un système mécanique ; un cylindre de bois hérissé de picots métallique, activé par une manivelle, met en mouvement la mécanique frappée. Celle-ci peut également être mue par un système pneumatique à papier perforé ou électrique.
status: 1

cithare à clavier
type: Concept
modified: 2014-10-10T13:03:27+02:00
in scheme: Thésaurus de la désignation des objets mobiliers
narrower: piano mécanique
narrower: clavicorde
narrower: épinette
narrower: piano
narrower: clavecin
broader: cordophone simple
created: 2012-05-16T00:00:00+02:00
definition: Instrument où les cordes sont mises en vibration par de petits éléments actionnés par des mécanismes commandés depuis les touches d'un clavier.
status: 1

pianola
type: SimpleNonPreferredTerm
modified: 2014-12-15T11:59:21+01:00
created: 2014-01-15T14:54:24+01:00
status: 1

pleyela
type: SimpleNonPreferredTerm
modified: 2014-12-15T11:59:21+01:00
created: 2014-01-15T14:54:24+01:00
status: 1

piano mécanique
type: PreferredTerm
modified: 2014-12-15T11:59:21+01:00
created: 2014-01-15T14:54:24+01:00
status: 1

triptyque
type: Concept
modified: 2014-12-01T13:10:00+01:00
in scheme: Thésaurus de la désignation des objets mobiliers
preferred label: triptychs @en-us
preferred label: triticco @it
preferred label: tríptico @pt
broader: polyptyque
alternative label: triptyque portatif
created: 2012-05-16T00:00:00+02:00
definition: Polyptyque composé de trois panneaux solidaires ou, au centre, d'une structure fixe formée d'un panneau, d'une caisse ou de plusieurs panneaux, encadrés par deux volets. Quand il est de dimensions réduites, on l'appelle triptyque portatif.
status: 1

triptyque
type: PreferredTerm
modified: 2014-12-01T13:10:00+01:00
created: 2014-01-15T14:54:24+01:00
status: 1

triptyque portatif
type: SimpleNonPreferredTerm
modified: 2014-12-01T13:10:00+01:00
created: 2014-01-15T14:54:24+01:00
status: 1

meuble lié aux rites funéraires
type: Concept
modified: 2014-12-02T10:38:09+01:00
in scheme: Thésaurus de la désignation des objets mobiliers
preferred label: funeral furniture @en-us
preferred label: arredi funebri @it
preferred label: mobiliário funerário @pt
narrower: porte-couronne mortuaire
narrower: cercueil de présentation
narrower: porte-cercueil
narrower: catafalque
narrower: chandelier funéraire
narrower: dais funéraire
narrower: brancard funéraire
narrower: cercueil
narrower: porte-cierges funéraire
broader: meuble du culte catholique
created: 2012-05-16T00:00:00+02:00
related: objet funéraire
related: monument funéraire
definition: Mobilier ou support lié au transport ou à l’exposition du défunt au moment d’une cérémonie funéraire.
TermeAssocie: objet funéraire
TermeAssocie: monument funéraire
status: 1

cercueil de présentation
type: Concept
modified: 2014-12-02T11:38:05+01:00
in scheme: Thésaurus de la désignation des objets mobiliers
preferred label: feretro da esposizione @it
preferred label: presentation coffins @en-us
preferred label: esquife de exposição @pt
broader: meuble lié aux rites funéraires
created: 2012-05-16T00:00:00+02:00
definition: Cercueil sans couvercle réservé à la présentation d'un défunt le temps de la cérémonie funéraire. Généralement en bois, il peut être de forme très simple ou plus élaborée ; il est conservé dans l'église en permanence.
status: 1
broad match: cb12440631w
broad match: http://vocab.getty.edu/aat/300197585

porte-cercueil
type: Concept
modified: 2014-12-02T11:45:19+01:00
in scheme: Thésaurus de la désignation des objets mobiliers
preferred label: portaferetro @it
preferred label: coffin stands @en-us
preferred label: essa @pt
broader: meuble lié aux rites funéraires
created: 2012-05-16T00:00:00+02:00
definition: Support rectangulaire plus ou moins élevé, pouvant comporter des roulettes, sur lequel est posé le cercueil.
status: 1
broad match: cb12440631w
broad match: Cercueil

meuble lié aux rites funéraires
type: PreferredTerm
modified: 2014-12-02T10:38:09+01:00
created: 2014-01-15T14:54:24+01:00
status: 1

catafalque
type: Concept
modified: 2014-12-02T11:34:29+01:00
in scheme: Thésaurus de la désignation des objets mobiliers
preferred label: catafalques @en-us
preferred label: catafalco @it
broader: meuble lié aux rites funéraires
created: 2012-05-16T00:00:00+02:00
related: garniture de dais funéraire
related: tenture de catafalque
related: drap mortuaire
definition: Construction destinée à l'exposition solennelle du cercueil ou de l'effigie du défunt. Le catafalque comprend un porte-cercueil. Il est parfois dressé sur des marches, souvent recouvert d'une tenture de catafalque aux couleurs funéraires.
TermeAssocie: garniture de dais funéraire
TermeAssocie: tenture de catafalque
TermeAssocie: drap mortuaire
status: 1

chandelier funéraire
type: Concept
modified: 2014-12-02T11:40:43+01:00
in scheme: Thésaurus de la désignation des objets mobiliers
preferred label: candelabro funebre @it
preferred label: funeral candlesticks @en-us
preferred label: tocheiro funerário @pt
broader: meuble lié aux rites funéraires
created: 2012-05-16T00:00:00+02:00
definition: Chandelier posé à terre, près du cercueil, pendant une cérémonie funéraire. En bois ou en métal, aux couleurs et parfois à décor funéraires, les chandeliers funéraires forment généralement une série.
status: 1

dais funéraire
type: Concept
modified: 2014-12-02T11:43:45+01:00
in scheme: Thésaurus de la désignation des objets mobiliers
preferred label: baldacchino funebre @it
preferred label: funeral canopies @en-us
preferred label: baldaquino fúnebre @pt
broader: meuble lié aux rites funéraires
created: 2012-05-16T00:00:00+02:00
related: garniture de dais funéraire
definition: Dais que l'on dispose au-dessus d'un cercueil ou de l'effigie d'un défunt lors de leur exposition. Le dais funéraire peut s'intégrer dans un catafalque. Il comporte une garniture.
TermeAssocie: garniture de dais funéraire
status: 1

brancard funéraire
type: Concept
modified: 2014-12-02T10:41:10+01:00
in scheme: Thésaurus de la désignation des objets mobiliers
preferred label: biers @en-us
preferred label: cataletto @it
preferred label: andas funerárias @pt
broader: meuble lié aux rites funéraires
created: 2012-05-16T00:00:00+02:00
definition: Civière destinée au transport du cercueil. Souvent en bois, le brancard funéraire comporte des bras pour le transport sur les épaules ou à bout de bras, et, éventuellement des pieds qui en font un porte-cercueil lors d’une cérémonie funéraire. Il porte souvent un décor et des couleurs funéraires et peut avoir des parties peintes à la tête et aux pieds.
status: 1
broad match: cb11931491z

monument funéraire
type: Concept
modified: 2015-02-24T14:24:34+01:00
in scheme: Thésaurus de la désignation des objets mobiliers
preferred label: sepulchral monuments @en-us
preferred label: monumento funebre @it
narrower: plate-tombe
narrower: sarcophage
narrower: cénotaphe
narrower: tombeau
narrower: T69-392
narrower: T69-382
narrower: T69-385
narrower: T69-380
broader: monument
alternative label: monument sépulcral
created: 2012-05-16T00:00:00+02:00
scope note: Voir aussi le Thesaurus de la désignation des œuvres architecturales et des espaces aménagés.
related: objet funéraire
related: meuble lié aux rites funéraires
related: cercueil
related: clôture de monument funéraire
definition: Monument élevé à la mémoire d’un ou plusieurs morts.
TermeAssocie: objet funéraire
TermeAssocie: meuble lié aux rites funéraires
TermeAssocie: cercueil
TermeAssocie: clôture de monument funéraire
status: 1

cercueil
type: Concept
modified: 2014-12-02T11:37:05+01:00
in scheme: Thésaurus de la désignation des objets mobiliers
preferred label: coffins @en-us
preferred label: feretro @it
preferred label: féretro @pt
broader: meuble lié aux rites funéraires
created: 2012-05-16T00:00:00+02:00
related: drap mortuaire
related: monument funéraire
definition: Caisse généralement en bois ou en métal munie d'un couvercle et destinée à recevoir le corps d'un défunt pour son ensevelissement.
TermeAssocie: drap mortuaire
TermeAssocie: monument funéraire
status: 1

porte-cierges funéraire
type: Concept
modified: 2014-12-02T11:47:31+01:00
in scheme: Thésaurus de la désignation des objets mobiliers
preferred label: portacandele funebre @it
preferred label: hearses (candle racks) @en-us
preferred label: candelabro funerário @pt
broader: meuble lié aux rites funéraires
alternative label: herse funéraire
alternative label: porte-cierge funéraire
created: 2012-05-16T00:00:00+02:00
definition: Structure généralement aux couleurs et à décor funéraires comportant des barres sur pied qui servent à porter les cierges utilisés lors des cérémonies funéraires. Lorsqu'ils sont utilisés par paires, les porte-cierges sont placés de part et d'autre du cercueil. Le porte-cierges peut former une armature au-dessus du cercueil.
status: 1

brancard funéraire
type: PreferredTerm
modified: 2014-12-02T10:41:10+01:00
created: 2014-01-15T14:54:24+01:00
status: 1

chancelière
type: Concept
modified: 2014-10-10T15:48:35+02:00
in scheme: Thésaurus de la désignation des objets mobiliers
preferred label: footwarmers @en-us
broader: meuble annexe des sièges
created: 2012-05-16T00:00:00+02:00
definition: Sorte de caisse à côtés triangulaires ou rectangulaires, posée au sol, servant à tenir les pieds au chaud quand on est assis sur un siège. Elle est ouverte sur un pan et l'intérieur est garni de fourrure. Elle peut être garnie de textile à l'extérieur.
status: 1
broad match: http://data.bnf.fr/ark:/12148/cb131627639
broad match: http://vocab.getty.edu/aat/300037769
broad match: Siège (meuble)

chancelière
type: PreferredTerm
modified: 2014-10-10T15:48:35+02:00
created: 2014-01-15T14:54:24+01:00
status: 1

renvidoir
type: PreferredTerm
modified: 2014-12-10T14:48:29+01:00
created: 2014-01-15T14:54:24+01:00
status: 1

costume de pénitent
type: Concept
modified: 2014-12-03T12:38:00+01:00
in scheme: Thésaurus de la désignation des objets mobiliers
preferred label: costume di penitente @it
preferred label: penitent's costumes @en-us
preferred label: hábito de penitente @pt
broader: autre vêtement catholique
alternative label: cagoule de pénitent
alternative label: sac de pénitent
created: 2012-05-16T00:00:00+02:00
definition: Costume des confréries de pénitents, composé d'une sorte d'aube appelée sac de pénitent fermée à la taille par un cordon et d'une cagoule couvrant entièrement le visage.
status: 1

sac de pénitent
type: SimpleNonPreferredTerm
modified: 2014-12-03T12:38:00+01:00
created: 2014-01-15T14:54:24+01:00
status: 1

cagoule de pénitent
type: SimpleNonPreferredTerm
modified: 2014-12-03T12:38:00+01:00
created: 2014-01-15T14:54:24+01:00
status: 1

costume de pénitent
type: PreferredTerm
modified: 2014-12-03T12:38:00+01:00
created: 2014-01-15T14:54:24+01:00
status: 1

forme ou moule de mise en oeuvre artisanale
type: Concept
modified: 2015-03-09T10:58:50+01:00
in scheme: Thésaurus de la désignation des objets mobiliers
broader: matériel artisanal
alternative label: moule à bougie
alternative label: moule à cierge
alternative label: forme à découper les gants
alternative label: moule de sculpture
alternative label: forme à repasser les chapeaux
alternative label: forme à fabriquer les paniers
alternative label: moule à plombs de chasse
alternative label: forme ou moule de mise en œuvre artisanale
alternative label: moule à tan
created: 2013-12-16T00:00:00+01:00
related: sculpture
related: moule industriel
TermeAssocie: sculpture
TermeAssocie: moule industriel
status: 1

forme à repasser les chapeaux
type: SimpleNonPreferredTerm
modified: 2015-03-09T10:58:50+01:00
created: 2014-01-15T14:54:24+01:00
status: 1

forme ou moule de mise en œuvre artisanale
type: SimpleNonPreferredTerm
modified: 2015-03-09T10:58:50+01:00
created: 2014-01-15T14:54:24+01:00
status: 1

moule à plombs de chasse
type: SimpleNonPreferredTerm
modified: 2015-03-09T10:58:50+01:00
created: 2014-01-15T14:54:24+01:00
status: 1

moule à cierge
type: SimpleNonPreferredTerm
modified: 2015-03-09T10:58:50+01:00
created: 2014-01-15T14:54:24+01:00
status: 1

matériel artisanal
type: Concept
modified: 2014-01-10T00:00:00+01:00
in scheme: Thésaurus de la désignation des objets mobiliers
narrower: outil
narrower: matériel de manutention
narrower: machine liée à la production artisanale
narrower: forme ou moule de mise en oeuvre artisanale
narrower: T69-9640
narrower: T69-9643
broader: matériel agricole, professionnel et artisanal
created: 2013-12-16T00:00:00+01:00
status: 1

moule industriel
type: Concept
modified: 2015-10-16T13:08:46+02:00
in scheme: Thésaurus de la désignation des objets mobiliers
broader: outillage et accessoires liés à la production industrielle
created: 2012-05-16T00:00:00+02:00
related: forme ou moule de mise en oeuvre artisanale
definition: Pièce creuse ou présentant une empreinte creuse, destinée à être remplie d'une substance pulvérulente, pâteuse ou liquide, qui, en se solidifiant, prend la forme exacte de ce creux ou de cette empreinte.
TermeAssocie: forme ou moule de mise en oeuvre artisanale
status: 1

forme à fabriquer les paniers
type: SimpleNonPreferredTerm
modified: 2015-03-09T10:58:50+01:00
created: 2014-01-15T14:54:24+01:00
status: 1

moule de sculpture
type: SimpleNonPreferredTerm
modified: 2015-03-09T10:58:50+01:00
created: 2014-01-15T14:54:24+01:00
status: 1

moule à bougie
type: SimpleNonPreferredTerm
modified: 2015-03-09T10:58:50+01:00
created: 2014-01-15T14:54:24+01:00
status: 1

forme à découper les gants
type: SimpleNonPreferredTerm
modified: 2015-03-09T10:58:50+01:00
created: 2014-01-15T14:54:24+01:00
status: 1

moule à tan
type: SimpleNonPreferredTerm
modified: 2015-03-09T10:58:50+01:00
created: 2014-01-15T14:54:24+01:00
status: 1

écran de lumière
type: Concept
modified: 2014-09-18T16:26:33+02:00
in scheme: Thésaurus de la désignation des objets mobiliers
preferred label: shades @en-us
broader: instrument ou accessoire pour l'éclairage
alternative label: écran pliant
created: 2012-05-16T00:00:00+02:00
related: lampe
definition: Petit panneau, en matériau plus ou moins translucide, fixé sur le côté d'une source lumineuse pour tamiser la lumière.
TermeAssocie: lampe
status: 1
broad match: http://data.bnf.fr/ark:/12148/cb119375685

écran pliant
type: SimpleNonPreferredTerm
modified: 2014-09-18T16:26:33+02:00
created: 2014-01-15T14:54:24+01:00
status: 1

écran de lumière
type: PreferredTerm
modified: 2014-09-18T16:26:33+02:00
created: 2014-01-15T14:54:24+01:00
status: 1

meuble lié au chauffage
type: PreferredTerm
modified: 2014-10-17T15:30:20+02:00
created: 2014-01-15T14:54:24+01:00
status: 1

barres à sécher les bûches
type: SimpleNonPreferredTerm
modified: 2014-10-17T15:30:20+02:00
created: 2014-01-15T14:54:24+01:00
status: 1

radiateur
type: Concept
modified: 2014-12-05T11:09:59+01:00
in scheme: Thésaurus de la désignation des objets mobiliers
preferred label: radiators @en-us
broader: meuble lié au chauffage
created: 2012-05-16T00:00:00+02:00
definition: Appareil à gaz ou électrique relié ou non à un chauffage central et destiné à assurer le chauffage d'une pièce.
status: 1

brasier
type: Concept
modified: 2014-12-05T10:57:59+01:00
in scheme: Thésaurus de la désignation des objets mobiliers
preferred label: braziers (cooking, heating equipment) @en-us
broader: meuble lié au chauffage
alternative label: brasero
created: 2012-05-16T00:00:00+02:00
related: chaufferette
related: réchaud à charbon liturgique
definition: Meuble comportant un récipient de métal non fermé, portant au sol, servant à contenir des braises pour le chauffage d'une salle.
TermeAssocie: chaufferette
TermeAssocie: réchaud à charbon liturgique
status: 1

objet de dévotion encadré
type: Concept
modified: 2014-11-26T16:30:30+01:00
in scheme: Thésaurus de la désignation des objets mobiliers
preferred label: oggetto devozionale incorniciato @it
preferred label: framed devotional objects @en-us
preferred label: objecto devocional emoldurado @pt
broader: objet de dévotion
created: 2012-05-16T00:00:00+02:00
related: agnus Dei
definition: Représentation d'un sujet religieux en deux dimensions ou en faible relief, placée dans un cadre et parfois décorée de papiers roulés.
TermeAssocie: agnus Dei
status: 1
broad match: http://vocab.getty.edu/aat/300234144
broad match: Dévotions catholiques

objet de dévotion encadré
type: PreferredTerm
modified: 2014-11-26T16:30:30+01:00
created: 2014-01-15T14:54:24+01:00
status: 1

agnus Dei
type: Concept
modified: 2014-11-26T14:16:42+01:00
in scheme: Thésaurus de la désignation des objets mobiliers
preferred label: Agnus Deis (medallions) @en-us
preferred label: agnus-Dei @pt
broader: objet de dévotion
alternative label: boîte à agnus-Dei
alternative label: reliquaire à agnus-Dei
alternative label: médaillon à agnus-Dei
created: 2012-05-16T00:00:00+02:00
related: objet de dévotion encadré
definition: Médaillon en cire blanche béni par le pape et distribué à Rome fabriqué à partir des cierges pascals des basiliques romaines ou des cierges offerts au souverain pontife. Il porte sur l'avers la représentation de l'Agneau pascal avec le nom du pape et l'année du règne et au revers des figures de saints ou les armoiries du pape.
TermeAssocie: objet de dévotion encadré
status: 1

engin motorisé agricole
type: Concept
modified: 2014-12-30T10:57:47+01:00
in scheme: Thésaurus de la désignation des objets mobiliers
broader: véhicule routier motorisé spécialisé
alternative label: moissonneuse batteuse
alternative label: tracteur agricole
alternative label: vendangeuse
created: 2013-11-06T00:00:00+01:00
definition: Véhicule motorisé équipé des outils ou machines nécessaires à la réalisation de tâches agricoles ou doté d'un système pour les tracter.
status: 1
broad match: http://vocab.getty.edu/aat/300233315

véhicule routier motorisé spécialisé
type: PreferredTerm
modified: 2014-10-16T11:22:17+02:00
created: 2014-01-15T14:54:24+01:00
status: 1

bourdon
type: Concept
modified: 2014-12-15T12:19:02+01:00
in scheme: Thésaurus de la désignation des objets mobiliers
broader: cloche
created: 2013-12-19T00:00:00+01:00
definition: Très grosse cloche ou cloche la plus grave d'un ensemble campanaire.
status: 1
broad match: http://data.bnf.fr/ark:/12148/cb119472107
broad match: http://vocab.getty.edu/aat/300391226
broad match: Cloche

cloche
type: PreferredTerm
modified: 2014-12-15T12:17:34+01:00
created: 2014-01-15T14:54:24+01:00
status: 1

encolleuse
type: SimpleNonPreferredTerm
modified: 2015-09-25T11:03:35+02:00
created: 2014-01-15T14:54:24+01:00
status: 1

machine à revêtir par dépôt
type: PreferredTerm
modified: 2015-09-25T10:58:20+02:00
created: 2014-01-15T14:54:24+01:00
status: 1

coupe décorative de crédence
type: SimpleNonPreferredTerm
modified: 2014-11-27T13:26:52+01:00
created: 2014-01-15T14:54:24+01:00
status: 1

service de montre de crédence
type: SimpleNonPreferredTerm
modified: 2014-11-27T13:26:52+01:00
created: 2014-01-15T14:54:24+01:00
status: 1

vase décoratif de crédence
type: SimpleNonPreferredTerm
modified: 2014-11-27T13:26:52+01:00
created: 2014-01-15T14:54:24+01:00
status: 1

service d'apparat de crédence
type: SimpleNonPreferredTerm
modified: 2014-11-27T13:26:52+01:00
created: 2014-01-15T14:54:24+01:00
status: 1

plat décoratif de crédence
type: SimpleNonPreferredTerm
modified: 2014-11-27T13:26:52+01:00
created: 2014-01-15T14:54:24+01:00
status: 1

service décoratif de crédence
type: PreferredTerm
modified: 2014-11-27T13:26:52+01:00
created: 2014-01-15T14:54:24+01:00
status: 1

parement des fonts baptismaux
type: Concept
modified: 2014-12-03T11:00:45+01:00
in scheme: Thésaurus de la désignation des objets mobiliers
preferred label: baptismal font facing @en-us
preferred label: guarnizione del fonte battesimale @it
preferred label: pano da pia baptismal @pt
broader: linge ou garniture liés aux sacrements autres que l'Eucharistie
alternative label: tour des fonts baptismaux
created: 2012-05-16T00:00:00+02:00
related: fonts baptismaux
definition: Tissu que l'on suspend autour de la cuve ou sur le couvercle des fonts baptismaux pour l'orner.
TermeAssocie: fonts baptismaux
status: 1
broad match: cb11978488k
broad match: http://vocab.getty.edu/aat/300080617

parement des fonts baptismaux
type: PreferredTerm
modified: 2014-12-03T11:00:46+01:00
created: 2014-01-15T14:54:24+01:00
status: 1

tour des fonts baptismaux
type: SimpleNonPreferredTerm
modified: 2014-12-03T11:00:46+01:00
created: 2014-01-15T14:54:24+01:00
status: 1

écorché
type: Concept
modified: 2014-12-15T16:19:39+01:00
in scheme: Thésaurus de la désignation des objets mobiliers
preferred label: écorchés (models) @en-us
broader: objet de représentation d'un organisme vivant
created: 2013-11-29T00:00:00+01:00
related: sculpture
definition: Élément en plâtre, en cire ou en matériau synthétique, ou encore élément naturel ayant subi un traitement chimique, représentant l'anatomie située sous la peau de tout ou partie du corps d'un être vivant. L'écorché peut, dans certains cas, prendre la valeur d'une sculpture.
TermeAssocie: sculpture
status: 1

écorché
type: PreferredTerm
modified: 2014-12-15T16:19:39+01:00
created: 2014-01-15T14:54:24+01:00
status: 1

boîte à ordures
type: Concept
modified: 2014-10-13T10:37:33+02:00
in scheme: Thésaurus de la désignation des objets mobiliers
preferred label: trash cans @en-us
broader: boîte
alternative label: poubelle
created: 2012-05-16T00:00:00+02:00
definition: Récipient comportant un couvercle, parfois placé sous l'évier, et servant à entreposer les ordures.
status: 1

boîte
type: Concept
modified: 2014-12-04T15:56:11+01:00
in scheme: Thésaurus de la désignation des objets mobiliers
preferred label: boxes @en-us
narrower: boîte à ordures
narrower: boîte à lettres
broader: meuble de rangement et d'exposition
created: 2012-05-16T00:00:00+02:00
related: boîte décorative
definition: Récipient réalisé dans un matériau rigide, posé au sol ou d'applique. La boîte est facilement transportable et munie d'un couvercle le plus souvent.
TermeAssocie: boîte décorative
status: 1

boîte à ordures
type: PreferredTerm
modified: 2014-10-13T10:37:33+02:00
created: 2014-01-15T14:54:24+01:00
status: 1

poubelle
type: SimpleNonPreferredTerm
modified: 2014-10-13T10:37:33+02:00
created: 2014-01-15T14:54:24+01:00
status: 1

membranophone
type: Concept
modified: 2014-10-10T14:40:36+02:00
in scheme: Thésaurus de la désignation des objets mobiliers
preferred label: membranophones @en-us
narrower: rommelpot
narrower: tambour sur fût
narrower: timbales
narrower: mirliton
narrower: tambour sur cadre
broader: instrument de musique
created: 2012-05-16T00:00:00+02:00
definition: Instrument dont le son est produit par la vibration d'une membrane tendue sur un cadre, vibration obtenue par percussion, friction ou soufflement.
status: 1

rommelpot
type: Concept
modified: 2014-10-10T14:43:43+02:00
in scheme: Thésaurus de la désignation des objets mobiliers
preferred label: friction drums @en-us
broader: membranophone
alternative label: tambour à friction
created: 2012-05-16T00:00:00+02:00
definition: Instrument constitué d'un pot en terre ou d'un cylindre de bois creux, avec une membrane en vessie animale tendue sur l'ouverture ; une baguette plantée dans le milieu de la membrane est actionnée par un mouvement circulaire et vertical.
status: 1

tambour sur fût
type: Concept
modified: 2014-12-15T13:04:54+01:00
in scheme: Thésaurus de la désignation des objets mobiliers
preferred label: tubular drums @en-us
broader: membranophone
alternative label: tambour militaire
alternative label: grosse caisse
alternative label: caisse claire
alternative label: tambour de Provence
created: 2012-05-16T00:00:00+02:00
related: baguette
definition: Tambour, à fût cylindrique unique et à une ou deux peaux tendues, dont on joue avec des baguettes.
TermeAssocie: baguette
status: 1

timbales
type: Concept
modified: 2014-12-15T13:06:09+01:00
in scheme: Thésaurus de la désignation des objets mobiliers
preferred label: kettledrums @en-us
broader: membranophone
alternative label: timbalons
created: 2012-05-16T00:00:00+02:00
scope note: Le terme peut également désigner une paire de petits tambours de même forme, que l'on porte accrochés à la ceinture. Instrument militaire de la cavalerie.
related: baguette
definition: Paire de cuvettes à peau tendue sur une caisse, le plus souvent, hémisphérique en cuivre ou en tôle. On en joue en frappant alternativement chaque tambour avec deux baguettes terminées par une petite boule recouverte de tissu.
TermeAssocie: baguette
status: 1

membranophone
type: PreferredTerm
modified: 2014-10-10T14:40:36+02:00
created: 2014-01-15T14:54:24+01:00
status: 1

mirliton
type: Concept
modified: 2014-10-10T14:41:34+02:00
in scheme: Thésaurus de la désignation des objets mobiliers
preferred label: kazoos @en-us
broader: membranophone
created: 2012-05-16T00:00:00+02:00
definition: Instrument en forme de tuyau dont les extrémités sont fermées par une fine membrane de papier, de pelure d'oignon ou de peau ; une ouverture latérale est percée près de chaque extrémité et permet l'émission du son.
status: 1

tambour sur cadre
type: Concept
modified: 2014-10-10T14:44:41+02:00
in scheme: Thésaurus de la désignation des objets mobiliers
preferred label: frame drums @en-us
broader: membranophone
alternative label: tambour de basque
alternative label: tambour à cymbalettes
alternative label: tambourin
alternative label: pandero
alternative label: tambourin à sonnailles
created: 2012-05-16T00:00:00+02:00
related: sonnailles
related: cadre à grelots
related: grelot
definition: Petit tambour, constitué d'une seule peau ou membrane tendue sur un cadre et qui peut être peinte comme un tableau. Il est parfois accompagné de sonnailles et de grelots. On en joue en le frappant directement avec une ou deux mains.
TermeAssocie: sonnailles
TermeAssocie: cadre à grelots
TermeAssocie: grelot
status: 1

dragueur de mines
type: SimpleNonPreferredTerm
modified: 2014-12-19T12:44:07+01:00
created: 2014-01-15T14:54:24+01:00
status: 1

chasseur de mines
type: PreferredTerm
modified: 2014-12-19T12:44:07+01:00
created: 2014-01-15T14:54:24+01:00
status: 1

machine à modifier la température
type: Concept
modified: 2015-10-15T17:48:07+02:00
in scheme: Thésaurus de la désignation des objets mobiliers
narrower: machine à chauffer
narrower: machine à refroidir
broader: machine à modifier l'état physique
created: 2012-05-16T00:00:00+02:00
definition: Machine à modifier l'état physique d'un matériau ou d'un produit en l'amenant à la température d'exploitation ou de manipulation souhaitée.
status: 1

machine à modifier l'état physique
type: Concept
modified: 2014-01-10T00:00:00+01:00
in scheme: Thésaurus de la désignation des objets mobiliers
narrower: machine à modifier la siccité
narrower: machine à modifier la température
narrower: machine à modifier la malléabilité
narrower: T69-5995
broader: machine à modifier l'état
created: 2012-05-16T00:00:00+02:00
definition: Machine à modifier l'état d'un produit en en changeant les caractéristiques physiques.
status: 1

machine à modifier la température
type: PreferredTerm
modified: 2015-10-15T17:48:07+02:00
created: 2014-01-15T14:54:24+01:00
status: 1

machine à chauffer
type: Concept
modified: 2015-10-15T17:45:06+02:00
in scheme: Thésaurus de la désignation des objets mobiliers
broader: machine à modifier la température
alternative label: réchauffe-vin
alternative label: forge portative
alternative label: chaudière à sucre
alternative label: chauffe-vin
alternative label: chaudière
created: 2012-05-16T00:00:00+02:00
definition: Machine à modifier la température d'un matériau ou d'un produit en l'exposant à une source de chaleur.
status: 1
narrow match: http://vocab.getty.edu/aat/300052148
narrow match: cb11934809r
narrow match: Chaudière

machine à refroidir
type: Concept
modified: 2015-10-15T17:57:12+02:00
in scheme: Thésaurus de la désignation des objets mobiliers
broader: machine à modifier la température
alternative label: pipe de refroidissement
alternative label: réfrigérant
created: 2012-05-16T00:00:00+02:00
definition: Machine à modifier la température d'un matériau ou d'un produit en l'exposant au froid ou à un système de refroidissement.
status: 1

linge lié à la dévotion
type: Concept
modified: 2014-12-02T15:47:38+01:00
in scheme: Thésaurus de la désignation des objets mobiliers
preferred label: lini e coperture per la devozione @it
preferred label: linen related to devotion @en-us
preferred label: guarnições relacionadas com a devoção @pt
broader: linge ou garniture du culte catholique
alternative label: scapulaire
alternative label: voile de baiser de paix
alternative label: linge du baiser de paix
alternative label: sachet d'accouchée
created: 2012-05-16T00:00:00+02:00
definition: Pièce textile destinée à couvrir, protéger, envelopper, etc., un objet de dévotion.
status: 1

sachet d'accouchée
type: SimpleNonPreferredTerm
modified: 2014-12-02T15:47:38+01:00
created: 2014-01-15T14:54:24+01:00
status: 1

scapulaire
type: SimpleNonPreferredTerm
modified: 2014-12-02T15:47:38+01:00
created: 2014-01-15T14:54:24+01:00
status: 1

voile de baiser de paix
type: SimpleNonPreferredTerm
modified: 2014-12-02T15:47:38+01:00
created: 2014-01-15T14:54:24+01:00
status: 1

linge du baiser de paix
type: SimpleNonPreferredTerm
modified: 2014-12-02T15:47:38+01:00
created: 2014-01-15T14:54:24+01:00
status: 1

linge lié à la dévotion
type: PreferredTerm
modified: 2014-12-02T15:47:38+01:00
created: 2014-01-15T14:54:24+01:00
status: 1

meuble annexe des sièges
type: PreferredTerm
modified: 2014-10-10T15:47:29+02:00
created: 2014-01-15T14:54:24+01:00
status: 1

panneau
type: SimpleNonPreferredTerm
modified: 2014-12-15T17:39:42+01:00
created: 2014-01-15T14:54:24+01:00
status: 1

panneau de verrière
type: PreferredTerm
modified: 2014-12-15T17:39:42+01:00
created: 2014-01-15T14:54:24+01:00
status: 1

bateau de surveillance
type: Concept
modified: 2014-10-16T10:05:22+02:00
in scheme: Thésaurus de la désignation des objets mobiliers
preferred label: law enforcement vessels @en-us
broader: bateau de service
created: 2012-05-16T00:00:00+02:00
definition: Bateau du service des douanes, des affaires maritimes, de la gendarmerie, de la police, etc.
status: 1
narrow match: Police watercraft
broad match: cb11953087h

bateau de surveillance
type: PreferredTerm
modified: 2014-10-16T10:05:22+02:00
created: 2014-01-15T14:54:24+01:00
status: 1

tronc à quêter de la religion juive
type: Concept
modified: 2014-01-10T00:00:00+01:00
in scheme: Thésaurus de la désignation des objets mobiliers
broader: objet lié à la vie sociale
alternative label: tronc à aumônes de Pourim
alternative label: tronc à aumônes de la religion juive
created: 2012-05-16T00:00:00+02:00
scope note: Le tronc à aumônes de Pourim, moment où l'offrande sous toutes ses formes est particulièrement recommandée, peut porter des inscriptions particulières, le nom de Pourim surtout.
definition: Tronc destiné à recueillir les aumônes en argent ; il peut être réalisé dans des matériaux divers.
status: 1

tronc à aumônes de la religion juive
type: SimpleNonPreferredTerm
modified: 2014-01-10T00:00:00+01:00
created: 2014-01-15T14:54:24+01:00
status: 1

objet lié à la vie sociale
type: Concept
modified: 2014-01-10T00:00:00+01:00
in scheme: Thésaurus de la désignation des objets mobiliers
narrower: tronc à quêter de la religion juive
narrower: étui à amulette de la religion juive
narrower: amulette de la religion juive
broader: objet lié au culte domestique
created: 2012-05-16T00:00:00+02:00
status: 1

tronc à quêter de la religion juive
type: PreferredTerm
modified: 2014-01-10T00:00:00+01:00
created: 2014-01-15T14:54:24+01:00
status: 1

tronc à aumônes de Pourim
type: SimpleNonPreferredTerm
modified: 2014-01-10T00:00:00+01:00
created: 2014-01-15T14:54:24+01:00
status: 1

auvent
type: Concept
modified: 2014-12-15T16:52:45+01:00
in scheme: Thésaurus de la désignation des objets mobiliers
preferred label: canopies (structural elements) @en-us
broader: couverture ou accessoire du toit
alternative label: marquise
created: 2012-06-07T00:00:00+02:00
definition: Couverture en surplomb, généralement en appentis, couvrant un espace à l’air libre devant une baie, une façade.
status: 1

élément d'évacuation des eaux
type: Concept
modified: 2014-10-15T14:22:24+02:00
in scheme: Thésaurus de la désignation des objets mobiliers
preferred label: building drainage components @en-us
narrower: T69-6702
narrower: T69-308
narrower: T69-306
narrower: T69-304
broader: couverture ou accessoire du toit
created: 2012-05-16T00:00:00+02:00
definition: Récipient, conduit ou tuyau permettant de recueillir, canaliser et écouler les eaux de pluie.
status: 1
broad match: http://vocab.getty.edu/aat/300052565
broad match: Couverture (construction)

couverture ou accessoire du toit
type: PreferredTerm
modified: 2015-02-20T17:21:43+01:00
created: 2014-01-15T14:54:24+01:00
status: 1

épi de faîtage
type: Concept
modified: 2015-01-07T11:08:00+01:00
in scheme: Thésaurus de la désignation des objets mobiliers
preferred label: épis (ornaments) @en-us
narrower: T69-296
broader: couverture ou accessoire du toit
created: 2012-05-16T00:00:00+02:00
related: poinçon de charpente
definition: Ornement le plus souvent en métal ou en céramique, formé de plusieurs éléments et placé aux extrémités d'un faîte de toit.
TermeAssocie: poinçon de charpente
status: 1

devant de lucarne
type: Concept
modified: 2015-01-07T10:23:49+01:00
in scheme: Thésaurus de la désignation des objets mobiliers
broader: couverture ou accessoire du toit
created: 2012-05-16T00:00:00+02:00
definition: Partie monumentale en maçonnerie ou charpente plus importante que la lucarne elle-même, et qui s'élève en général à l'aplomb du mur-gouttereau.
status: 1
broad match: http://data.bnf.fr/ark:/12148/cb11979907c
broad match: http://vocab.getty.edu/aat/300002232
broad match: Lucarne

dais d'architecture
type: Concept
modified: 2014-12-15T17:29:17+01:00
in scheme: Thésaurus de la désignation des objets mobiliers
preferred label: architectural canopies @en-us
broader: couverture ou accessoire du toit
alternative label: dais
created: 2012-05-16T00:00:00+02:00
definition: Couverture en surplomb protégeant l'emplacement réservé à une statue, à un siège, etc.
status: 1

girouette
type: Concept
modified: 2015-01-07T11:15:46+01:00
in scheme: Thésaurus de la désignation des objets mobiliers
preferred label: weathervanes @en-us
narrower: T69-299
broader: couverture ou accessoire du toit
created: 2012-05-16T00:00:00+02:00
definition: Elément monté sur une tige et tournant sous l'action des vents dont elle indique la direction.
status: 1

linge et garniture liés aux cycles de la vie
type: Concept
modified: 2014-01-10T00:00:00+01:00
in scheme: Thésaurus de la désignation des objets mobiliers
narrower: garniture liée au mariage
broader: textile de la religion juive
created: 2012-05-16T00:00:00+02:00
status: 1

linge et garniture liés aux fêtes liturgiques et au culte domestique
type: Concept
modified: 2014-01-10T00:00:00+01:00
in scheme: Thésaurus de la désignation des objets mobiliers
narrower: napperon liturgique
narrower: couvre-pains
narrower: enveloppe pour les pains azymes
broader: textile de la religion juive
created: 2012-05-16T00:00:00+02:00
status: 1

garniture et vêtement liés à la prière
type: Concept
modified: 2014-01-10T00:00:00+01:00
in scheme: Thésaurus de la désignation des objets mobiliers
narrower: calotte de prière
narrower: T69-2434
narrower: T69-2436
narrower: T69-2431
broader: textile de la religion juive
created: 2012-05-16T00:00:00+02:00
status: 1

textile de la religion juive
type: PreferredTerm
modified: 2014-01-10T00:00:00+01:00
created: 2014-01-15T14:54:24+01:00
status: 1

véhicule routier motorisé lourd
type: Concept
modified: 2014-10-16T11:17:55+02:00
in scheme: Thésaurus de la désignation des objets mobiliers
preferred label: heavy vehicles @en-us
narrower: trolleybus
narrower: camion
narrower: autobus
broader: véhicule terrestre motorisé
alternative label: poids lourd
created: 2013-11-06T00:00:00+01:00
definition: Véhicule routier de plus de 3,5 tonnes, affecté soit au transport de marchandises, soit au transport de personnes.
status: 1
broad match: http://vocab.getty.edu/aat/300227809

trolleybus
type: Concept
modified: 2014-10-16T11:19:58+02:00
in scheme: Thésaurus de la désignation des objets mobiliers
preferred label: trolleybuses @en-us
broader: véhicule routier motorisé lourd
created: 2013-11-06T00:00:00+01:00
definition: Grand véhicule automobile destiné aux transports collectifs dont la traction électrique est alimentée par une ligne de contact aérienne.
status: 1

poids lourd
type: SimpleNonPreferredTerm
modified: 2014-10-16T11:17:55+02:00
created: 2014-01-15T14:54:24+01:00
status: 1

camion
type: Concept
modified: 2014-12-30T10:46:42+01:00
in scheme: Thésaurus de la désignation des objets mobiliers
preferred label: trucks @en-us
broader: véhicule routier motorisé lourd
alternative label: camion frigorifique
alternative label: fourgon
alternative label: camion-citerne
alternative label: semi-remorque
alternative label: camion-benne
alternative label: camion porteur
alternative label: tombereau-camion
alternative label: tracteur routier
created: 2013-11-06T00:00:00+01:00
definition: Véhicule routier lourd pour le transport des marchandises. Le camion porteur présente sur le même châssis la cabine et un volume de chargement. Le tracteur routier constitue un véhicule articulé. Il comprend une partie motrice (la cabine et un châssis) à laquelle on attèle une semi-remorque. En fonction du type de marchandise à transporter, le camion revêt différentes formes (camion-citerne, camion frigorifique, camion bâché, etc.).
status: 1

véhicule routier motorisé lourd
type: PreferredTerm
modified: 2014-10-16T11:17:55+02:00
created: 2014-01-15T14:54:24+01:00
status: 1

autobus
type: Concept
modified: 2014-12-30T10:42:57+01:00
in scheme: Thésaurus de la désignation des objets mobiliers
preferred label: buses @en-us
broader: véhicule routier motorisé lourd
alternative label: autobus à impériale
alternative label: autocar
created: 2013-11-06T00:00:00+01:00
definition: Grand véhicule automobile destiné aux transports collectifs.
status: 1

mont calvaire
type: Concept
modified: 2015-02-24T12:13:22+01:00
in scheme: Thésaurus de la désignation des objets mobiliers
broader: édicule religieux chrétien
alternative label: chemin de croix extérieur
created: 2012-05-16T00:00:00+02:00
scope note: Ne pas confondre avec calvaire monumental. Voir aussi le Thesaurus de la désignation des œuvres architecturales et des espaces aménagés.
definition: Chemin de croix extérieur dont les stations sont marquées par de petits oratoires échelonnés sur un parcours qui conduit à une croix monumentale ou à une église.
status: 1

chemin de croix extérieur
type: SimpleNonPreferredTerm
modified: 2015-02-24T12:13:22+01:00
created: 2014-01-15T14:54:24+01:00
status: 1

mont calvaire
type: PreferredTerm
modified: 2015-02-24T12:13:22+01:00
created: 2014-01-15T14:54:24+01:00
status: 1

brasier
type: PreferredTerm
modified: 2014-12-05T10:57:59+01:00
created: 2014-01-15T14:54:24+01:00
status: 1

chaufferette
type: Concept
modified: 2014-12-10T17:06:40+01:00
in scheme: Thésaurus de la désignation des objets mobiliers
preferred label: warmers @en-us
narrower: T69-4535
broader: objet pour le chauffage
alternative label: réchaud à braises
alternative label: chaufferette à pieds
alternative label: chaufferette de moine
alternative label: chaufferette de voyage
alternative label: chaufferette à mains
created: 2012-05-16T00:00:00+02:00
related: brasier
related: réchaud à charbon liturgique
definition: Récipient, contenant des braises, servant à se réchauffer les mains ou les pieds, ou bien à chauffer un lit. La chaufferette comporte des trous pour l'aération dans la partie supérieure.
TermeAssocie: brasier
TermeAssocie: réchaud à charbon liturgique
status: 1
narrow match: http://vocab.getty.edu/aat/300375242
broad match: cb11934810z

brasero
type: SimpleNonPreferredTerm
modified: 2014-12-05T10:57:59+01:00
created: 2014-01-15T14:54:24+01:00
status: 1

réchaud à charbon liturgique
type: Concept
modified: 2014-11-27T11:51:03+01:00
in scheme: Thésaurus de la désignation des objets mobiliers
preferred label: braciere liturgico @it
preferred label: liturgical braziers @en-us
preferred label: fogareiro litúrgico @pt
broader: objet lié à l'ablution, à l'aspersion et à l'encensement
alternative label: trépied à feu liturgique
alternative label: brasero d'église
alternative label: berceau à charbon liturgique
alternative label: pincettes à charbon pour l'encens
created: 2012-05-16T00:00:00+02:00
related: brasier
related: chaufferette
definition: Récipient, souvent à trois pieds ou posé sur un trépied plus ou moins haut, permettant d'allumer les braises nécessaires à l'encensement et à allumer le cierge pascal, lors de la liturgie du Samedi saint. Il s'accompagne de pincettes à charbon pour l'encens et d'une pelle à charbon.
TermeAssocie: brasier
TermeAssocie: chaufferette
status: 1

tabernacle
type: Concept
modified: 2014-12-01T16:54:09+01:00
in scheme: Thésaurus de la désignation des objets mobiliers
preferred label: tabernacolo @it
preferred label: tabernacles (liturgical containers) @en-us
preferred label: sacrário @pt
narrower: porte de tabernacle
broader: meuble lié à l'Eucharistie
alternative label: tabernacle-exposition
alternative label: réserve eucharistique
created: 2012-05-16T00:00:00+02:00
related: ciboire
related: clef de tabernacle
related: conopée
definition: Armoire plus ou moins développée, souvent de forme architecturale, fermant à clef, placée sur un autel et servant à conserver la réserve eucharistique.
TermeAssocie: ciboire
TermeAssocie: clef de tabernacle
TermeAssocie: conopée
status: 1

clef de tabernacle
type: Concept
modified: 2014-11-27T14:54:52+01:00
in scheme: Thésaurus de la désignation des objets mobiliers
preferred label: tabernacle keys @en-us
preferred label: chiave del tabernacolo @it
preferred label: chave de sacrário @pt
broader: objet lié à l'Eucharistie
created: 2012-05-16T00:00:00+02:00
related: tabernacle
definition: Clef servant à fermer un tabernacle ou un tabernacle du Jeudi saint. Généralement attachée à une petite chaîne ou à un cordon terminé par un pompon, elle est conservée dans la sacristie de l'église.
TermeAssocie: tabernacle
status: 1
broad match: http://vocab.getty.edu/aat/300033579

meuble lié à l'Eucharistie
type: Concept
modified: 2014-12-01T16:22:41+01:00
in scheme: Thésaurus de la désignation des objets mobiliers
preferred label: arredi per l'Eucaristia @it
preferred label: furniture and furnishings for the Eucharist @en-us
preferred label: mobiliário relacionado com a eucaristica @pt
narrower: tabernacle
narrower: tabernacle suspendu
narrower: agenouilloir de communion
narrower: suspension eucharistique
narrower: faux tabernacle
narrower: exposition
narrower: T69-666
narrower: T69-9084
narrower: T69-659
narrower: T69-652
narrower: T69-683
narrower: T69-681
broader: meuble du culte catholique
created: 2012-05-16T00:00:00+02:00
definition: Mobilier lié au sacrement de l’Eucharistie (sacrement contenant le corps, le sang et la divinité du Christ au terme de la transsubstantiation du pain et du vin).
status: 1

porte de tabernacle
type: Concept
modified: 2014-12-01T16:56:05+01:00
in scheme: Thésaurus de la désignation des objets mobiliers
preferred label: tabernacle doors @en-us
preferred label: sportello di tabernacolo @it
preferred label: porta de sacrário @pt
broader: tabernacle
created: 2012-05-16T00:00:00+02:00
definition: Vantail souvent orné d'une iconographie liée à l'Eucharistie.
status: 1
broad match: http://data.bnf.fr/ark:/12148/cb121654992

tabernacle
type: PreferredTerm
modified: 2014-12-01T16:54:09+01:00
created: 2014-01-15T14:54:24+01:00
status: 1

conopée
type: Concept
modified: 2014-12-02T16:22:04+01:00
in scheme: Thésaurus de la désignation des objets mobiliers
preferred label: conopeo di tabernacolo @it
preferred label: tabernacle veils @en-us
preferred label: conopeu @pt
broader: linge ou garniture liés à l'Eucharistie
alternative label: pavillon de tabernacle
created: 2012-05-16T00:00:00+02:00
related: tabernacle
definition: Voile recouvrant le tabernacle, de la couleur du temps liturgique.
TermeAssocie: tabernacle
status: 1

réserve eucharistique
type: SimpleNonPreferredTerm
modified: 2014-12-01T16:54:09+01:00
created: 2014-01-15T14:54:24+01:00
status: 1

tabernacle-exposition
type: SimpleNonPreferredTerm
modified: 2014-12-01T16:54:09+01:00
created: 2014-01-15T14:54:24+01:00
status: 1

clôture de monument funéraire
type: Concept
modified: 2014-12-01T14:52:21+01:00
in scheme: Thésaurus de la désignation des objets mobiliers
preferred label: recinzione di monumento funebre @it
preferred label: tomb railings @en-us
preferred label: grade de monumento funerário @pt
broader: clôture et séparation interne d'une église
created: 2012-05-16T00:00:00+02:00
related: monument funéraire
definition: Séparation comportant souvent une porte et permettant d'isoler un monument funéraire du reste d'une église ou d'un cimetière.
TermeAssocie: monument funéraire
status: 1
broad match: http://vocab.getty.edu/aat/300005926

clôture des fonts baptismaux
type: Concept
modified: 2014-12-01T14:55:58+01:00
in scheme: Thésaurus de la désignation des objets mobiliers
preferred label: recinzione del fonte battesimale @it
preferred label: baptistery railings @en-us
preferred label: grade de pia baptismal @pt
narrower: T69-762
broader: clôture et séparation interne d'une église
created: 2012-05-16T00:00:00+02:00
definition: Séparation comportant une porte située entre les fonts baptismaux ou la chapelle des fonts baptismaux et le reste de l'église.
status: 1
broad match: http://vocab.getty.edu/aat/300007444

clôture de confession
type: Concept
modified: 2014-12-01T14:47:24+01:00
in scheme: Thésaurus de la désignation des objets mobiliers
preferred label: confession rails @en-us
preferred label: recinzione della confessione @it
preferred label: grade de cripta @pt
broader: clôture et séparation interne d'une église
created: 2012-05-16T00:00:00+02:00
definition: Séparation comportant une porte et empêchant les fidèles de pénétrer en permanence dans la crypte ou la confession d'une église.
status: 1
broad match: http://vocab.getty.edu/aat/300003724
broad match: cb11964852h
broad match: Clôture

clôture d'autel
type: Concept
modified: 2014-12-01T14:28:55+01:00
in scheme: Thésaurus de la désignation des objets mobiliers
preferred label: altar rails @en-us
preferred label: recinzione di altare @it
preferred label: grade de altar @pt
broader: clôture et séparation interne d'une église
created: 2012-05-16T00:00:00+02:00
definition: Séparation comportant une porte et isolant un autel sur un ou plusieurs côtés. Lorsqu'elle est à hauteur d'appui, elle peut servir de table de communion.
status: 1

clôture de dévotion
type: Concept
modified: 2014-12-01T14:48:22+01:00
in scheme: Thésaurus de la désignation des objets mobiliers
preferred label: recinzione di monumento devozionale @it
preferred label: devotional object railing @en-us
preferred label: grade de monumento devocional @pt
broader: clôture et séparation interne d'une église
alternative label: clôture de relique
created: 2012-05-16T00:00:00+02:00
definition: Séparation – souvent une grille métallique avec une porte - protégeant et séparant du reste d'une église une œuvre de taille importante, objet d'une vénération particulière.
status: 1
broad match: http://vocab.getty.edu/aat/300003724
broad match: Clôture

clôture et séparation interne d'une église
type: PreferredTerm
modified: 2014-12-01T14:26:08+01:00
created: 2014-01-15T14:54:24+01:00
status: 1

clôture de choeur conventuel
type: Concept
modified: 2015-03-09T11:01:04+01:00
in scheme: Thésaurus de la désignation des objets mobiliers
preferred label: grilles @en-us
preferred label: recinzione del coro conventuale @it
preferred label: grade de coro conventual @pt
broader: clôture et séparation interne d'une église
alternative label: clôture de chœur conventuel
created: 2012-05-16T00:00:00+02:00
status: 1
broad match: http://data.bnf.fr/ark:/12148/cb135082436
broad match: http://vocab.getty.edu/aat/300002015

clôture liturgique
type: SimpleNonPreferredTerm
modified: 2014-12-01T14:26:08+01:00
created: 2014-01-15T14:54:24+01:00
status: 1

poutre de gloire
type: Concept
modified: 2014-12-01T15:02:21+01:00
in scheme: Thésaurus de la désignation des objets mobiliers
preferred label: rood beams @en-us
preferred label: trave trionfale @it
preferred label: trave triunfal @pt
broader: clôture et séparation interne d'une église
created: 2012-05-16T00:00:00+02:00
related: croix
related: calvaire
definition: Poutre portant une croix ou un calvaire, placée transversalement et en hauteur dans le vaisseau principal d'une église, généralement à l'entrée du chœur liturgique ou bien à l'entrée d'une chapelle.
TermeAssocie: croix
TermeAssocie: calvaire
status: 1
broad match: http://vocab.getty.edu/aat/300003724

clôture
type: Concept
modified: 2015-01-30T12:36:53+01:00
in scheme: Thésaurus de la désignation des objets mobiliers
preferred label: fences @en-us
broader: mur - garde-corps - clôture
created: 2012-05-16T00:00:00+02:00
scope note: Ne pas confondre avec l'enceinte qui a une fonction défensive. Voir aussi le Thesaurus de la désignation des œuvres architecturales et des espaces aménagés.
related: clôture et séparation interne d'une église
definition: Ouvrage divisant ou délimitant un espace et faisant obstacle au passage. Le terme est réservé aux édifices civils.
TermeAssocie: clôture et séparation interne d'une église
status: 1

clôture de choeur
type: Concept
modified: 2015-03-09T11:11:26+01:00
in scheme: Thésaurus de la désignation des objets mobiliers
preferred label: chancel screens @en-us
preferred label: recinzione del coro @it
preferred label: grade de coro @pt
narrower: jubé
broader: clôture et séparation interne d'une église
alternative label: chancel
alternative label: clôture de chœur
alternative label: pergula
alternative label: clôture de sanctuaire
created: 2012-05-16T00:00:00+02:00
related: iconostase
TermeAssocie: iconostase
status: 1

clôture de chaire à prêcher
type: Concept
modified: 2014-12-01T14:31:45+01:00
in scheme: Thésaurus de la désignation des objets mobiliers
preferred label: recinzione del pulpito @it
preferred label: pulpit railings @en-us
preferred label: parapeito de púlpito @pt
broader: clôture et séparation interne d'une église
created: 2012-05-16T00:00:00+02:00
related: chaire à prêcher
definition: Séparation comportant une porte et permettant d'isoler une chaire à prêcher de l'espace environnant.
TermeAssocie: chaire à prêcher
status: 1
broad match: http://vocab.getty.edu/aat/300003790

plat de la fête d'Esther
type: Concept
modified: 2014-01-10T00:00:00+01:00
in scheme: Thésaurus de la désignation des objets mobiliers
broader: objet lié à Pourim
alternative label: assiette de la fête d'Esther
alternative label: plat de Pourim
created: 2012-05-16T00:00:00+02:00
definition: Plat représentant le triomphe de Mardochée ou le festin d'Esther et sur lequel on dépose soit des aumônes pour lesœuvres, soit des présents qu'il est ordonné d'échanger entre amis lors de cette fête. Ce sont souvent des pâtisseries.
status: 1

plat de Pourim
type: SimpleNonPreferredTerm
modified: 2014-01-10T00:00:00+01:00
created: 2014-01-15T14:54:24+01:00
status: 1

plat de la fête d'Esther
type: PreferredTerm
modified: 2014-01-10T00:00:00+01:00
created: 2014-01-15T14:54:24+01:00
status: 1

assiette de la fête d'Esther
type: SimpleNonPreferredTerm
modified: 2014-01-10T00:00:00+01:00
created: 2014-01-15T14:54:24+01:00
status: 1

siège d'église orthodoxe
type: Concept
modified: 2014-01-10T00:00:00+01:00
in scheme: Thésaurus de la désignation des objets mobiliers
narrower: T69-1083
narrower: T69-1085
narrower: T69-1088
narrower: T69-1090
narrower: T69-1094
broader: meuble du culte orthodoxe
created: 2012-05-16T00:00:00+02:00
definition: Siège utilisé dans une église orthodoxe et destiné soit aux fidèles soit au clergé soit aux deux dans le cas de certaines stalles du narthex ou de la nef.
status: 1

autel orthodoxe
type: Concept
modified: 2014-01-10T00:00:00+01:00
in scheme: Thésaurus de la désignation des objets mobiliers
broader: meuble du culte orthodoxe
created: 2012-05-16T00:00:00+02:00
definition: Table consacrée, en bois, métal ou pierre, placée derrière l'iconostase, constituée d'un plateau carré ou rectangulaire, posée sur quatre ou cinq montants. Les reliques d'un saint sont placées dans une cavité ménagée, en principe, au centre du plateau et scellées par de la cire à cacheter lors de la consécration ; l'autel est recouvert d'une étoffe unie blanche en lin ou en soie, la chemise tombant jusqu'à terre et maintenue par un cordon, le tout entièrement caché par un deuxième linge, l'inditia (chalymata), en tissu précieux décoré dont les couleurs varient avec la liturgie.
status: 1

iconostase
type: Concept
modified: 2014-10-15T17:23:47+02:00
in scheme: Thésaurus de la désignation des objets mobiliers
broader: meuble du culte orthodoxe
created: 2012-05-16T00:00:00+02:00
related: clôture de choeur
definition: Cloison sur laquelle sont accrochées des icônes et qui sépare le sanctuaire, emplacement réservé au clergé pour la célébration des offices, du chœur, réservé aux choristes. L'iconostase comporte trois portes : au centre, la porte à deux vantaux, dite "porte sainte" ou "porte royale", doublée du côté du sanctuaire d'un rideau coulissant pour le passage de l'officiant ; à gauche et à droite, les portes du nord et du sud pour le passage des diacres et ministres du culte ne portant pas les vêtements sacrés.
TermeAssocie: clôture de choeur
status: 1

fonts baptismaux orthodoxes
type: Concept
modified: 2014-01-10T00:00:00+01:00
in scheme: Thésaurus de la désignation des objets mobiliers
broader: meuble du culte orthodoxe
alternative label: kholymbithra
created: 2012-05-16T00:00:00+02:00
definition: Cuve de métal mobile, servant au baptême par immersion complète, réservé aux nouveaux-nés. Généralement ovale ou circulaire, à fond arrondi posée sur un support indépendant le plus souvent, elle comporte sur le bord trois petits réceptacles pour les bougies.
status: 1

proskynétaire
type: Concept
modified: 2014-01-10T00:00:00+01:00
in scheme: Thésaurus de la désignation des objets mobiliers
broader: meuble du culte orthodoxe
created: 2012-05-16T00:00:00+02:00
definition: Piédestal supportant une icône. Les proskynétaires, en nombre très variable, sont placés face au peuple, répartis devant l'iconostase et dans le reste de l'église.
status: 1

meuble du culte orthodoxe
type: PreferredTerm
modified: 2014-01-10T00:00:00+01:00
created: 2014-01-15T14:54:24+01:00
status: 1

table pour l'office des morts
type: Concept
modified: 2014-01-10T00:00:00+01:00
in scheme: Thésaurus de la désignation des objets mobiliers
broader: meuble du culte orthodoxe
alternative label: table des colybes
created: 2012-05-16T00:00:00+02:00
definition: Table devant laquelle on fait la prière des morts (office des colybes) et sur laquelle sont disposés soit une croix, soit un calvaire (Crucifixion, la Vierge et saint Jean) et deux chandeliers ; on place en général cette table dans le narthex mais son emplacement est variable. On y distribue les colybes (gâteau fait de grains de blé bouillis saupoudré de sucre et garni de noix ou d'amandes que le prêtre bénit en mémoire des défunts) soit le jour de l'enterrement soit à certaines fêtes.
status: 1

tabernacle orthodoxe
type: Concept
modified: 2014-01-10T00:00:00+01:00
in scheme: Thésaurus de la désignation des objets mobiliers
broader: meuble du culte orthodoxe
alternative label: artophorion
created: 2012-05-16T00:00:00+02:00
definition: Edicule posé sur l'autel, comportant en sa partie inférieure un tiroir ou coffret dans lequel sont conservées d'une part la sainte Réserve (hosties consacrées desséchées servant à la communion des malades), d'autre part le pain de communion destiné à la liturgie des présanctifiés (rite du temps de Carême). Le tabernacle ne dépasse pas 50 cm de haut et peut prendre la forme d'une petite chapelle ou d'un dais.
status: 1

table de prothèse
type: Concept
modified: 2014-01-10T00:00:00+01:00
in scheme: Thésaurus de la désignation des objets mobiliers
broader: meuble du culte orthodoxe
created: 2012-05-16T00:00:00+02:00
related: crédence
definition: Table située derrière l'iconostase, à gauche de l'autel (côté nord du sanctuaire), servant à disposer les vases sacrés nécessaires à la préparation du pain et du vin destinés au sacrifice. La table de prothèse, de dimensions inférieures à celles de l'autel, comporte les mêmes revêtements, avec les mêmes couleurs.
TermeAssocie: crédence
status: 1

étui à amulette de la religion juive
type: Concept
modified: 2014-01-10T00:00:00+01:00
in scheme: Thésaurus de la désignation des objets mobiliers
broader: objet lié à la vie sociale
alternative label: étui à amulette
created: 2012-05-16T00:00:00+02:00
definition: Les amulettes constituées par des feuilles de papier ou de parchemin sur lesquelles sont écrites des formules protectrices peuvent être enfermées dans des étuis précieux, identifiés comme tels par des inscriptions mais proches des formes profanes ou catholiques en usage à l'époque de leur réalisation.
status: 1

étui à amulette de la religion juive
type: PreferredTerm
modified: 2014-01-10T00:00:00+01:00
created: 2014-01-15T14:54:24+01:00
status: 1

étui à amulette
type: SimpleNonPreferredTerm
modified: 2014-01-10T00:00:00+01:00
created: 2014-01-15T14:54:24+01:00
status: 1

horloge astronomique
type: Concept
modified: 2014-12-15T15:23:46+01:00
in scheme: Thésaurus de la désignation des objets mobiliers
preferred label: astronomical clocks @en-us
broader: instrument de mesure du temps
alternative label: horloge à astrolabe
created: 2012-05-16T00:00:00+02:00
definition: Horloge, de dimensions variables, à poser ou au sol, monumentale parfois, d'usage civil mais aussi liturgique dans certains cas et indiquant les planètes, les signes du zodiaque, les phases de la lune et les heures de lever et de coucher du soleil, les principales fêtes liturgiques.
status: 1

horloge astronomique
type: PreferredTerm
modified: 2014-12-15T15:23:46+01:00
created: 2014-01-15T14:54:24+01:00
status: 1

horloge à astrolabe
type: SimpleNonPreferredTerm
modified: 2014-12-15T15:23:46+01:00
created: 2014-01-15T14:54:24+01:00
status: 1

instrument de mesure du temps
type: Concept
modified: 2014-12-15T15:20:01+01:00
in scheme: Thésaurus de la désignation des objets mobiliers
preferred label: timepieces @en-us
narrower: horloge astronomique
narrower: horloge de précision
narrower: T69-3552
broader: instrument de mesure
alternative label: chronomètre
alternative label: sablier
alternative label: cadran équinoxial
alternative label: nocturlabe
alternative label: cadran aux étoiles
alternative label: clepsydre
created: 2012-05-16T00:00:00+02:00
related: horloge
related: objet ou matériel d'indication du temps
related: jacquemart
related: horloge publique
related: T69-7936
related: T69-469
definition: Instrument de mesure et/ou enregistrement des intervalles de temps, par voie mécanique, électromécanique ou électronique, ou de repérage de phénomènes astronomiques.
TermeAssocie: horloge
TermeAssocie: objet ou matériel d'indication du temps
TermeAssocie: jacquemart
TermeAssocie: horloge publique
TermeAssocie: T69-7936
TermeAssocie: T69-469
status: 1

camée
type: PreferredTerm
modified: 2014-12-03T17:05:55+01:00
created: 2014-01-15T14:54:24+01:00
status: 1

coussin
type: Concept
modified: 2014-12-12T12:22:02+01:00
in scheme: Thésaurus de la désignation des objets mobiliers
preferred label: cushions @en-us
broader: garniture de meuble
alternative label: housse de coussin
created: 2012-05-16T00:00:00+02:00
definition: Accessoire mobilier composé d'une enveloppe de tissu ou de cuir, emplie de laine, de plume, de crin, etc., utilisé comme élément de confort ou de décor.
status: 1

coussin
type: PreferredTerm
modified: 2014-12-12T12:22:02+01:00
created: 2014-01-15T14:54:24+01:00
status: 1

housse de coussin
type: SimpleNonPreferredTerm
modified: 2014-12-12T12:22:02+01:00
created: 2014-01-15T14:54:24+01:00
status: 1

boulin
type: Concept
modified: 2014-01-10T00:00:00+01:00
in scheme: Thésaurus de la désignation des objets mobiliers
broader: nichoir
created: 2013-12-16T00:00:00+01:00
status: 1

boulin
type: PreferredTerm
modified: 2014-01-10T00:00:00+01:00
created: 2014-01-15T14:54:24+01:00
status: 1

table à manger
type: Concept
modified: 2014-12-05T13:35:55+01:00
in scheme: Thésaurus de la désignation des objets mobiliers
preferred label: dining tables @en-us
broader: table pour l'alimentation
created: 2012-05-16T00:00:00+02:00
definition: Table servant spécifiquement à prendre un repas, seul ou à plusieurs. Elle comporte parfois un tiroir pour ranger les couverts. Un système de rallonges permet de l’agrandir, parfois d’y effectuer la vaisselle ou encore de couper le pain. Elle n'est identifiable que dans un nombre de cas limité.
status: 1

table pour l'alimentation
type: PreferredTerm
modified: 2014-10-14T12:33:58+02:00
created: 2014-01-15T14:54:24+01:00
status: 1

table rafraîchissoir
type: Concept
modified: 2014-12-05T13:40:41+01:00
in scheme: Thésaurus de la désignation des objets mobiliers
broader: table pour l'alimentation
created: 2012-05-16T00:00:00+02:00
definition: Petite table dont le plateau, plus rarement une tablette d'entrejambe, comporte une ou plusieurs cavités servant à placer un ou plusieurs seaux de métal destinés à rafraîchir des boissons. Cette table est placée auprès de la table de repas et sert également de servante.
status: 1
broad match: http://data.bnf.fr/ark:/12148/cb131630926
broad match: http://vocab.getty.edu/aat/300039760
broad match: Table

table garde-manger
type: Concept
modified: 2014-12-05T13:40:05+01:00
in scheme: Thésaurus de la désignation des objets mobiliers
broader: table pour l'alimentation
created: 2012-05-16T00:00:00+02:00
definition: Table à manger, longue et rectangulaire, servant à mettre les restes de repas (pain, fromage, salé) ou uniquement les provisions de pain. Le fond d'un tiroir peut être ajouré à cet effet. Certains tiroirs peuvent servir de pétrin à pâtisserie.
status: 1
broad match: http://data.bnf.fr/ark:/12148/cb131630926

table porte-chaudrons
type: SimpleNonPreferredTerm
modified: 2014-10-14T12:33:58+02:00
created: 2014-01-15T14:54:24+01:00
status: 1

table à déjeuner
type: Concept
modified: 2014-12-05T13:33:57+01:00
in scheme: Thésaurus de la désignation des objets mobiliers
preferred label: breakfast tables @en-us
broader: table pour l'alimentation
alternative label: table avec porte-pain
created: 2012-05-16T00:00:00+02:00
definition: Table circulaire, d'une certaine dimension, à roulettes, à dessus de marbre ou de porcelaine, généralement à galerie, pouvant comporter une tablette inférieure et servant à prendre des boissons ou une collation. Le dessus peut être redressable.
status: 1

table en cabaret
type: Concept
modified: 2014-12-05T13:39:13+01:00
in scheme: Thésaurus de la désignation des objets mobiliers
preferred label: tea tables (tables) @en-us
broader: table pour l'alimentation
alternative label: table à café
alternative label: table à thé
created: 2012-05-16T00:00:00+02:00
definition: Petite table chantournée, rectangulaire, circulaire, ovale ou triangulaire servant à prendre des boissons. Le dessus est creux ou constitué d’un plateau rapporté. Cette table, aux pieds parfois pliants, pouvait porter en permanence un service à thé ou à café.
status: 1

table susbout
type: SimpleNonPreferredTerm
modified: 2014-10-14T12:33:58+02:00
created: 2014-01-15T14:54:24+01:00
status: 1

machine à humidifier
type: Concept
modified: 2015-10-15T17:37:08+02:00
in scheme: Thésaurus de la désignation des objets mobiliers
broader: machine à modifier la siccité
alternative label: mouilleur intensif
created: 2012-05-16T00:00:00+02:00
definition: Machine à modifier la siccité d'un produit ou d'un matériau en en augmentant le degré d'humidité.
status: 1

mouilleur intensif
type: SimpleNonPreferredTerm
modified: 2015-10-15T17:37:08+02:00
created: 2014-01-15T14:54:24+01:00
status: 1

machine à humidifier
type: PreferredTerm
modified: 2015-10-15T17:37:08+02:00
created: 2014-01-15T14:54:24+01:00
status: 1

étagère verrier
type: Concept
modified: 2014-10-13T11:24:40+02:00
in scheme: Thésaurus de la désignation des objets mobiliers
broader: étagère
created: 2012-05-16T00:00:00+02:00
definition: Petite étagère en bois ou en terre cuite, suspendue, parfois à barres ou galeries antérieures, avec ou sans panneau de dos, servant à déposer des verres qui peuvent être ordinaires ou d'apparat.
status: 1
broad match: http://vocab.getty.edu/aat/300165847
broad match: Étagère

étagère verrier
type: PreferredTerm
modified: 2014-10-13T11:24:40+02:00
created: 2014-01-15T14:54:24+01:00
status: 1

coupe de commémoration de mariage
type: Concept
modified: 2014-01-10T00:00:00+01:00
in scheme: Thésaurus de la désignation des objets mobiliers
broader: objet lié au mariage
alternative label: coupe commémorative de mariage
alternative label: coupe de sanctification de mariage
created: 2012-05-16T00:00:00+02:00
definition: Coupe réalisée en matériaux variés reproduisant la coupe en verre que l'on brise traditionnellement lors de la cérémonie du mariage en souvenir de la destruction du temple de Jérusalem. Elle peut former une paire avec une autre coupe.
status: 1

objet lié au mariage
type: Concept
modified: 2014-01-10T00:00:00+01:00
in scheme: Thésaurus de la désignation des objets mobiliers
narrower: coupe de commémoration de mariage
narrower: contrat de mariage
narrower: assiette de mariage
broader: objet lié aux cycles de la vie
created: 2012-05-16T00:00:00+02:00
status: 1

coupe commémorative de mariage
type: SimpleNonPreferredTerm
modified: 2014-01-10T00:00:00+01:00
created: 2014-01-15T14:54:24+01:00
status: 1

coupe de sanctification de mariage
type: SimpleNonPreferredTerm
modified: 2014-01-10T00:00:00+01:00
created: 2014-01-15T14:54:24+01:00
status: 1

coupe de commémoration de mariage
type: PreferredTerm
modified: 2014-01-10T00:00:00+01:00
created: 2014-01-15T14:54:24+01:00
status: 1

plate-bande
type: Concept
modified: 2015-02-25T12:31:58+01:00
in scheme: Thésaurus de la désignation des objets mobiliers
preferred label: platbands @en-us
broader: couvrement
created: 2012-05-16T00:00:00+02:00
scope note: Voir aussi le Thesaurus de la désignation des œuvres architecturales et des espaces aménagés.
definition: Organe rectiligne, appareillé (à la différence du linteau) porté par deux points d'appui.
status: 1

plate-bande
type: PreferredTerm
modified: 2015-02-25T12:31:58+01:00
created: 2014-01-15T14:54:24+01:00
status: 1

ceinture de vêtement liturgique
type: Concept
modified: 2014-10-22T11:56:06+02:00
in scheme: Thésaurus de la désignation des objets mobiliers
preferred label: cinctures (girdles) @en-us
broader: accessoire du costume liturgique des clercs
alternative label: cordon de surplis
alternative label: ceinture de soutane
alternative label: cordon d'aube de confrérie
alternative label: ceinture d'aube
alternative label: ceinture de surplis
alternative label: ceinture de l'aube
alternative label: cordon d'aube
created: 2013-02-07T00:00:00+01:00
related: soutane
related: surplis
definition: Ceinture ou cordon en tissu permettant d’ajuster à la taille le vêtement liturgique.
TermeAssocie: soutane
TermeAssocie: surplis
status: 1

ceinture de surplis
type: SimpleNonPreferredTerm
modified: 2014-10-22T11:56:06+02:00
created: 2014-01-15T14:54:24+01:00
status: 1

cordon d'aube de confrérie
type: SimpleNonPreferredTerm
modified: 2014-10-22T11:56:06+02:00
created: 2014-01-15T14:54:24+01:00
status: 1

cordon d'aube
type: SimpleNonPreferredTerm
modified: 2014-10-22T11:56:06+02:00
created: 2014-01-15T14:54:24+01:00
status: 1

ceinture de l'aube
type: SimpleNonPreferredTerm
modified: 2014-10-22T11:56:06+02:00
created: 2014-01-15T14:54:24+01:00
status: 1

ceinture de soutane
type: SimpleNonPreferredTerm
modified: 2014-10-22T11:56:06+02:00
created: 2014-01-15T14:54:24+01:00
status: 1

cordon de surplis
type: SimpleNonPreferredTerm
modified: 2014-10-22T11:56:06+02:00
created: 2014-01-15T14:54:24+01:00
status: 1

surplis
type: Concept
modified: 2014-12-03T14:43:18+01:00
in scheme: Thésaurus de la désignation des objets mobiliers
preferred label: surplices @en-us
preferred label: cotta
preferred label: sobrepeliz @pt
broader: vêtement liturgique de dessus
alternative label: cotte
created: 2012-05-16T00:00:00+02:00
related: ceinture de vêtement liturgique
related: T69-2471
definition: Large vêtement porté sur une soutane et éventuellement un rochet, par tous les clercs sans habits spécifiques ainsi que par les chantres, les sacristains et les enfants de chœur. Il est en toile fine, blanche, en lin, en chanvre ou éventuellement en coton, descendant jusqu'aux genoux et abondamment plissé. Il est souvent à larges manches évasées, à fausses manches formant des ailes ou lobes, parfois extrêmement plissées ou encore sans manches et comportant une simple fente pour y passer les bras. A la différence du rochet, il porte rarement de la dentelle. Certains surplis d'enfants de chœur peuvent être maintenus à la taille par une ceinture ou un cordon de surplis. Lorsque le surplis est étroit, ne dépasse pas la ceinture et possède des manches courtes et larges, il prend le nom de cotta.
TermeAssocie: ceinture de vêtement liturgique
TermeAssocie: T69-2471
status: 1
broad match: cb11941484w

ceinture d'aube
type: SimpleNonPreferredTerm
modified: 2014-10-22T11:56:06+02:00
created: 2014-01-15T14:54:24+01:00
status: 1

ceinture de vêtement liturgique
type: PreferredTerm
modified: 2014-10-22T11:56:06+02:00
created: 2014-01-15T14:54:24+01:00
status: 1

lunette astronomique
type: Concept
modified: 2014-12-15T13:56:11+01:00
in scheme: Thésaurus de la désignation des objets mobiliers
broader: lunette optique
created: 2012-05-16T00:00:00+02:00
definition: Lunette destinée à l'observation des astres et qui fournit des images non redressées. La lunette astronomique se compose d'un objectif et d'un oculaire, constitués l'un et l'autre par un système de lentilles (à la différence du télescope, dont l'objectif est un miroir).
status: 1

lunette optique
type: Concept
modified: 2014-12-15T13:51:57+01:00
in scheme: Thésaurus de la désignation des objets mobiliers
narrower: lunette astronomique
narrower: longue-vue
broader: instrument d'observation
alternative label: télescope réfracteur
created: 2012-05-16T00:00:00+02:00
related: T69-9331
definition: Instrument optique composé d'une ou plusieurs lentilles, destiné à l'observation des objets éloignés en augmentant leur diamètre apparent.
TermeAssocie: T69-9331
status: 1
narrow match: cb11932308j
broad match: http://vocab.getty.edu/aat/300024585

lunette astronomique
type: PreferredTerm
modified: 2014-12-15T13:56:11+01:00
created: 2014-01-15T14:54:24+01:00
status: 1

outil servant à marquer
type: Concept
modified: 2014-01-10T00:00:00+01:00
in scheme: Thésaurus de la désignation des objets mobiliers
broader: outil
alternative label: fer à marquer
created: 2013-12-16T00:00:00+01:00
related: matrice de sceau
related: cachet
related: poinçon d'orfèvre
TermeAssocie: matrice de sceau
TermeAssocie: cachet
TermeAssocie: poinçon d'orfèvre
status: 1

fer à marquer
type: SimpleNonPreferredTerm
modified: 2014-01-10T00:00:00+01:00
created: 2014-01-15T14:54:24+01:00
status: 1

cachet
type: Concept
modified: 2014-12-10T15:10:14+01:00
in scheme: Thésaurus de la désignation des objets mobiliers
preferred label: stamps (tools) @en-us
broader: objet pour écrire ou de bureau
alternative label: tampon à encrer
alternative label: timbre sec
created: 2012-05-16T00:00:00+02:00
related: matrice de sceau
related: outil servant à marquer
related: poinçon d'orfèvre
definition: Instrument utilisé pour imprimer des initiales, une marque emblématique, un motif, etc. Cette empreinte (à sec, à l’encre ou dans la cire) clôt l’élément sur lequel elle est apposée ou en atteste l'authenticité.
TermeAssocie: matrice de sceau
TermeAssocie: outil servant à marquer
TermeAssocie: poinçon d'orfèvre
status: 1

poinçon d'orfèvre
type: Concept
modified: 2014-12-30T12:54:08+01:00
in scheme: Thésaurus de la désignation des objets mobiliers
broader: marque d'appartenance ou d'autorité
created: 2012-05-16T00:00:00+02:00
related: outil servant à marquer
related: cachet
definition: Outil, gravé en relief de signes, symboles, initiales, emblèmes, etc. utilisé par l’orfèvre pour marquer une pièce, d’or ou d’argent, permettant ainsi d’en reconnaître son auteur et son titre/qualité. Par extension, la marque est également appelée poinçon.
TermeAssocie: outil servant à marquer
TermeAssocie: cachet
status: 1

outil servant à marquer
type: PreferredTerm
modified: 2014-01-10T00:00:00+01:00
created: 2014-01-15T14:54:24+01:00
status: 1

trône abbatial
type: Concept
modified: 2014-12-02T15:24:25+01:00
in scheme: Thésaurus de la désignation des objets mobiliers
preferred label: abbot's thrones @en-us
preferred label: cattedra abbaziale @it
preferred label: cátedra abacial @pt
broader: trône pontifical
created: 2012-05-16T00:00:00+02:00
definition: Siège de chœur réservé à un abbé, mis en place et utilisé à l'occasion des cérémonies pontificales. De taille importante, il est placé sur une estrade à deux marches et surmonté généralement d'un dais.
status: 1

trône abbatial
type: PreferredTerm
modified: 2014-12-02T15:24:25+01:00
created: 2014-01-15T14:54:24+01:00
status: 1

meuble-moulin
type: Concept
modified: 2014-10-10T16:50:13+02:00
in scheme: Thésaurus de la désignation des objets mobiliers
broader: meuble à préparations diverses
alternative label: meuble-moulin à café
alternative label: moulin horizontal
alternative label: moulin vertical
created: 2012-05-16T00:00:00+02:00
related: moulin de cuisine
definition: Meuble comprenant un instrument en bois ou en pierre servant à écraser des grains. Il peut comprendre un tiroir de réception.
TermeAssocie: moulin de cuisine
status: 1

moulin de cuisine
type: Concept
modified: 2014-12-05T16:22:47+01:00
in scheme: Thésaurus de la désignation des objets mobiliers
preferred label: culinary mills @en-us
broader: instrument pour la préparation - le service ou la consommation des aliments et des boissons
alternative label: moulin à grains
alternative label: moulin à épices
alternative label: moulin à café
alternative label: moulin à sucre
alternative label: moulin à sel
alternative label: moulin à légumes
created: 2012-05-16T00:00:00+02:00
related: meuble-moulin
definition: Instrument en bois ou en métal servant à moudre les aliments en grains ou à broyer le sel ou le sucre, à l'aide d'un mécanisme à manivelle. Les grains sont introduits dans un réceptacle situé sur le dessus du corps ou encastré. La poudre obtenue s'écoule par un goulot. Elle peut aussi être recueillie dans un second réceptacle situé à la partie inférieure ou dans un tiroir.
TermeAssocie: meuble-moulin
status: 1

meuble-moulin
type: PreferredTerm
modified: 2014-10-10T16:50:13+02:00
created: 2014-01-15T14:54:24+01:00
status: 1

moulin vertical
type: SimpleNonPreferredTerm
modified: 2014-10-10T16:50:13+02:00
created: 2014-01-15T14:54:24+01:00
status: 1

meuble à préparations diverses
type: Concept
modified: 2014-10-10T16:45:42+02:00
in scheme: Thésaurus de la désignation des objets mobiliers
narrower: meuble-moulin
narrower: T69-3376
narrower: T69-3372
narrower: T69-3348
broader: meuble de préparation culinaire
alternative label: table à couper le chou
alternative label: meuble-broyeur à pommes de terre
alternative label: meuble à saucisse
alternative label: meuble à choucroute
alternative label: meuble presse-purée
alternative label: meuble à navet
created: 2012-05-16T00:00:00+02:00
definition: Meuble servant à râper, écraser, couper, presser, hacher etc, des aliments.
status: 1
broad match: http://data.bnf.fr/ark:/12148/cb131630461
broad match: http://vocab.getty.edu/aat/300199765
broad match: Meuble

moulin horizontal
type: SimpleNonPreferredTerm
modified: 2014-10-10T16:50:13+02:00
created: 2014-01-15T14:54:24+01:00
status: 1

meuble-moulin à café
type: SimpleNonPreferredTerm
modified: 2014-10-10T16:50:13+02:00
created: 2014-01-15T14:54:24+01:00
status: 1

bain-marie
type: Concept
modified: 2014-12-08T12:09:43+01:00
in scheme: Thésaurus de la désignation des objets mobiliers
preferred label: bains-marie (cookware) @en-us
broader: récipient pour la cuisson des aliments
alternative label: bain-marie à tripes
created: 2012-05-16T00:00:00+02:00
definition: Récipient à fond plat, en métal ou en céramique, placé au-dessus d'une source de chaleur et rempli d'eau chaude dans lequel on plonge des récipients pour en faire cuire ou réchauffer le contenu. Il est généralement couvert et muni ou non d'éléments de préhension.
status: 1

bain-marie à tripes
type: SimpleNonPreferredTerm
modified: 2014-12-08T12:09:43+01:00
created: 2014-01-15T14:54:24+01:00
status: 1

bain-marie
type: PreferredTerm
modified: 2014-12-08T12:09:43+01:00
created: 2014-01-15T14:54:24+01:00
status: 1

banc de choeur
type: Concept
modified: 2015-03-09T11:01:48+01:00
in scheme: Thésaurus de la désignation des objets mobiliers
preferred label: banco del coro @it
preferred label: choir benches @en-us
preferred label: banco de coro @pt
broader: siège et agenouilloir d'église du culte catholique
alternative label: banc de chœur
created: 2012-05-16T00:00:00+02:00
status: 1

banc de chœur
type: SimpleNonPreferredTerm
modified: 2015-03-09T11:01:48+01:00
created: 2014-01-15T14:54:24+01:00
status: 1

machine à égaliser
type: Concept
modified: 2015-09-25T15:07:05+02:00
in scheme: Thésaurus de la désignation des objets mobiliers
broader: machine à corriger
alternative label: éclisseuse
alternative label: pareuse
alternative label: tapoteuse
alternative label: machine à dérayer
created: 2012-05-16T00:00:00+02:00
definition: Machine à corriger les défauts liés à l'épaisseur d'un produit (fil, cuir, produit alimentaire, bois, etc).
status: 1

machine à égaliser
type: PreferredTerm
modified: 2015-09-25T15:07:05+02:00
created: 2014-01-15T14:54:24+01:00
status: 1

pareuse
type: SimpleNonPreferredTerm
modified: 2015-09-25T15:07:05+02:00
created: 2014-01-15T14:54:24+01:00
status: 1

tapoteuse
type: SimpleNonPreferredTerm
modified: 2015-09-25T15:07:05+02:00
created: 2014-01-15T14:54:24+01:00
status: 1

machine à corriger
type: Concept
modified: 2014-01-10T00:00:00+01:00
in scheme: Thésaurus de la désignation des objets mobiliers
narrower: machine à égaliser
narrower: machine à dégauchir
narrower: machine à planer
narrower: machine à rectifier
broader: machine à conformer
created: 2012-05-16T00:00:00+02:00
definition: Machine à modifier l'état d'un matériau ou d'un produit pour en corriger les défauts de forme ou de fonctionnement.
status: 1

éclisseuse
type: SimpleNonPreferredTerm
modified: 2015-09-25T15:07:05+02:00
created: 2014-01-15T14:54:24+01:00
status: 1

machine à dérayer
type: SimpleNonPreferredTerm
modified: 2015-09-25T15:07:05+02:00
created: 2014-01-15T14:54:24+01:00
status: 1

palette à saignée
type: Concept
modified: 2014-01-10T00:00:00+01:00
in scheme: Thésaurus de la désignation des objets mobiliers
broader: instrument ou matériel médical
alternative label: écuelle à saignée
alternative label: bol à saignée
created: 2012-05-16T00:00:00+02:00
status: 1

instrument ou matériel médical
type: Concept
modified: 2013-12-10T00:00:00+01:00
in scheme: Thésaurus de la désignation des objets mobiliers
narrower: palette à saignée
narrower: irrigateur
narrower: T69-9546
narrower: T69-9545
narrower: T69-4332
narrower: T69-4334
narrower: T69-4338
narrower: T69-4309
broader: matériel médical
alternative label: spiromètre
alternative label: canule
alternative label: vaccinostyle
alternative label: stéthoscope
alternative label: tensiomètre
alternative label: laryngoscope
created: 2012-05-16T00:00:00+02:00
status: 1

palette à saignée
type: PreferredTerm
modified: 2014-01-10T00:00:00+01:00
created: 2014-01-15T14:54:24+01:00
status: 1

écuelle à saignée
type: SimpleNonPreferredTerm
modified: 2014-01-10T00:00:00+01:00
created: 2014-01-15T14:54:24+01:00
status: 1

bol à saignée
type: SimpleNonPreferredTerm
modified: 2014-01-10T00:00:00+01:00
created: 2014-01-15T14:54:24+01:00
status: 1

aiguière pour le lavement des pieds
type: Concept
modified: 2014-12-01T11:09:34+01:00
in scheme: Thésaurus de la désignation des objets mobiliers
preferred label: brocca per la lavanda di piedi @it
preferred label: ewers for the washing of the feet @en-us
preferred label: jarro de lava-pés @pt
broader: objet lié aux temps de Noël et de Carême
created: 2012-05-16T00:00:00+02:00
related: objet lié à l'ablution, à l'aspersion et à l'encensement
related: aiguière
definition: Récipient en forme d'aiguière, de grandes dimensions, utilisé spécifiquement pour la cérémonie du lavement des pieds le Jeudi saint, avec un bassin pour le lavement des pieds.
TermeAssocie: objet lié à l'ablution, à l'aspersion et à l'encensement
TermeAssocie: aiguière
status: 1

aiguière pour le lavement des pieds
type: PreferredTerm
modified: 2014-12-01T11:09:34+01:00
created: 2014-01-15T14:54:24+01:00
status: 1

aiguière
type: Concept
modified: 2014-12-08T12:59:59+01:00
in scheme: Thésaurus de la désignation des objets mobiliers
preferred label: ewers (vessels) @en-us
broader: récipient pour le service et la consommation des boissons
alternative label: buire
alternative label: aiguière en casque
created: 2012-05-16T00:00:00+02:00
related: aquamanile
related: bassin de table
related: aiguière pour le lavement des pieds
related: aiguière de baptême
related: aiguière de communion
related: aiguière et bassin de la Pâque
related: T69-2032
related: T69-1360
definition: Récipient verseur, non couvert, à bec et anse latérale, généralement sur un pied élevé, utilisé pour le service de l'eau et du vin sur la table et/ou pour le lavage des mains avant et après le repas.
TermeAssocie: aquamanile
TermeAssocie: bassin de table
TermeAssocie: aiguière pour le lavement des pieds
TermeAssocie: aiguière de baptême
TermeAssocie: aiguière de communion
TermeAssocie: aiguière et bassin de la Pâque
TermeAssocie: T69-2032
TermeAssocie: T69-1360
status: 1

machine à fraiser
type: Concept
modified: 2015-10-14T14:22:08+02:00
in scheme: Thésaurus de la désignation des objets mobiliers
broader: machine à usiner par outil de coupe
alternative label: fraiseuse
alternative label: fraiseuse universelle
alternative label: fraiseuse verticale
alternative label: fraiseuse horizontale
created: 2012-05-16T00:00:00+02:00
definition: Machine à usiner par outil de coupe à denture droite ou hélicoïdale tournant à grande vitesse, pour façonner des pièces prismatiques.
status: 1
narrow match: http://data.bnf.fr/ark:/12148/cb11973028d
narrow match: Fraiseuse

fraiseuse
type: SimpleNonPreferredTerm
modified: 2015-10-14T14:22:08+02:00
created: 2014-01-15T14:54:24+01:00
status: 1

fraiseuse verticale
type: SimpleNonPreferredTerm
modified: 2015-10-14T14:22:08+02:00
created: 2014-01-15T14:54:24+01:00
status: 1

machine à fraiser
type: PreferredTerm
modified: 2015-10-14T14:22:08+02:00
created: 2014-01-15T14:54:24+01:00
status: 1

fraiseuse horizontale
type: SimpleNonPreferredTerm
modified: 2015-10-14T14:22:08+02:00
created: 2014-01-15T14:54:24+01:00
status: 1

fraiseuse universelle
type: SimpleNonPreferredTerm
modified: 2015-10-14T14:22:08+02:00
created: 2014-01-15T14:54:24+01:00
status: 1

panneau de confrérie
type: SimpleNonPreferredTerm
modified: 2014-12-01T15:25:58+01:00
created: 2014-01-15T14:54:24+01:00
status: 1

panneau de congrégation
type: SimpleNonPreferredTerm
modified: 2014-12-01T15:25:58+01:00
created: 2014-01-15T14:54:24+01:00
status: 1

tableau de fabrique
type: SimpleNonPreferredTerm
modified: 2014-12-01T15:25:58+01:00
created: 2014-01-15T14:54:24+01:00
status: 1

panneau de fabrique
type: SimpleNonPreferredTerm
modified: 2014-12-01T15:25:58+01:00
created: 2014-01-15T14:54:24+01:00
status: 1

tableau de congrégation
type: SimpleNonPreferredTerm
modified: 2014-12-01T15:25:58+01:00
created: 2014-01-15T14:54:24+01:00
status: 1

tableau de confrérie, de congrégation ou de fabrique
type: PreferredTerm
modified: 2014-12-01T15:25:58+01:00
created: 2014-01-15T14:54:24+01:00
status: 1

cuve industrielle
type: Concept
modified: 2015-10-01T15:06:11+02:00
in scheme: Thésaurus de la désignation des objets mobiliers
broader: outillage et accessoires liés à la production industrielle
created: 2013-12-05T00:00:00+01:00
definition: Récipient généralement cylindrique en métal, en ciment ou en bois utilisé pour le stockage, la macération, la décantation etc. de divers produits (mélasse, liqueur, eau etc.) entrant dans un processus de fabrication industrielle.
status: 1

modèle industriel
type: Concept
modified: 2015-10-01T15:32:28+02:00
in scheme: Thésaurus de la désignation des objets mobiliers
broader: outillage et accessoires liés à la production industrielle
created: 2012-05-16T00:00:00+02:00
definition: Objet, appareil ou machine servant de modèle d'exécution ou de référence à une fabrication industrielle en série.
status: 1

outillage et accessoires liés à la production industrielle
type: PreferredTerm
modified: 2015-10-16T13:04:23+02:00
created: 2014-01-15T14:54:24+01:00
status: 1

prototype industriel
type: Concept
modified: 2015-10-16T13:10:31+02:00
in scheme: Thésaurus de la désignation des objets mobiliers
broader: outillage et accessoires liés à la production industrielle
created: 2013-09-30T00:00:00+02:00
definition: Premier exemplaire d'un objet, d'un appareil ou d'une machine, conçu pour expérimentation, avant d'en entreprendre la fabrication en série.
status: 1

boîte à lettres
type: Concept
modified: 2014-12-04T15:50:21+01:00
in scheme: Thésaurus de la désignation des objets mobiliers
preferred label: mailboxes @en-us
broader: boîte
created: 2012-05-16T00:00:00+02:00
related: boîte aux lettres publique
definition: Petite caisse fermée à clef, mobile ou d'applique, comportant une fente permettant de glisser le courrier. Ce meuble, lorsqu'il est réservé au courrier en partance, peut être beaucoup plus soigné puisqu'il est utilisé à l'intérieur.
TermeAssocie: boîte aux lettres publique
status: 1

boîte aux lettres publique
type: Concept
modified: 2015-02-24T11:10:38+01:00
in scheme: Thésaurus de la désignation des objets mobiliers
broader: édicule ou mobilier de l'espace public ou du génie civil
created: 2012-05-16T00:00:00+02:00
related: boîte à lettres
definition: Boîte fixée à un mur ou sur un pied, servant à collecter le courrier dans un édifice ou un lieu public.
TermeAssocie: boîte à lettres
status: 1

boîte à lettres
type: PreferredTerm
modified: 2014-12-04T15:50:21+01:00
created: 2014-01-15T14:54:24+01:00
status: 1

autel orthodoxe
type: PreferredTerm
modified: 2014-01-10T00:00:00+01:00
created: 2014-01-15T14:54:24+01:00
status: 1

coffret pour les réserves aux saintes huiles
type: Concept
modified: 2014-11-26T12:33:43+01:00
in scheme: Thésaurus de la désignation des objets mobiliers
preferred label: holy oil stocks cases @en-us
preferred label: custodia per la riserva degli oli santi @it
preferred label: cofre das reservas dos Santos Oleos @pt
broader: boîte et coffret pour le rangement des objets liturgiques
alternative label: boîte pour les réserves aux saintes huiles
created: 2012-05-16T00:00:00+02:00
related: réserves aux saintes huiles
definition: Boîte contenant les réserves aux saintes huiles.
TermeAssocie: réserves aux saintes huiles
status: 1
broad match: http://vocab.getty.edu/aat/300194500

urnes chrismales
type: SimpleNonPreferredTerm
modified: 2014-12-01T10:50:11+01:00
created: 2014-01-15T14:54:24+01:00
status: 1

réserve à huile des malades
type: Concept
modified: 2014-12-01T10:54:13+01:00
in scheme: Thésaurus de la désignation des objets mobiliers
preferred label: stocks for the oil of the sick @en-us
preferred label: vaso per l'olio degli infirmi @it
preferred label: reserva do Oleo dos Enfermos @pt
broader: réserves aux saintes huiles
alternative label: réserve à huile des infirmes
created: 2012-05-16T00:00:00+02:00
definition: Grand récipient destiné à conserver l'huile des malades utilisée lors de l'extrême-onction et de la bénédiction des cloches. Il porte l'inscription oleum infirmorum (o.i.).
status: 1
broad match: http://vocab.getty.edu/aat/300194500
broad match: http://data.bnf.fr/ark:/12148/cb119805497
broad match: Objets du culte catholique

réserve à huile des catéchumènes
type: Concept
modified: 2014-12-01T10:51:45+01:00
in scheme: Thésaurus de la désignation des objets mobiliers
preferred label: oil stocks for the oil of the catechumens @en-us
preferred label: vaso per l'olio dei catecumeni @it
preferred label: reserva do Oleo dos Catecúmenos @pt
broader: réserves aux saintes huiles
alternative label: réserve à huile sainte
created: 2012-05-16T00:00:00+02:00
definition: Grand récipient destiné à conserver l'huile utilisée pour le baptême, l'ordination sacerdotale et la consécration des églises et des autels. La réserve à huile des catéchumènes porte l'inscription oleum catechumenorum (o.c.) ou oleum sanctum (o.s.)
status: 1
broad match: http://vocab.getty.edu/aat/300194500
broad match: http://data.bnf.fr/ark:/12148/cb119805497
broad match: Objets du culte catholique

réserves aux saintes huiles
type: PreferredTerm
modified: 2014-12-01T10:50:11+01:00
created: 2014-01-15T14:54:24+01:00
status: 1

vases aux saintes huiles
type: SimpleNonPreferredTerm
modified: 2014-12-01T10:50:11+01:00
created: 2014-01-15T14:54:24+01:00
status: 1

réserve à saint chrême
type: Concept
modified: 2014-12-01T10:55:48+01:00
in scheme: Thésaurus de la désignation des objets mobiliers
preferred label: chrism stocks @en-us
preferred label: vaso per il Crisma @it
preferred label: reserva do Crisma @pt
broader: réserves aux saintes huiles
created: 2012-05-16T00:00:00+02:00
definition: Grand récipient destiné à conserver le saint chrême composé de baume et d'huile utilisé pour le baptême, la confirmation, la consécration des églises, des autels, l'ordination des prêtres et le sacre des évêques. La réserve à saint chrême porte l'inscription sanctum chrisma ou (s.c.).
status: 1
broad match: http://vocab.getty.edu/aat/300194500
broad match: http://data.bnf.fr/ark:/12148/cb11952484b

idiophone à émission par pincement
type: PreferredTerm
modified: 2014-10-10T14:30:58+02:00
created: 2014-01-15T14:54:24+01:00
status: 1

lamellophone
type: SimpleNonPreferredTerm
modified: 2014-10-10T14:30:58+02:00
created: 2014-01-15T14:54:24+01:00
status: 1

idiophone
type: Concept
modified: 2014-10-10T13:12:42+02:00
in scheme: Thésaurus de la désignation des objets mobiliers
preferred label: idiophones @en-us
narrower: idiophone à émission par percussion directe
narrower: idiophone à émission par pincement
narrower: idiophone à émission par raclement
narrower: idiophone à émission par percussion indirecte (secouement ou raclement)
narrower: T69-4987
broader: instrument de musique
created: 2012-05-16T00:00:00+02:00
definition: Instrument qui produit un son par lui-même, que ce soit par friction, pincement, percussion ou secouement.
status: 1

boîte à musique
type: Concept
modified: 2014-12-15T12:51:34+01:00
in scheme: Thésaurus de la désignation des objets mobiliers
preferred label: music boxes @en-us
broader: idiophone à émission par pincement
created: 2012-05-16T00:00:00+02:00
definition: Instrument de musique mécanique formé d'un ensemble de lames vibrantes de taille croissante cachées au sein d'un objet plus ou moins précieux.
status: 1

castelet
type: PreferredTerm
modified: 2014-01-10T00:00:00+01:00
created: 2014-01-15T14:54:24+01:00
status: 1

daguerréotype
type: PreferredTerm
modified: 2014-12-03T15:45:27+01:00
created: 2014-01-15T14:54:24+01:00
status: 1

médaillon
type: SimpleNonPreferredTerm
modified: 2014-12-30T12:36:25+01:00
created: 2014-01-15T14:54:24+01:00
status: 1

médaille
type: PreferredTerm
modified: 2014-12-30T12:36:25+01:00
created: 2014-01-15T14:54:24+01:00
status: 1

fume-cigare ou cigarette
type: Concept
modified: 2014-12-10T15:34:00+01:00
in scheme: Thésaurus de la désignation des objets mobiliers
preferred label: cigar or cigarette holders (personal equipment) @en-us
broader: objet pour fumer et priser
created: 2012-05-16T00:00:00+02:00
definition: Tuyau à l'extrémité adaptée aux dimensions du cigare ou de la cigarette que l'on y fixe pour le ou la fumer.
status: 1
broad match: cb12009647x

objet pour fumer et priser
type: Concept
modified: 2014-10-17T12:37:17+02:00
in scheme: Thésaurus de la désignation des objets mobiliers
preferred label: equipment for personal use : smoking and tobacco use @en-us
narrower: fume-cigare ou cigarette
narrower: étui à pipe
narrower: pyrogène
narrower: étui à cigares ou cigarettes
narrower: T69-4657
narrower: T69-4655
narrower: T69-4691
narrower: T69-4711
narrower: T69-4693
narrower: T69-4703
narrower: T69-4697
narrower: T69-4695
narrower: T69-4653
broader: objet civil domestique
alternative label: pelle de fumeur
alternative label: pince à amadou
alternative label: nécessaire à amadou
alternative label: réchaud à pipes
alternative label: chaufferette à pipes
alternative label: râtelier à pipes
alternative label: pincette à braises
alternative label: mortier à tabac à priser
alternative label: pincette de fumeur
alternative label: coupe-cigare
alternative label: porte-boîte d'allumettes
alternative label: étui à briquet
alternative label: chauffe-pipes
alternative label: étui à boîte d'allumettes
alternative label: hachoir à tabac
alternative label: porte-pipes pyrogène
alternative label: cure-pipe
alternative label: porte-pipes
alternative label: coupe-chique
alternative label: couteau de fumeur
created: 2012-05-16T00:00:00+02:00
definition: Objet lié à la préparation, à la consommation ou à la conservation du tabac.
status: 1

fume-cigare ou cigarette
type: PreferredTerm
modified: 2014-12-10T15:34:00+01:00
created: 2014-01-15T14:54:24+01:00
status: 1

carte du ciel
type: SimpleNonPreferredTerm
modified: 2014-12-03T15:02:01+01:00
created: 2014-01-15T14:54:24+01:00
status: 1

objet de représentation de corps célestes
type: Concept
modified: 2014-12-15T16:20:50+01:00
in scheme: Thésaurus de la désignation des objets mobiliers
narrower: globe terrestre
narrower: sphère armillaire
narrower: T69-5388
broader: objet de représentation scientifique et pédagogique
alternative label: planétaire
alternative label: loxocosme
alternative label: tellurium
created: 2012-05-16T00:00:00+02:00
scope note: Objet de représentation plane ou volumique d'un ou de plusieurs corps célestes, pouvant faire apparaître la notion de système.
related: carte
TermeAssocie: carte
status: 1
narrow match: Planétaire
broad match: http://vocab.getty.edu/aat/300047753
broad match: http://data.bnf.fr/ark:/12148/cb11931645b

cadastre
type: SimpleNonPreferredTerm
modified: 2014-12-03T15:02:01+01:00
created: 2014-01-15T14:54:24+01:00
status: 1

carte géologique
type: SimpleNonPreferredTerm
modified: 2014-12-03T15:02:01+01:00
created: 2014-01-15T14:54:24+01:00
status: 1

carte marine
type: SimpleNonPreferredTerm
modified: 2014-12-03T15:02:01+01:00
created: 2014-01-15T14:54:24+01:00
status: 1

carte politique
type: SimpleNonPreferredTerm
modified: 2014-12-03T15:02:01+01:00
created: 2014-01-15T14:54:24+01:00
status: 1

carte
type: PreferredTerm
modified: 2014-12-03T15:02:01+01:00
created: 2014-01-15T14:54:24+01:00
status: 1

portulan
type: SimpleNonPreferredTerm
modified: 2014-12-03T15:02:01+01:00
created: 2014-01-15T14:54:24+01:00
status: 1

carte topographique
type: SimpleNonPreferredTerm
modified: 2014-12-03T15:02:01+01:00
created: 2014-01-15T14:54:24+01:00
status: 1

plan cadastral
type: SimpleNonPreferredTerm
modified: 2014-12-03T15:02:01+01:00
created: 2014-01-15T14:54:24+01:00
status: 1

planisphère
type: SimpleNonPreferredTerm
modified: 2014-12-03T15:02:01+01:00
created: 2014-01-15T14:54:24+01:00
status: 1

olifant
type: Concept
modified: 2014-12-15T11:08:58+01:00
in scheme: Thésaurus de la désignation des objets mobiliers
preferred label: oliphants @en-us
preferred label: olifante @it
broader: corne d'appel
created: 2012-05-16T00:00:00+02:00
definition: Instrument particulièrement rare, constitué par une défense d'éléphant évidée, souvent décorée de motifs en relief et comportant une monture en métal précieux.
status: 1

corne d'appel
type: Concept
modified: 2014-12-15T11:07:16+01:00
in scheme: Thésaurus de la désignation des objets mobiliers
preferred label: calling horns @en-us
preferred label: corno da richiamo @it
narrower: olifant
narrower: corne d'appel judaïque
broader: trompette naturelle
alternative label: trompe de chasse
created: 2012-05-16T00:00:00+02:00
definition: Instrument dit naturel, en bois ou en corne parfois droit, parfois coudé. Il sert surtout à l'appel et à la communication à longue distance.
status: 1

olifant
type: PreferredTerm
modified: 2014-12-15T11:08:58+01:00
created: 2014-01-15T14:54:24+01:00
status: 1

objet lié à Rosh ha-Shanah
type: Concept
modified: 2014-01-10T00:00:00+01:00
in scheme: Thésaurus de la désignation des objets mobiliers
broader: objet lié au culte synagogal
created: 2012-05-16T00:00:00+02:00
status: 1

objet lié au culte synagogal
type: Concept
modified: 2014-01-10T00:00:00+01:00
in scheme: Thésaurus de la désignation des objets mobiliers
narrower: objet lié à la Torah
narrower: objet lié à Rosh ha-Shanah
narrower: T69-1902
broader: objet de la religion juive
created: 2012-05-16T00:00:00+02:00
status: 1

objet lié à Rosh ha-Shanah
type: PreferredTerm
modified: 2014-01-10T00:00:00+01:00
created: 2014-01-15T14:54:24+01:00
status: 1

table avec porte-pain
type: SimpleNonPreferredTerm
modified: 2014-12-05T13:33:57+01:00
created: 2014-01-15T14:54:24+01:00
status: 1

table à déjeuner
type: PreferredTerm
modified: 2014-12-05T13:33:57+01:00
created: 2014-01-15T14:54:24+01:00
status: 1

locomotive articulée
type: Concept
modified: 2014-10-14T16:19:11+02:00
in scheme: Thésaurus de la désignation des objets mobiliers
preferred label: articulated locomotives @en-us
broader: locomotive
created: 2013-11-04T00:00:00+01:00
definition: Véhicule à moteur à vapeur ou électrique dont le châssis est formé de deux éléments accouplés en permanence afin de pouvoir franchir les courbes prononcées. On les rencontre dans les chemins de fer montagnards.
status: 1
broad match: http://vocab.getty.edu/aat/300113388

locomotive
type: PreferredTerm
modified: 2014-12-18T10:14:54+01:00
created: 2014-01-15T14:54:24+01:00
status: 1

locomotive électrique
type: Concept
modified: 2014-12-18T10:11:44+01:00
in scheme: Thésaurus de la désignation des objets mobiliers
preferred label: electric locomotives @en-us
broader: locomotive
alternative label: locomotive électrique de ligne
alternative label: locomotive électrique de manœuvre
created: 2013-11-04T00:00:00+01:00
definition: Véhicule à moteur électrique qui, selon la vitesse autorisée, est destiné au trafic de ligne ou aux manœuvres de gare et de triage.
status: 1

locomotive thermique
type: Concept
modified: 2014-12-18T10:13:39+01:00
in scheme: Thésaurus de la désignation des objets mobiliers
preferred label: internal combustion engine locomotives @en-us
broader: locomotive
alternative label: locomoteur
alternative label: locotracteur
alternative label: locomotive diesel-électrique
alternative label: locomotive diesel de ligne
created: 2013-11-04T00:00:00+01:00
definition: Véhicule à moteur diesel ou à essence qui, selon la vitesse autorisée, est destiné au trafic de ligne ou aux manœuvres de gare et de triage (locomoteur ou locotracteur selon la puissance motrice).
status: 1

locomotive à vapeur
type: Concept
modified: 2014-12-18T10:09:52+01:00
in scheme: Thésaurus de la désignation des objets mobiliers
preferred label: steam locomotives @en-us
narrower: locomotive-tender
narrower: locomotive à vapeur à tender séparé
broader: locomotive
created: 2013-11-04T00:00:00+01:00
definition: Véhicule ferroviaire propulsé par un moteur à vapeur.
status: 1

châssis de tympan
type: Concept
modified: 2014-12-09T16:07:23+01:00
in scheme: Thésaurus de la désignation des objets mobiliers
preferred label: transom windows @en-us
broader: dormant
created: 2012-05-16T00:00:00+02:00
definition: Châssis vitré, fixe ou mobile, fermant la partie haute de la baie, au-dessus d'une traverse dormante sur laquelle s'arrêtent les montants dormants.
status: 1
broad match: cb13188314v

dormant
type: Concept
modified: 2014-10-15T13:13:44+02:00
in scheme: Thésaurus de la désignation des objets mobiliers
preferred label: frames @en-us
narrower: châssis de tympan
broader: fermeture de baie
alternative label: huisserie
created: 2012-05-16T00:00:00+02:00
definition: Ensemble des éléments et des parties fixes en menuiserie ou serrurerie, rapportés dans l'embrasure d'une baie pour porter les parties mobiles de la fermeture.
status: 1
broad match: http://data.bnf.fr/ark:/12148/cb125704047

châssis de tympan
type: PreferredTerm
modified: 2014-12-09T16:07:23+01:00
created: 2014-01-15T14:54:24+01:00
status: 1

porte de tabernacle
type: PreferredTerm
modified: 2014-12-01T16:56:05+01:00
created: 2014-01-15T14:54:24+01:00
status: 1

plumier
type: Concept
modified: 2014-12-10T15:20:58+01:00
in scheme: Thésaurus de la désignation des objets mobiliers
preferred label: pencil boxes @en-us
broader: objet pour écrire ou de bureau
alternative label: boîte à plumes
created: 2012-05-16T00:00:00+02:00
definition: Boîte allongée et plate couverte ou non et compartimentée, servant à ranger les plumes, les porte-plume, les crayons, les porte-mine, etc.
status: 1
broad match: http://data.bnf.fr/ark:/12148/cb119363838

plumier
type: PreferredTerm
modified: 2014-12-10T15:20:58+01:00
created: 2014-01-15T14:54:24+01:00
status: 1

boîte à plumes
type: SimpleNonPreferredTerm
modified: 2014-12-10T15:20:58+01:00
created: 2014-01-15T14:54:24+01:00
status: 1

objet lié aux temps de Noël et de Carême
type: PreferredTerm
modified: 2014-12-01T11:08:35+01:00
created: 2014-01-15T14:54:24+01:00
status: 1

style liturgique
type: Concept
modified: 2014-12-01T11:23:47+01:00
in scheme: Thésaurus de la désignation des objets mobiliers
preferred label: liturgical styluses @en-us
preferred label: stilo liturgico @it
preferred label: estilete litúrgico @pt
broader: objet lié aux temps de Noël et de Carême
created: 2012-05-16T00:00:00+02:00
definition: Instrument servant à graver dans la cire du cierge pascal une croix, l'alpha et l'oméga ainsi que la date de l'année pascale. Il est généralement en métal, en forme de stylet et peut porter un décor à motifs religieux.
status: 1
broad match: http://data.bnf.fr/ark:/12148/cb119669330

table de bibliothèque
type: Concept
modified: 2014-12-05T14:02:26+01:00
in scheme: Thésaurus de la désignation des objets mobiliers
preferred label: library tables (writing tables) @en-us
broader: table pour le bureau ou les loisirs
created: 2012-05-16T00:00:00+02:00
definition: Table généralement de grandes dimensions, qui permet à plusieurs personnes de consulter des livres simultanément.
status: 1

table de bibliothèque
type: PreferredTerm
modified: 2014-12-05T14:02:26+01:00
created: 2014-01-15T14:54:24+01:00
status: 1

siège pliant
type: SimpleNonPreferredTerm
modified: 2014-10-14T12:13:47+02:00
created: 2014-01-15T14:54:24+01:00
status: 1

siège à plusieurs places
type: Concept
modified: 2014-10-14T12:14:22+02:00
in scheme: Thésaurus de la désignation des objets mobiliers
preferred label: multiple-seating furniture @en-us
narrower: T69-45
narrower: T69-2667
narrower: T69-2669
broader: siège
created: 2012-05-16T00:00:00+02:00
definition: Meuble de repos servant à asseoir plusieurs personnes.
status: 1
broad match: http://data.bnf.fr/ark:/12148/cb131627639
broad match: Siège (meuble)

siège
type: PreferredTerm
modified: 2014-10-14T12:13:47+02:00
created: 2014-01-15T14:54:24+01:00
status: 1

clôture d'autel
type: PreferredTerm
modified: 2014-12-01T14:28:55+01:00
created: 2014-01-15T14:54:24+01:00
status: 1

rabat
type: Concept
modified: 2014-12-03T11:48:33+01:00
in scheme: Thésaurus de la désignation des objets mobiliers
preferred label: facciola ecclesiastica @it
preferred label: rabats @en-us
preferred label: colarinho voltado @pt
broader: accessoire du costume liturgique des clercs
created: 2012-05-16T00:00:00+02:00
related: soutane
related: collet de confrérie
definition: Pièce d'étoffe empesée cachant l'échancrure du col d'une soutane.
TermeAssocie: soutane
TermeAssocie: collet de confrérie
status: 1
broad match: http://vocab.getty.edu/aat/300210450
broad match: cb11941484w
broad match: Costume ecclésiastique

rabat
type: PreferredTerm
modified: 2014-12-03T11:48:33+01:00
created: 2014-01-15T14:54:24+01:00
status: 1

collet de confrérie
type: Concept
modified: 2014-12-03T12:32:05+01:00
in scheme: Thésaurus de la désignation des objets mobiliers
preferred label: confraternity collars @en-us
preferred label: colletto di veste di confraternita @it
preferred label: cabeção de confraria @pt
broader: autre vêtement catholique
created: 2012-05-16T00:00:00+02:00
related: rabat
definition: Col blanc amovible à rabat, que portent certains membres d'une confrérie de charité sur une soutanelle ou une dalmatique.
TermeAssocie: rabat
status: 1

bateau de charge maritime
type: Concept
modified: 2014-12-18T11:59:03+01:00
in scheme: Thésaurus de la désignation des objets mobiliers
narrower: porte-conteneurs
narrower: bateau citerne
narrower: bateau frigorifique
narrower: vraquier
broader: bateau de commerce pour marchandises
alternative label: voilier de commerce
alternative label: cargo polyvalent
alternative label: caboteur
alternative label: bateau de commerce à voiles
alternative label: bateau de marchandises conditionnées
alternative label: cargo
created: 2013-09-18T00:00:00+02:00
definition: Bâtiment de mer destiné au transport des marchandises.
status: 1

porte-conteneurs
type: Concept
modified: 2014-10-16T09:30:18+02:00
in scheme: Thésaurus de la désignation des objets mobiliers
preferred label: container ships @en-us
broader: bateau de charge maritime
alternative label: bateau de marchandises unitisées
alternative label: bateau de marchandises en conteneur
created: 2013-09-18T00:00:00+02:00
definition: Bateau de charge aménagé pour le transport de marchandises conditionnées dans des caissons métalliques aux dimensions normalisées à l'échelle internationale (équivalent vingt pieds).
status: 1

bateau de charge maritime
type: PreferredTerm
modified: 2014-12-18T11:59:03+01:00
created: 2014-01-15T14:54:24+01:00
status: 1

cargo polyvalent
type: SimpleNonPreferredTerm
modified: 2014-12-18T11:59:03+01:00
created: 2014-01-15T14:54:24+01:00
status: 1

bateau de marchandises conditionnées
type: SimpleNonPreferredTerm
modified: 2014-12-18T11:59:03+01:00
created: 2014-01-15T14:54:24+01:00
status: 1

bateau citerne
type: Concept
modified: 2014-12-18T11:50:01+01:00
in scheme: Thésaurus de la désignation des objets mobiliers
preferred label: tankers (cargo vessels) @en-us
broader: bateau de charge maritime
alternative label: méthanier
alternative label: pinardier
alternative label: chimiquier
alternative label: pétrolier
created: 2012-05-16T00:00:00+02:00
definition: Bateau de charge conçu pour le transport des marchandises liquides en vrac.
status: 1

voilier de commerce
type: SimpleNonPreferredTerm
modified: 2014-12-18T11:59:03+01:00
created: 2014-01-15T14:54:24+01:00
status: 1

caboteur
type: SimpleNonPreferredTerm
modified: 2014-12-18T11:59:03+01:00
created: 2014-01-15T14:54:24+01:00
status: 1

bateau de commerce à voiles
type: SimpleNonPreferredTerm
modified: 2014-12-18T11:59:03+01:00
created: 2014-01-15T14:54:24+01:00
status: 1

cargo
type: SimpleNonPreferredTerm
modified: 2014-12-18T11:59:03+01:00
created: 2014-01-15T14:54:24+01:00
status: 1

bateau frigorifique
type: Concept
modified: 2014-12-18T11:53:14+01:00
in scheme: Thésaurus de la désignation des objets mobiliers
preferred label: reefer boats @en-us
broader: bateau de charge maritime
alternative label: bateau de marchandises périssables
alternative label: bateau à température contrôlée
alternative label: bateau à atmosphère modifiée
alternative label: bananier
created: 2013-09-18T00:00:00+02:00
definition: Bateau de charge spécialement aménagé de chambres thermiques pour le transport des denrées périssables.
status: 1
broad match: http://vocab.getty.edu/aat/300212694

vraquier
type: Concept
modified: 2014-12-18T11:56:40+01:00
in scheme: Thésaurus de la désignation des objets mobiliers
preferred label: bulk carriers @en-us
broader: bateau de charge maritime
alternative label: charbonnier
alternative label: bateau de marchandises en vrac
created: 2013-09-18T00:00:00+02:00
definition: Bateau de charge aménagé pour le transport en vrac de marchandises (céréales, engrais, minerais, etc.).
status: 1

sainte lance
type: Concept
modified: 2014-01-10T00:00:00+01:00
in scheme: Thésaurus de la désignation des objets mobiliers
broader: objet du culte orthodoxe
created: 2012-05-16T00:00:00+02:00
definition: Couteau en forme de lance, servant à découper le pain (levé), non consacré, nécessaire à la communion.
status: 1

sainte lance
type: PreferredTerm
modified: 2014-01-10T00:00:00+01:00
created: 2014-01-15T14:54:24+01:00
status: 1

boîte à musique
type: PreferredTerm
modified: 2014-12-15T12:51:34+01:00
created: 2014-01-15T14:54:24+01:00
status: 1

modèle industriel
type: PreferredTerm
modified: 2015-10-01T15:32:28+02:00
created: 2014-01-15T14:54:24+01:00
status: 1

machine à modifier la siccité
type: PreferredTerm
modified: 2014-01-10T00:00:00+01:00
created: 2014-01-15T14:54:24+01:00
status: 1

matériel agricole, professionnel et artisanal
type: PreferredTerm
modified: 2014-01-10T00:00:00+01:00
created: 2014-01-15T14:54:24+01:00
status: 1

meuble ou aménagement professionnel
type: Concept
modified: 2014-01-10T00:00:00+01:00
in scheme: Thésaurus de la désignation des objets mobiliers
narrower: meuble d'imprimerie
narrower: T69-9726
narrower: T69-9725
broader: matériel agricole, professionnel et artisanal
created: 2013-12-16T00:00:00+01:00
status: 1

couronne d'ostensoir
type: Concept
modified: 2014-11-27T15:20:10+01:00
in scheme: Thésaurus de la désignation des objets mobiliers
preferred label: corona di ostensorio @it
preferred label: monstrance crowns @en-us
preferred label: coroa de ostensório @pt
broader: ostensoir
created: 2012-05-16T00:00:00+02:00
definition: Couronne amovible, en or ou en argent et souvent décorée de pierres précieuses, destinée à être posée au-dessus de la lunule ou de la croix posée au sommet d'un ostensoir.
status: 1
broad match: http://vocab.getty.edu/aat/300083005

couronne d'ostensoir
type: PreferredTerm
modified: 2014-11-27T15:20:10+01:00
created: 2014-01-15T14:54:24+01:00
status: 1

machine à dégauchir
type: Concept
modified: 2015-10-15T16:36:51+02:00
in scheme: Thésaurus de la désignation des objets mobiliers
broader: machine à corriger
alternative label: dégauchisseuse
created: 2012-05-16T00:00:00+02:00
definition: Machine à corriger, par contrainte ou enlèvement de matière, une pièce de bois ou de métal gauchie afin de la redresser.
status: 1
narrow match: Dégauchisseuse
narrow match: http://data.bnf.fr/ark:/12148/cb15546852f

dégauchisseuse
type: SimpleNonPreferredTerm
modified: 2015-10-15T16:36:51+02:00
created: 2014-01-15T14:54:24+01:00
status: 1

machine à dégauchir
type: PreferredTerm
modified: 2015-10-15T16:36:51+02:00
created: 2014-01-15T14:54:24+01:00
status: 1

banc de fidèle
type: Concept
modified: 2014-12-02T14:30:55+01:00
in scheme: Thésaurus de la désignation des objets mobiliers
preferred label: pews @en-us
preferred label: banco da chiesa @it
preferred label: banco de igreja @pt
narrower: banc de famille
narrower: banc d'oeuvre
broader: siège et agenouilloir d'église du culte catholique
alternative label: banc-coffre d'église
alternative label: banc d'église
created: 2012-05-16T00:00:00+02:00
definition: Banc pour les fidèles situé dans la nef, comportant souvent un dossier et un agenouilloir. Ces bancs peuvent être fixes et solidaires. Ils comportent alors des accès et parfois des battants latéraux.
status: 1

banc-coffre d'église
type: SimpleNonPreferredTerm
modified: 2014-12-02T14:30:55+01:00
created: 2014-01-15T14:54:24+01:00
status: 1

banc d'église
type: SimpleNonPreferredTerm
modified: 2014-12-02T14:30:55+01:00
created: 2014-01-15T14:54:24+01:00
status: 1

banc de fidèle
type: PreferredTerm
modified: 2014-12-02T14:30:55+01:00
created: 2014-01-15T14:54:24+01:00
status: 1

banc de famille
type: Concept
modified: 2014-12-02T14:35:49+01:00
in scheme: Thésaurus de la désignation des objets mobiliers
preferred label: family pews @en-us
preferred label: banco di famiglia @it
preferred label: banco de família @pt
broader: banc de fidèle
alternative label: banc seigneurial
created: 2012-05-16T00:00:00+02:00
definition: Banc ou banquette, généralement placé hors du sanctuaire d'une église, appartenant à une famille et réservé à son usage ; il en porte souvent le nom ou les armoiries.
status: 1
broad match: http://data.bnf.fr/ark:/12148/cb119855212
broad match: Pew

banc d'oeuvre
type: Concept
modified: 2015-03-09T11:02:29+01:00
in scheme: Thésaurus de la désignation des objets mobiliers
preferred label: banco d'Opera @it
preferred label: parish pews @en-us
preferred label: banco de fábrica @pt
broader: banc de fidèle
alternative label: banc de fabrique
alternative label: banc d'œuvre
created: 2012-05-16T00:00:00+02:00
status: 1
broad match: http://data.bnf.fr/ark:/12148/cb119855212
broad match: http://vocab.getty.edu/aat/300038521

Torah
type: Concept
modified: 2014-01-10T00:00:00+01:00
in scheme: Thésaurus de la désignation des objets mobiliers
broader: objet lié à la Torah
alternative label: Sefer Torah
alternative label: Pentateuque
created: 2012-05-16T00:00:00+02:00
definition: Rouleau de parchemin ou de papier, enroulé autour de deux axes parallèles en bois, reproduisant le texte du Pentateuque et conservé dans l'arche sainte.
status: 1

Torah
type: PreferredTerm
modified: 2014-01-10T00:00:00+01:00
created: 2014-01-15T14:54:24+01:00
status: 1

Sefer Torah
type: SimpleNonPreferredTerm
modified: 2014-01-10T00:00:00+01:00
created: 2014-01-15T14:54:24+01:00
status: 1

Pentateuque
type: SimpleNonPreferredTerm
modified: 2014-01-10T00:00:00+01:00
created: 2014-01-15T14:54:24+01:00
status: 1

serre-bijoux
type: Concept
modified: 2014-10-13T11:32:51+02:00
in scheme: Thésaurus de la désignation des objets mobiliers
preferred label: jewel cabinets @en-us
broader: meuble de collection spécifique
created: 2012-05-16T00:00:00+02:00
definition: Meuble de petite taille ou de très grandes dimensions, servant à déposer des bijoux et objets précieux.
status: 1

serre-bijoux
type: PreferredTerm
modified: 2014-10-13T11:32:51+02:00
created: 2014-01-15T14:54:24+01:00
status: 1

poids
type: SimpleNonPreferredTerm
modified: 2014-12-15T15:50:49+01:00
created: 2014-01-15T14:54:24+01:00
status: 1

masse marquée
type: PreferredTerm
modified: 2014-12-15T15:50:49+01:00
created: 2014-01-15T14:54:24+01:00
status: 1

balance
type: Concept
modified: 2014-01-10T00:00:00+01:00
in scheme: Thésaurus de la désignation des objets mobiliers
broader: outil servant à mesurer ou dessiner
alternative label: bascule romaine
alternative label: balance romaine
alternative label: balance Roberval
created: 2013-12-16T00:00:00+01:00
related: masse marquée
related: balance de précision
related: machine à peser
definition: Appareil qui sert à peser, soit au moyen d'un fléau mobile et de plateaux (l'un porte la chose à peser et l'autre des masses marquées), soit à l'aide d'une masse mobile par rapport à son point de suspension.
TermeAssocie: masse marquée
TermeAssocie: balance de précision
TermeAssocie: machine à peser
status: 1

pile de Charlemagne
type: SimpleNonPreferredTerm
modified: 2014-12-15T15:50:49+01:00
created: 2014-01-15T14:54:24+01:00
status: 1

boîte décorative
type: Concept
modified: 2014-12-05T15:04:25+01:00
in scheme: Thésaurus de la désignation des objets mobiliers
preferred label: decorative boxes @en-us
broader: objet décoratif ou de rangement ou pour les plantes et les fleurs
created: 2012-05-16T00:00:00+02:00
related: boîte
definition: Récipient couvert, en matériaux rigides, à fond plat, parfois compartimenté, servant à ranger un contenu du nom duquel on le désigne souvent. (boîte à jeux, à cartes, etc.).
TermeAssocie: boîte
status: 1

boîte
type: PreferredTerm
modified: 2014-12-04T15:56:11+01:00
created: 2014-01-15T14:54:24+01:00
status: 1

fonts baptismaux orthodoxes
type: PreferredTerm
modified: 2014-01-10T00:00:00+01:00
created: 2014-01-15T14:54:24+01:00
status: 1

kholymbithra
type: SimpleNonPreferredTerm
modified: 2014-01-10T00:00:00+01:00
created: 2014-01-15T14:54:24+01:00
status: 1

irrigateur
type: Concept
modified: 2014-01-10T00:00:00+01:00
in scheme: Thésaurus de la désignation des objets mobiliers
broader: instrument ou matériel médical
created: 2012-05-16T00:00:00+02:00
status: 1

irrigateur
type: PreferredTerm
modified: 2014-01-10T00:00:00+01:00
created: 2014-01-15T14:54:24+01:00
status: 1

remplage
type: PreferredTerm
modified: 2014-12-09T16:16:14+01:00
created: 2014-01-15T14:54:24+01:00
status: 1

machine à planer
type: Concept
modified: 2015-10-15T16:45:29+02:00
in scheme: Thésaurus de la désignation des objets mobiliers
broader: machine à corriger
created: 2012-05-16T00:00:00+02:00
definition: Machine à corriger, par contrainte, un matériau ou un produit gauchi (tôle, tissu, etc.) afin de l'aplanir.
status: 1

machine à rectifier
type: Concept
modified: 2015-10-15T16:48:03+02:00
in scheme: Thésaurus de la désignation des objets mobiliers
broader: machine à corriger
alternative label: rectifieuse
created: 2012-05-16T00:00:00+02:00
definition: Machine à corriger un produit par meulage afin de l'amener à des dimensions ou des formes très précises.
status: 1
narrow match: Rectifieuse

machine à conformer
type: Concept
modified: 2014-01-10T00:00:00+01:00
in scheme: Thésaurus de la désignation des objets mobiliers
narrower: machine à corriger
broader: machine à modifier l'état
alternative label: machine à recharger
alternative label: machine à restaurer
alternative label: machine à reconstituer
created: 2012-05-16T00:00:00+02:00
definition: Machine à modifier l'état d'un produit présentant des imperfections (défauts, insuffisances, excès), afin de le rendre conforme à des normes de fabrication.
status: 1

machine à corriger
type: PreferredTerm
modified: 2014-01-10T00:00:00+01:00
created: 2014-01-15T14:54:24+01:00
status: 1

machine à brocher
type: Concept
modified: 2015-10-14T14:19:29+02:00
in scheme: Thésaurus de la désignation des objets mobiliers
broader: machine à usiner par outil de coupe
alternative label: brocheuse
created: 2012-05-16T00:00:00+02:00
definition: Machine à usiner par outil de coupe rectiligne, denté et animé d'un mouvement alternatif, pour façonner les parois d'un trou.
status: 1

brocheuse
type: SimpleNonPreferredTerm
modified: 2015-10-14T14:19:29+02:00
created: 2014-01-15T14:54:24+01:00
status: 1

machine à brocher
type: PreferredTerm
modified: 2015-10-14T14:19:29+02:00
created: 2014-01-15T14:54:24+01:00
status: 1

escabeau à marches
type: Concept
modified: 2014-12-04T12:14:15+01:00
in scheme: Thésaurus de la désignation des objets mobiliers
preferred label: step stools @en-us
narrower: T69-3230
narrower: T69-3228
broader: meuble d'élévation
created: 2012-05-16T00:00:00+02:00
related: escabeau
definition: Meuble constitué d'un ensemble de marches en retrait les unes par rapport aux autres, posées sur des montants verticaux et servant à accéder à un meuble ou un objet, relativement élevé.
TermeAssocie: escabeau
status: 1
broad match: cb13162680m

escabeau
type: PreferredTerm
modified: 2014-12-05T12:26:48+01:00
created: 2014-01-15T14:54:24+01:00
status: 1

nichoir
type: PreferredTerm
modified: 2014-01-10T00:00:00+01:00
created: 2014-01-15T14:54:24+01:00
status: 1

beffroi de charpente
type: Concept
modified: 2015-01-16T16:58:35+01:00
in scheme: Thésaurus de la désignation des objets mobiliers
preferred label: bell cages @en-us
broader: divisions architecturales
created: 2014-06-02T10:56:59+02:00
definition: Construction en charpente, placée dans la chambre des cloches à l'intérieur d'un clocher et portant les cloches.
status: 1
broad match: http://data.bnf.fr/ark:/12148/cb11934126d

beffroi de charpente
type: PreferredTerm
modified: 2015-01-16T16:58:35+01:00
created: 2014-01-15T14:54:24+01:00
status: 1

pallium
type: Concept
modified: 2014-12-03T11:45:56+01:00
in scheme: Thésaurus de la désignation des objets mobiliers
preferred label: pallio @it
preferred label: palliums (vestments) @en-us
preferred label: pálio @pt
broader: accessoire du costume liturgique des clercs
alternative label: épingle de pallium
created: 2012-05-16T00:00:00+02:00
definition: Insigne porté par les plus hauts dignitaires et notamment par le pape, le pallium est une bande d'étoffe de laine blanche circulaire, portée autour du cou, d'où pendent sur la poitrine et sur le dos deux autres courtes bandes lestées et maintenues en place à leurs extrémités par deux plaques de plomb recouvertes de soie noire. Le pallium est en outre orné de six croix de même matériau et couleur, une sur chaque appendice et quatre sur la partie circulaire. L'encolure est munie de trois ganses dans lesquelles sont passées des épingles en matériaux précieux (épingle de pallium) ayant une fonction ornementale et servant à fixer le pallium à la chasuble.
status: 1

pallium
type: PreferredTerm
modified: 2014-12-03T11:45:56+01:00
created: 2014-01-15T14:54:24+01:00
status: 1

épingle de pallium
type: SimpleNonPreferredTerm
modified: 2014-12-03T11:45:56+01:00
created: 2014-01-15T14:54:24+01:00
status: 1

table
type: PreferredTerm
modified: 2014-12-05T14:09:45+01:00
created: 2014-01-15T14:54:24+01:00
status: 1

table à ouvrage
type: Concept
modified: 2014-12-05T13:24:55+01:00
in scheme: Thésaurus de la désignation des objets mobiliers
preferred label: work tables @en-us
narrower: T69-2776
narrower: T69-2780
narrower: T69-2778
broader: table
alternative label: table de fileuse
alternative label: table à ouvrage à nécessaire
alternative label: table à ouvrage en coffret
created: 2012-05-16T00:00:00+02:00
related: objet ou matériel pour les ouvrages textiles
related: T69-4728
definition: Petite table à éléments de rangement servant à contenir les objets nécessaires aux travaux de couture, broderie, tapisserie, tricot. De plan massé (carrée, rectangulaire, circulaire, etc), elle se présente sous forme de coffret ou de table à un ou plusieurs tiroirs et comporte de un à quatre pieds.
TermeAssocie: objet ou matériel pour les ouvrages textiles
TermeAssocie: T69-4728
status: 1

table pour l'hygiène ou le repos
type: Concept
modified: 2014-10-14T12:44:35+02:00
in scheme: Thésaurus de la désignation des objets mobiliers
narrower: table d'en-cas
narrower: table de nuit
narrower: T69-2759
narrower: T69-2769
broader: table
created: 2012-05-16T00:00:00+02:00
definition: Petite table, pouvant être mobile, réglable, dotée de rangements, utilisée dans les espaces intimes de la maison (chambre, boudoir, etc).
status: 1
broad match: http://vocab.getty.edu/aat/300039548

intaille
type: PreferredTerm
modified: 2014-12-03T17:15:10+01:00
created: 2014-01-15T14:54:24+01:00
status: 1

étui à pipe
type: Concept
modified: 2014-12-10T15:32:18+01:00
in scheme: Thésaurus de la désignation des objets mobiliers
preferred label: pipe holders @en-us
broader: objet pour fumer et priser
created: 2012-05-16T00:00:00+02:00
definition: Étui en matériau rigide divisé en deux moitiés assemblées à charnière, de la forme de la pipe qu'il contient.
status: 1
broad match: cb11933139h

étui à pipe
type: PreferredTerm
modified: 2014-12-10T15:32:18+01:00
created: 2014-01-15T14:54:24+01:00
status: 1

trompette naturelle
type: Concept
modified: 2014-10-10T12:12:56+02:00
in scheme: Thésaurus de la désignation des objets mobiliers
preferred label: lip-vibrated aerophones with conical bore : natural @en-us
narrower: corne d'appel
narrower: cor naturel
narrower: trompe
narrower: bugle
narrower: conque marine
broader: aérophone à bouche
created: 2012-05-16T00:00:00+02:00
definition: Instrument à vent dont le corps sonore est mis en vibration par l'envoi d'un flux d'air dans l'embouchure.
status: 1
broad match: http://vocab.getty.edu/aat/300041639

corne d'appel
type: PreferredTerm
modified: 2014-12-15T11:07:16+01:00
created: 2014-01-15T14:54:24+01:00
status: 1

corne d'appel judaïque
type: Concept
modified: 2014-10-10T12:19:38+02:00
in scheme: Thésaurus de la désignation des objets mobiliers
preferred label: shofars @en-us
broader: corne d'appel
alternative label: shofar
alternative label: corne de bélier
created: 2012-05-16T00:00:00+02:00
scope note: Elle symbolise à la fois le bélier qui fut substitué à Isaac lors du sacrifice, la corne qui a retenti sur le Mont Sinaï et celle qui retentira au rassemblement des exilés.
definition: Corne de bélier utilisée comme un cor dont l'officiant sonne durant la période de pénitence précédant le Jour de l'An, après les prières du matin et du soir, pour inciter les fidèles à l'examen de conscience et au repentir, et durant l'office du Jour de l'An pour clôturer la journée du Grand Pardon.
status: 1
broad match: cb12124805x

trompe de chasse
type: SimpleNonPreferredTerm
modified: 2014-12-15T11:07:16+01:00
created: 2014-01-15T14:54:24+01:00
status: 1

cuiller à encens
type: Concept
modified: 2014-11-27T11:24:05+01:00
in scheme: Thésaurus de la désignation des objets mobiliers
preferred label: incense spoons @en-us
preferred label: cucchiaio per incenso @it
preferred label: colher de incenso @pt
broader: objet lié à l'ablution, à l'aspersion et à l'encensement
alternative label: cuillère à encens
created: 2012-05-16T00:00:00+02:00
definition: Cuiller en métal servant à mettre l'encens de la navette à encens dans l'encensoir. La cuiller à encens peut prendre la forme d'une pelle ou d'une louche de petites dimensions. Elle est souvent attachée à la navette par une chaînette.
status: 1

cuiller à encens
type: PreferredTerm
modified: 2014-11-27T11:24:05+01:00
created: 2014-01-15T14:54:24+01:00
status: 1

cuillère à encens
type: SimpleNonPreferredTerm
modified: 2014-11-27T11:24:05+01:00
created: 2014-01-15T14:54:24+01:00
status: 1

affiche publicitaire
type: SimpleNonPreferredTerm
modified: 2014-12-03T14:58:10+01:00
created: 2014-01-15T14:54:24+01:00
status: 1

affiche
type: PreferredTerm
modified: 2014-12-03T14:58:10+01:00
created: 2014-01-15T14:54:24+01:00
status: 1

affiche judiciaire
type: SimpleNonPreferredTerm
modified: 2014-12-03T14:58:10+01:00
created: 2014-01-15T14:54:24+01:00
status: 1

affiche pédagogique
type: SimpleNonPreferredTerm
modified: 2014-12-03T14:58:10+01:00
created: 2014-01-15T14:54:24+01:00
status: 1

affiche légale
type: SimpleNonPreferredTerm
modified: 2014-12-03T14:58:10+01:00
created: 2014-01-15T14:54:24+01:00
status: 1

tenture de trône pontifical
type: PreferredTerm
modified: 2014-12-03T11:09:13+01:00
created: 2014-01-15T14:54:24+01:00
status: 1

linge ou garniture liés aux sièges
type: Concept
modified: 2014-12-03T11:04:05+01:00
in scheme: Thésaurus de la désignation des objets mobiliers
preferred label: linen and ornaments for seating @en-us
preferred label: lini e coperture per i sedili @it
preferred label: guarnições para os assentos e genuflexórios da igreja @pt
narrower: tenture de trône pontifical
narrower: tapis de trône pontifical
narrower: garniture de dais de trône pontifical
narrower: grémial
broader: linge ou garniture du culte catholique
alternative label: housse du faldistoire
alternative label: tenture de l'agenouilloir de l'évêque
alternative label: housse de faldistoire
alternative label: coussin de trône pontifical
alternative label: coussin de prie-Dieu
alternative label: coussin du prie-Dieu de l'évêque
alternative label: tapis de prie-Dieu
alternative label: coussin de faldistoire
alternative label: tenture de prie-Dieu
alternative label: tenture du faldistoire
alternative label: tenture de faldistoire
alternative label: tenture d'agenouilloir
created: 2012-05-16T00:00:00+02:00
definition: Pièce textile ou élément de garniture des sièges de dignitaires ecclésiastiques.
status: 1

tenture de la chaire épiscopale
type: SimpleNonPreferredTerm
modified: 2014-12-03T11:09:13+01:00
created: 2014-01-15T14:54:24+01:00
status: 1

pyrogène
type: Concept
modified: 2014-10-17T12:52:47+02:00
in scheme: Thésaurus de la désignation des objets mobiliers
broader: objet pour fumer et priser
created: 2012-05-16T00:00:00+02:00
definition: Petite plaque présentant une surface plane rugueuse, en métal, en céramique ou enduite d'un produit pyrogène, sur laquelle on frotte la tête de l'allumette à friction pour l'enflammer.
status: 1
broad match: http://vocab.getty.edu/aat/300236658

pyrogène
type: PreferredTerm
modified: 2014-10-17T12:52:47+02:00
created: 2014-01-15T14:54:24+01:00
status: 1

tulipière
type: SimpleNonPreferredTerm
modified: 2014-12-05T15:25:24+01:00
created: 2014-01-15T14:54:24+01:00
status: 1

caisse pique-fleurs
type: SimpleNonPreferredTerm
modified: 2014-12-05T15:25:24+01:00
created: 2014-01-15T14:54:24+01:00
status: 1

pique-fleurs
type: PreferredTerm
modified: 2014-12-05T15:25:24+01:00
created: 2014-01-15T14:54:24+01:00
status: 1

commode pique-fleurs
type: SimpleNonPreferredTerm
modified: 2014-12-05T15:25:24+01:00
created: 2014-01-15T14:54:24+01:00
status: 1

bassine à confit
type: Concept
modified: 2014-10-16T16:24:03+02:00
in scheme: Thésaurus de la désignation des objets mobiliers
broader: récipient pour la cuisson des aliments
created: 2012-05-16T00:00:00+02:00
definition: Grand récipient circulaire en cuivre dans lequel on fait cuire une viande dans sa graisse. Il est généralement muni d'anses latérales horizontales fixées sur le bord.
status: 1

tourtière
type: Concept
modified: 2014-12-08T12:40:16+01:00
in scheme: Thésaurus de la désignation des objets mobiliers
broader: récipient pour la cuisson des aliments
alternative label: pâtissière
alternative label: tartière
created: 2012-05-16T00:00:00+02:00
related: daubière
definition: Récipient circulaire couvert, en céramique ou en métal, dans lequel on fait cuire à l'étouffée, sur les braises ou au four, des tourtes. La tourtière est à fond plat ou sur petits pieds, à parois latérales peu élevées et munie d'un haut couvercle comportant une dépression sur le dessus où l'on place des braises. Elle comporte souvent des anses latérales.
TermeAssocie: daubière
status: 1
broad match: cb11964895s

lèchefrite
type: Concept
modified: 2014-12-08T12:22:41+01:00
in scheme: Thésaurus de la désignation des objets mobiliers
preferred label: dripping pans @en-us
broader: récipient pour la cuisson des aliments
created: 2012-05-16T00:00:00+02:00
definition: Récipient plat, en céramique ou en métal, que l'on place sous le gril ou la broche pour recueillir le jus des aliments. De forme allongée, rectangulaire ou ovale, la lèchefrite peut comporter des petits pieds, des becs verseurs, des anses ou des manches.
status: 1
broad match: cb13184671j

grilloir à café
type: SimpleNonPreferredTerm
modified: 2014-10-16T16:21:46+02:00
created: 2014-01-15T14:54:24+01:00
status: 1

moule à gâteau
type: Concept
modified: 2014-12-08T12:28:27+01:00
in scheme: Thésaurus de la désignation des objets mobiliers
preferred label: baking pans @en-us
broader: récipient pour la cuisson des aliments
alternative label: moule à biscuits
alternative label: moule à madeleine
alternative label: moule à pain d'anis
alternative label: moule à massepain
alternative label: moule à tarte
alternative label: moule à gâteau de fête
alternative label: moule à charlotte
alternative label: moule à cannelet
alternative label: moule à soufflé
alternative label: moule à pain d'épices
alternative label: moule à savarin
alternative label: plaque à tarte
alternative label: moule à dariole
alternative label: moule à bordure
alternative label: moule à kugelhoff
created: 2012-05-16T00:00:00+02:00
definition: Récipient en métal ou en céramique, couvert ou non, dans lequel on introduit une pâte, liquide ou non, qui prend sa forme. Le moule à gâteau peut être destiné à des gâteaux cuits ou non, ou à des entremets. Il peut être démontable ou non, ou consister en une simple plaque.
status: 1

moule à gaufres
type: Concept
modified: 2014-12-08T12:29:52+01:00
in scheme: Thésaurus de la désignation des objets mobiliers
preferred label: waffle irons @en-us
broader: récipient pour la cuisson des aliments
alternative label: gaufrier
alternative label: fer à gaufres
alternative label: moule à gaufrettes
alternative label: moule à oublies
created: 2012-05-16T00:00:00+02:00
definition: Moule à gâteau en métal, en forme de grande pince à charnière constituée de deux plaques rectangulaires, à l'intérieur desquelles on introduit la pâte à gaufre pour la faire cuire sur le feu.
status: 1

daubière
type: Concept
modified: 2014-12-08T12:19:24+01:00
in scheme: Thésaurus de la désignation des objets mobiliers
broader: récipient pour la cuisson des aliments
alternative label: braisière
alternative label: artichautière
alternative label: huguenote
alternative label: chaponnière
created: 2012-05-16T00:00:00+02:00
related: tourtière
definition: Récipient en métal ou en terre cuite dans lequel on fait cuire des aliments à l'étouffée. Il est fermé hermétiquement par un haut couvercle emboîtant dont le dessus est pourvu d'une dépression ou d'un haut rebord dans lesquels on place des braises ou de l'eau. La daubière est à fond plat ou sur pieds et comporte deux anses latérales ou un manche.
TermeAssocie: tourtière
status: 1

jambonnière
type: SimpleNonPreferredTerm
modified: 2014-10-16T16:21:46+02:00
created: 2014-01-15T14:54:24+01:00
status: 1

couvercle de cuisine
type: SimpleNonPreferredTerm
modified: 2014-10-16T16:21:46+02:00
created: 2014-01-15T14:54:24+01:00
status: 1

bassine à sirop
type: Concept
modified: 2014-12-08T12:12:09+01:00
in scheme: Thésaurus de la désignation des objets mobiliers
broader: récipient pour la cuisson des aliments
created: 2012-05-16T00:00:00+02:00
definition: Récipient hémisphérique en cuivre, plus petit que la bassine à confiture, muni de deux anses, d'un anneau d'accrochage et parfois d'un large bec verseur, pour faire cuire une solution de sucre et d'eau ou de jus de fruits.
status: 1

récipient pour la cuisson des aliments
type: PreferredTerm
modified: 2014-10-16T16:21:46+02:00
created: 2014-01-15T14:54:24+01:00
status: 1

pot à châtaignes
type: SimpleNonPreferredTerm
modified: 2014-10-16T16:21:46+02:00
created: 2014-01-15T14:54:24+01:00
status: 1

bassine à confiture
type: Concept
modified: 2014-12-08T12:11:15+01:00
in scheme: Thésaurus de la désignation des objets mobiliers
preferred label: preserving kettles @en-us
broader: récipient pour la cuisson des aliments
alternative label: chaudron à confiture
created: 2012-05-16T00:00:00+02:00
definition: Grand récipient circulaire généralement en cuivre dans lequel on fait cuire des fruits dans le sucre. Plus large que haute, cette bassine est munie d'anses latérales verticales fixées sur le bord.
status: 1

marmite
type: Concept
modified: 2014-12-08T12:24:36+01:00
in scheme: Thésaurus de la désignation des objets mobiliers
preferred label: stockpots @en-us
broader: récipient pour la cuisson des aliments
alternative label: poissonnière
alternative label: cocotte daubière
alternative label: cocotte-minute
alternative label: marmite suspendue
alternative label: turbotière
alternative label: cocotte
alternative label: pot à vapeur
alternative label: faitout
created: 2012-05-16T00:00:00+02:00
related: trépied
definition: Récipient de cuisson, couvert, en céramique ou en métal. La marmite est à fond plat ou sur pieds, à manche ou anses latérales et parfois à anse mobile sur le dessus. Elle peut être de forme allongée ou adopter celle de l’aliment qu’elle contient. On la place sur un trépied posé sur les braises.
TermeAssocie: trépied
status: 1

plat à cuire
type: Concept
modified: 2014-12-08T12:31:31+01:00
in scheme: Thésaurus de la désignation des objets mobiliers
preferred label: baking dishes @en-us
broader: récipient pour la cuisson des aliments
alternative label: plat à gratin
alternative label: plat à four
alternative label: ramequin
alternative label: plat à cuire les escargots
alternative label: plat à gigot
alternative label: plat à rôtir
alternative label: plat à cuire les œufs
created: 2012-05-16T00:00:00+02:00
definition: Grand plat en poterie plombifère ou en métal, dans lequel on cuit les aliments au four. Il peut comporter des anses ou des oreilles latérales et un bec verseur tandis que le fond peut contenir des cavités.
status: 1
broad match: cb12336687k

terrine à tripes
type: Concept
modified: 2014-10-16T16:49:40+02:00
in scheme: Thésaurus de la désignation des objets mobiliers
broader: récipient pour la cuisson des aliments
alternative label: tripière
alternative label: pot à tripes
created: 2012-05-16T00:00:00+02:00
definition: Récipient circulaire, en poterie plombifère, utilisé pour faire cuire les tripes. De forme aplatie, à parois latérales galbées munies de deux oreilles, la terrine à tripes comporte sur le dessus une ouverture réduite fermée hermétiquement par un couvercle plat.
status: 1
broad match: http://vocab.getty.edu/aat/300216962
broad match: cb16518838w

poêle à galettes
type: Concept
modified: 2014-12-08T12:33:35+01:00
in scheme: Thésaurus de la désignation des objets mobiliers
broader: récipient pour la cuisson des aliments
alternative label: galetière
alternative label: plaque à galettes
created: 2012-05-16T00:00:00+02:00
definition: Plaque circulaire en métal ou en pierre, à petit rebord et parfois munie d'une anse mobile sur le dessus, ou bien plaque de métal montée sur pieds ou non et munie d'un manche (plaque à galettes).
status: 1
narrow match: Billig
broad match: http://vocab.getty.edu/aat/300042984
broad match: cb13608442k

rôtissoire
type: Concept
modified: 2014-12-08T12:37:34+01:00
in scheme: Thésaurus de la désignation des objets mobiliers
preferred label: roasters (cookware) @en-us
narrower: T69-3782
broader: récipient pour la cuisson des aliments
created: 2012-05-16T00:00:00+02:00
related: T69-4491
definition: Réceptacle en métal ou terre cuite, en forme de demi-coquille dans lequel on fait cuire la viande à la broche. Le bas de la coquille recueille le jus et peut comporter un bec verseur latéral. La rôtissoire peut être munie d'une ou deux anses verticales et portée par des petits pieds.
TermeAssocie: T69-4491
status: 1

veille-lait
type: SimpleNonPreferredTerm
modified: 2014-10-16T16:21:46+02:00
created: 2014-01-15T14:54:24+01:00
status: 1

cuit-oeufs
type: Concept
modified: 2015-03-09T10:49:11+01:00
in scheme: Thésaurus de la désignation des objets mobiliers
preferred label: egg poachers @en-us
broader: récipient pour la cuisson des aliments
alternative label: chauffe-œufs
alternative label: pocheur à œuf
alternative label: cuit-œufs
created: 2012-05-16T00:00:00+02:00
status: 1
broad match: cb11931821w

chaudron
type: Concept
modified: 2014-12-08T12:16:48+01:00
in scheme: Thésaurus de la désignation des objets mobiliers
preferred label: cauldrons @en-us
broader: récipient pour la cuisson des aliments
alternative label: chaudron à soupe
created: 2012-05-16T00:00:00+02:00
related: T69-4382
definition: Récipient en métal que l'on suspend à une crémaillère par une anse supérieure mobile. Le chaudron est aussi haut que large, plus ou moins galbé, à fond légèrement arrondi et possède ou non des pieds et un couvercle.
TermeAssocie: T69-4382
status: 1

pot à jus de viande
type: Concept
modified: 2014-12-08T12:35:41+01:00
in scheme: Thésaurus de la désignation des objets mobiliers
broader: récipient pour la cuisson des aliments
alternative label: marmite américaine
created: 2012-05-16T00:00:00+02:00
definition: Récipient fermé hermétiquement, généralement en étain ou en porcelaine, de forme plus ou moins sphérique, à fond plat et sans élément de préhension que l'on remplit de viande pour la faire cuire au bain-marie et en obtenir un bouillon. Il est muni d'un double système de couvercle, l'un intérieur, emboîté, l'autre extérieur, vissé, surmonté d'une anse verticale.
status: 1
broad match: http://vocab.getty.edu/aat/300199857

casserole
type: Concept
modified: 2014-12-08T12:15:02+01:00
in scheme: Thésaurus de la désignation des objets mobiliers
preferred label: saucepans @en-us
broader: récipient pour la cuisson des aliments
alternative label: casserole sauteuse
alternative label: casserole à sirop
alternative label: casserole bain-marie
alternative label: casserole suspendue
created: 2012-05-16T00:00:00+02:00
related: poêlon de table
definition: Récipient de cuisson à manche latéral, en métal ou en céramique, à fond plat ou arrondi et parois verticales droites plus ou moins basses. La casserole peut être couverte et faire partie d'une série de grandeurs décroissantes.
TermeAssocie: poêlon de table
status: 1

pot à bouillir le lait
type: SimpleNonPreferredTerm
modified: 2014-10-16T16:21:46+02:00
created: 2014-01-15T14:54:24+01:00
status: 1

terrine à pâté
type: Concept
modified: 2014-12-08T12:38:44+01:00
in scheme: Thésaurus de la désignation des objets mobiliers
preferred label: terrines (baking dishes) @en-us
broader: récipient pour la cuisson des aliments
alternative label: moule à pâté
alternative label: caisse à pâté
alternative label: terrine à pâté de lapin
created: 2012-05-16T00:00:00+02:00
definition: Moule couvert, en céramique, dans lequel on fait cuire une préparation de viande ou de poisson. La terrine à pâté est circulaire ou ovale, à fond plat et parois verticales droites, munie de deux oreilles ou de deux anses.
status: 1
broad match: http://data.bnf.fr/ark:/12148/cb119529821

poêle à cuire
type: Concept
modified: 2014-12-08T12:32:12+01:00
in scheme: Thésaurus de la désignation des objets mobiliers
preferred label: frying pans (cookware) @en-us
broader: récipient pour la cuisson des aliments
alternative label: poêlon
alternative label: poêle à griller
alternative label: poêle à four
alternative label: poêle à frire
alternative label: poêle à châtaignes
alternative label: poêle-casserole
created: 2012-05-16T00:00:00+02:00
definition: Récipient en métal, circulaire, à fond plat éventuellement perforé, muni d'un manche latéral quelquefois creux et parfois de petits pieds.
status: 1

boule à cuire
type: Concept
modified: 2014-10-16T16:28:05+02:00
in scheme: Thésaurus de la désignation des objets mobiliers
broader: récipient pour la cuisson des aliments
alternative label: boule à riz
alternative label: blanchilégumier
alternative label: œuf à thé
created: 2012-05-16T00:00:00+02:00
definition: Boule ajourée en céramique ou en métal dans laquelle on place des aliments pour les faire cuire dans du bouillon ou de l'eau. Elle se compose de deux moitiés assemblées à charnière et fermées par un ressort ou un moraillon.
status: 1
narrow match: http://vocab.getty.edu/aat/300200834
broad match: cb13184671j
broad match: Catégorie:Récipient de cuisson

diable à trous
type: SimpleNonPreferredTerm
modified: 2014-10-16T16:21:46+02:00
created: 2014-01-15T14:54:24+01:00
status: 1

garde-lait
type: SimpleNonPreferredTerm
modified: 2014-10-16T16:21:46+02:00
created: 2014-01-15T14:54:24+01:00
status: 1

moule industriel
type: PreferredTerm
modified: 2015-10-16T13:08:46+02:00
created: 2014-01-15T14:54:24+01:00
status: 1

wagon plat
type: Concept
modified: 2014-12-18T10:32:37+01:00
in scheme: Thésaurus de la désignation des objets mobiliers
preferred label: flatcars @en-us
broader: matériel remorqué pour le transport ferroviaire des marchandises
alternative label: wagon pour remorque routière
alternative label: wagon kangourou
created: 2013-11-04T00:00:00+01:00
definition: Véhicule ferroviaire ouvert destiné au transport de marchandises ne craignant pas les éléments ; il peut être bordé de ridelles et de ranchers destinés à maintenir le chargement en place et à l'amarrer à l'aide de sangles.
status: 1
broad match: cb11931174j

wagon kangourou
type: SimpleNonPreferredTerm
modified: 2014-12-18T10:32:37+01:00
created: 2014-01-15T14:54:24+01:00
status: 1

wagon plat
type: PreferredTerm
modified: 2014-12-18T10:32:37+01:00
created: 2014-01-15T14:54:24+01:00
status: 1

wagon pour remorque routière
type: SimpleNonPreferredTerm
modified: 2014-12-18T10:32:37+01:00
created: 2014-01-15T14:54:24+01:00
status: 1

objet pour le chauffage
type: Concept
modified: 2014-10-17T15:29:35+02:00
in scheme: Thésaurus de la désignation des objets mobiliers
narrower: chaufferette
narrower: bouillotte
narrower: pelle à chaufferette
narrower: chauffe-bain
broader: objet civil domestique
alternative label: pierre chauffe-lit
alternative label: fer chauffe-lit
alternative label: fer chauffe-mains
alternative label: brique chauffe-lit
created: 2012-05-16T00:00:00+02:00
definition: Instrument servant à chauffer ou à réchauffer ou accessoire lié à cette fonction.
status: 1
broad match: cb11934810z

bouillotte
type: Concept
modified: 2014-12-10T17:03:07+01:00
in scheme: Thésaurus de la désignation des objets mobiliers
preferred label: hot-water bottles @en-us
broader: objet pour le chauffage
alternative label: bouillotte de lit
alternative label: bouillotte à mains
created: 2012-05-16T00:00:00+02:00
definition: Récipient, en forme de bouteille, gourde, boule, livre, etc. que l'on remplit d'eau chaude pour se réchauffer les mains ou les pieds, ou chauffer l'intérieur d'un lit.
status: 1
broad match: cb11934810z

pelle à chaufferette
type: Concept
modified: 2014-10-17T15:34:34+02:00
in scheme: Thésaurus de la désignation des objets mobiliers
broader: objet pour le chauffage
created: 2012-05-16T00:00:00+02:00
definition: Petite pelle avec laquelle on remue et trie les braises dans la chaufferette. Une pince ou des pincettes peuvent servir au même usage.
status: 1

chauffe-bain
type: Concept
modified: 2014-10-17T15:31:17+02:00
in scheme: Thésaurus de la désignation des objets mobiliers
preferred label: water-heaters @en-us
broader: objet pour le chauffage
created: 2012-05-16T00:00:00+02:00
definition: Récipient rempli de braises, que l'on plonge dans l'eau d'un bain pour la chauffer. Il peut être muni de cheminées destinées à diffuser la chaleur.
status: 1
broad match: http://vocab.getty.edu/aat/300163292

objet pour le chauffage
type: PreferredTerm
modified: 2014-10-17T15:29:35+02:00
created: 2014-01-15T14:54:24+01:00
status: 1

fer chauffe-mains
type: SimpleNonPreferredTerm
modified: 2014-10-17T15:29:35+02:00
created: 2014-01-15T14:54:24+01:00
status: 1

fer chauffe-lit
type: SimpleNonPreferredTerm
modified: 2014-10-17T15:29:35+02:00
created: 2014-01-15T14:54:24+01:00
status: 1

pierre chauffe-lit
type: SimpleNonPreferredTerm
modified: 2014-10-17T15:29:35+02:00
created: 2014-01-15T14:54:24+01:00
status: 1

brique chauffe-lit
type: SimpleNonPreferredTerm
modified: 2014-10-17T15:29:35+02:00
created: 2014-01-15T14:54:24+01:00
status: 1

pouf
type: PreferredTerm
modified: 2014-12-05T12:58:05+01:00
created: 2014-01-15T14:54:24+01:00
status: 1

entonnoir
type: Concept
modified: 2014-12-05T16:10:48+01:00
in scheme: Thésaurus de la désignation des objets mobiliers
preferred label: funnels @en-us
broader: instrument pour la préparation - le service ou la consommation des aliments et des boissons
alternative label: poche à pâtisserie
alternative label: entonnoir à boudin
alternative label: perloir
created: 2012-05-16T00:00:00+02:00
definition: Instrument pour transvaser des liquides ou confectionner certains aliments. Il se compose d'un réceptacle conique ou cylindrique terminé à sa partie inférieure par un goulot. Il peut être muni d'un élément de prise latéral, d'un filtre intérieur mobile ou d'un fond perforé pour servir de passoire ou de tamis.
status: 1

entonnoir
type: PreferredTerm
modified: 2014-12-05T16:10:48+01:00
created: 2014-01-15T14:54:24+01:00
status: 1

entonnoir à boudin
type: SimpleNonPreferredTerm
modified: 2014-12-05T16:10:48+01:00
created: 2014-01-15T14:54:24+01:00
status: 1

poche à pâtisserie
type: SimpleNonPreferredTerm
modified: 2014-12-05T16:10:48+01:00
created: 2014-01-15T14:54:24+01:00
status: 1

perloir
type: SimpleNonPreferredTerm
modified: 2014-12-05T16:10:48+01:00
created: 2014-01-15T14:54:24+01:00
status: 1

chaudron à confiture
type: SimpleNonPreferredTerm
modified: 2014-12-08T12:11:15+01:00
created: 2014-01-15T14:54:24+01:00
status: 1

bassine à confiture
type: PreferredTerm
modified: 2014-12-08T12:11:15+01:00
created: 2014-01-15T14:54:24+01:00
status: 1

costume de statue
type: Concept
modified: 2014-11-26T14:21:35+01:00
in scheme: Thésaurus de la désignation des objets mobiliers
preferred label: statue costumes @en-us
preferred label: paramenti di statua @it
preferred label: enxoval de imagen de vestir @pt
broader: attribut d'image sacrée
created: 2012-05-16T00:00:00+02:00
definition: Vêtement confectionné pour habiller une statue particulièrement honorée d'un personnage sacré, en général une Vierge à l'Enfant.
status: 1
broad match: http://vocab.getty.edu/aat/300047600

costume de statue
type: PreferredTerm
modified: 2014-11-26T14:21:35+01:00
created: 2014-01-15T14:54:24+01:00
status: 1

microscope optique
type: Concept
modified: 2014-12-15T13:58:45+01:00
in scheme: Thésaurus de la désignation des objets mobiliers
preferred label: microscopes @en-us
broader: instrument d'observation
created: 2012-05-16T00:00:00+02:00
definition: Instrument d'optique qui permet de voir des objets invisibles à l'œil nu grâce à un système de lentilles.
status: 1

microscope optique
type: PreferredTerm
modified: 2014-12-15T13:58:45+01:00
created: 2014-01-15T14:54:24+01:00
status: 1

reliquaire-ostensoir
type: Concept
modified: 2014-11-26T17:41:39+01:00
in scheme: Thésaurus de la désignation des objets mobiliers
preferred label: monstrance-reliquaries @en-us
preferred label: reliquiario-ostensorio @it
preferred label: relicário com ostensório @pt
broader: reliquaire
alternative label: ostensoir-reliquaire
created: 2012-05-16T00:00:00+02:00
related: ostensoir
definition: Reliquaire souvent à cylindre horizontal (reliquaire-monstrance), comprenant une partie ouvrante vitrée servant à exposer une grande hostie consacrée.
TermeAssocie: ostensoir
status: 1

voile d'ostensoir
type: Concept
modified: 2014-12-02T16:59:05+01:00
in scheme: Thésaurus de la désignation des objets mobiliers
preferred label: copriostensorio @it
preferred label: monstrance veils @en-us
preferred label: véu de ostensório @pt
broader: linge ou garniture liés à l'Eucharistie
alternative label: voile de l'ostensoir
alternative label: couvre-ostensoir
created: 2012-05-16T00:00:00+02:00
related: ostensoir
definition: Pièce de soie blanche carrée ou housse losangique placée sur l’ostensoir, avant son utilisation.
TermeAssocie: ostensoir
status: 1
broad match: http://data.bnf.fr/ark:/12148/cb120635808

voile d'exposition du saint sacrement
type: Concept
modified: 2014-12-02T16:57:05+01:00
in scheme: Thésaurus de la désignation des objets mobiliers
preferred label: exposition screens @en-us
preferred label: cortina per il SS. Sacramento @it
preferred label: cortina do Santíssimo Sacramento @pt
broader: linge ou garniture liés à l'Eucharistie
created: 2012-05-16T00:00:00+02:00
related: ostensoir
related: T69-659
definition: Pièce de soie blanche, parfois de la couleur du temps liturgique, suspendue à un écran du saint sacrement. L'ensemble est placé devant un ostensoir sur un degré d'autel, parfois sur l'autel lui-même, lorsque le saint sacrement est exposé pendant la liturgie de la parole.
TermeAssocie: ostensoir
TermeAssocie: T69-659
status: 1
broad match: http://data.bnf.fr/ark:/12148/cb119669330
broad match: http://vocab.getty.edu/aat/300214771

soleil
type: SimpleNonPreferredTerm
modified: 2014-11-27T15:19:06+01:00
created: 2014-01-15T14:54:24+01:00
status: 1

ostensoir-monstrance
type: SimpleNonPreferredTerm
modified: 2014-11-27T15:19:06+01:00
created: 2014-01-15T14:54:24+01:00
status: 1

ostensoir-soleil
type: SimpleNonPreferredTerm
modified: 2014-11-27T15:19:06+01:00
created: 2014-01-15T14:54:24+01:00
status: 1

monstrance
type: SimpleNonPreferredTerm
modified: 2014-11-27T15:19:06+01:00
created: 2014-01-15T14:54:24+01:00
status: 1

reliquaire-monstrance
type: Concept
modified: 2014-11-26T17:27:46+01:00
in scheme: Thésaurus de la désignation des objets mobiliers
preferred label: reliquary monstrances @en-us
preferred label: reliquiario a ostensorio @it
preferred label: ostensório-relicário @pt
broader: reliquaire
created: 2012-05-16T00:00:00+02:00
related: ostensoir
definition: Reliquaire en forme d'ostensoir à cylindre vertical ou horizontal, dans lequel les reliques sont exposées à la place d'une hostie.
TermeAssocie: ostensoir
status: 1

ostensoir
type: PreferredTerm
modified: 2014-11-27T15:19:06+01:00
created: 2014-01-15T14:54:24+01:00
status: 1

aérodyne
type: Concept
modified: 2014-10-14T15:31:51+02:00
in scheme: Thésaurus de la désignation des objets mobiliers
preferred label: heavier than air aircraft @en-us
narrower: avion militaire
narrower: avion civil
broader: aéronef
alternative label: aéronef plus lourd que l'air
created: 2013-11-06T00:00:00+01:00
definition: Famille regroupant tous les aéronefs plus lourds que l'air. Leur sustentation est principalement assurée par des forces aérodynamiques qui agissent sur une voilure fixe pour les avions ou planeurs, sur une voilure tournante pour les hélicoptères. Dans le langage courant, on parle plus généralement d'avion ou d'hélicoptère.
status: 1

aérodyne
type: PreferredTerm
modified: 2014-10-14T15:31:51+02:00
created: 2014-01-15T14:54:24+01:00
status: 1

aéronef plus lourd que l'air
type: SimpleNonPreferredTerm
modified: 2014-10-14T15:31:51+02:00
created: 2014-01-15T14:54:24+01:00
status: 1

aéronef
type: Concept
modified: 2014-10-14T15:30:47+02:00
in scheme: Thésaurus de la désignation des objets mobiliers
preferred label: aircraft @en-us
narrower: aérodyne
narrower: aérostat
broader: matériel de transport aéronautique
created: 2013-11-06T00:00:00+01:00
definition: Tout appareil capable de se déplacer dans les airs.
status: 1

avion militaire
type: Concept
modified: 2014-10-14T15:44:29+02:00
in scheme: Thésaurus de la désignation des objets mobiliers
preferred label: military aircraft @en-us
narrower: avion de reconnaissance et de surveillance
narrower: avion de transport militaire
narrower: bombardier
narrower: chasseur
narrower: T69-9055
narrower: T69-9054
broader: aérodyne
created: 2013-11-06T00:00:00+01:00
related: armement
definition: Avion spécifiquement destiné aux forces armées.
TermeAssocie: armement
status: 1

avion civil
type: Concept
modified: 2014-10-14T15:32:47+02:00
in scheme: Thésaurus de la désignation des objets mobiliers
preferred label: general aviation and transport aircraft @en-us
narrower: T69-9041
narrower: T69-9040
narrower: T69-9044
narrower: T69-9045
narrower: T69-9042
narrower: T69-9043
narrower: T69-9048
narrower: T69-9046
narrower: T69-9047
narrower: T69-9039
broader: aérodyne
alternative label: aéroplane
created: 2013-11-06T00:00:00+01:00
definition: Avion destiné à un usage commercial, touristique ou sportif.
status: 1
broad match: http://data.bnf.fr/ark:/12148/cb11931002d

vase à fleurs
type: Concept
modified: 2014-12-05T15:37:25+01:00
in scheme: Thésaurus de la désignation des objets mobiliers
preferred label: flower vases @en-us
broader: objet décoratif ou de rangement ou pour les plantes et les fleurs
alternative label: porte-bouquet
created: 2012-05-16T00:00:00+02:00
definition: Récipient dont l'ouverture supérieure est assez large pour y mettre des fleurs coupées ; ses formes sont souvent les mêmes que celles du vase décoratif.
status: 1

vase à fleurs
type: PreferredTerm
modified: 2014-12-05T15:37:25+01:00
created: 2014-01-15T14:54:24+01:00
status: 1

porte-bouquet
type: SimpleNonPreferredTerm
modified: 2014-12-05T15:37:25+01:00
created: 2014-01-15T14:54:24+01:00
status: 1

table à manger
type: PreferredTerm
modified: 2014-12-05T13:35:55+01:00
created: 2014-01-15T14:54:24+01:00
status: 1

machine à tremper
type: Concept
modified: 2015-09-28T12:04:46+02:00
in scheme: Thésaurus de la désignation des objets mobiliers
broader: machine à durcir
alternative label: poste de trempe
alternative label: bain de trempe à l'huile
alternative label: bac de trempe
created: 2012-05-16T00:00:00+02:00
definition: Machine à durcir un produit en métal ou en verre, par refroidissement brutal dans un fluide (eau, huile, silicone) pour l'un, ou par projections d'air comprimé pour l'autre.
status: 1

poste de trempe
type: SimpleNonPreferredTerm
modified: 2015-09-28T12:04:46+02:00
created: 2014-01-15T14:54:24+01:00
status: 1

bac de trempe
type: SimpleNonPreferredTerm
modified: 2015-09-28T12:04:46+02:00
created: 2014-01-15T14:54:24+01:00
status: 1

machine à tremper
type: PreferredTerm
modified: 2015-09-28T12:04:47+02:00
created: 2014-01-15T14:54:24+01:00
status: 1

machine à durcir
type: Concept
modified: 2015-10-15T17:29:26+02:00
in scheme: Thésaurus de la désignation des objets mobiliers
narrower: machine à tremper
broader: machine à modifier la malléabilité
created: 2012-05-16T00:00:00+02:00
definition: Machine à modifier la malléabilité d'un matériau ou d'un produit en en augmentant la rigidité.
status: 1

bain de trempe à l'huile
type: SimpleNonPreferredTerm
modified: 2015-09-28T12:04:46+02:00
created: 2014-01-15T14:54:24+01:00
status: 1

contrat de mariage
type: Concept
modified: 2014-01-10T00:00:00+01:00
in scheme: Thésaurus de la désignation des objets mobiliers
broader: objet lié au mariage
alternative label: ketoubbah
alternative label: acte de mariage
created: 2012-05-16T00:00:00+02:00
definition: Document rappelant les obligations financières du mari à l'égard de sa femme. Rédigé sur papier ou sur parchemin, on le trouve généralement encadré et enluminé.
status: 1

contrat de mariage
type: PreferredTerm
modified: 2014-01-10T00:00:00+01:00
created: 2014-01-15T14:54:24+01:00
status: 1

ketoubbah
type: SimpleNonPreferredTerm
modified: 2014-01-10T00:00:00+01:00
created: 2014-01-15T14:54:24+01:00
status: 1

acte de mariage
type: SimpleNonPreferredTerm
modified: 2014-01-10T00:00:00+01:00
created: 2014-01-15T14:54:24+01:00
status: 1

zéon
type: Concept
modified: 2014-01-10T00:00:00+01:00
in scheme: Thésaurus de la désignation des objets mobiliers
broader: objet du culte orthodoxe
created: 2012-05-16T00:00:00+02:00
definition: Petit récipient à fond plat et petite anse en forme d'anneau latéral, destiné à contenir l'eau bouillante que l'on verse dans le calice après la fraction du pain au moment de la communion. Il sert également à prendre le vin (rouge) pour le mettre dans le calice. La forme évoque celle du goûte-vins civil. Le mot zéon désigne en fait l'eau bouillante versée dans le calice et par métonymie seulement le récipient qui contient cette eau.
status: 1

zéon
type: PreferredTerm
modified: 2014-01-10T00:00:00+01:00
created: 2014-01-15T14:54:24+01:00
status: 1

iconostase
type: PreferredTerm
modified: 2014-10-15T17:23:47+02:00
created: 2014-01-15T14:54:24+01:00
status: 1

bouillotte à mains
type: SimpleNonPreferredTerm
modified: 2014-12-10T17:03:07+01:00
created: 2014-01-15T14:54:24+01:00
status: 1

bouillotte de lit
type: SimpleNonPreferredTerm
modified: 2014-12-10T17:03:07+01:00
created: 2014-01-15T14:54:24+01:00
status: 1

bouillotte
type: PreferredTerm
modified: 2014-12-10T17:03:07+01:00
created: 2014-01-15T14:54:24+01:00
status: 1

pendule
type: Concept
modified: 2014-12-10T14:16:32+01:00
in scheme: Thésaurus de la désignation des objets mobiliers
preferred label: table clocks @en-us
broader: horloge
alternative label: horloge à poser
created: 2012-05-16T00:00:00+02:00
definition: Horloge de petite dimension, facilement déplaçable et comportant un régulateur à pendule.
status: 1

horloge à poser
type: SimpleNonPreferredTerm
modified: 2014-12-10T14:16:32+01:00
created: 2014-01-15T14:54:24+01:00
status: 1

pendule
type: PreferredTerm
modified: 2014-12-10T14:16:32+01:00
created: 2014-01-15T14:54:24+01:00
status: 1

machine à aléser
type: Concept
modified: 2015-10-14T14:27:02+02:00
in scheme: Thésaurus de la désignation des objets mobiliers
broader: machine à usiner par outil de coupe
alternative label: aléseuse
created: 2012-05-16T00:00:00+02:00
definition: Machine à usiner par outil de coupe en rotation, pour façonner, en la calibrant et en la polissant, la cavité cyclindrique ou conique d'une pièce mécanique.
status: 1
narrow match: Aléseuse

aléseuse
type: SimpleNonPreferredTerm
modified: 2015-10-14T14:27:02+02:00
created: 2014-01-15T14:54:24+01:00
status: 1

machine à aléser
type: PreferredTerm
modified: 2015-10-14T14:27:02+02:00
created: 2014-01-15T14:54:24+01:00
status: 1

ruche
type: PreferredTerm
modified: 2014-01-10T00:00:00+01:00
created: 2014-01-15T14:54:24+01:00
status: 1

machine à homogénéiser
type: Concept
modified: 2015-10-15T15:30:34+02:00
in scheme: Thésaurus de la désignation des objets mobiliers
broader: machine à organiser
alternative label: malaxeur vertical
alternative label: homogénéisateur
alternative label: mélangeuse
alternative label: mélangeur
alternative label: malaxeur à vide
created: 2012-05-16T00:00:00+02:00
definition: Machine à organiser différents produits ou substances associées en vrac, en les mélangeant intimement afin d'en obtenir une composition homogène.
status: 1
narrow match: http://vocab.getty.edu/aat/300023063
narrow match: cb12509728s

malaxeur à vide
type: SimpleNonPreferredTerm
modified: 2015-10-15T15:30:34+02:00
created: 2014-01-15T14:54:24+01:00
status: 1

mélangeuse
type: SimpleNonPreferredTerm
modified: 2015-10-15T15:30:34+02:00
created: 2014-01-15T14:54:24+01:00
status: 1

malaxeur vertical
type: SimpleNonPreferredTerm
modified: 2015-10-15T15:30:34+02:00
created: 2014-01-15T14:54:24+01:00
status: 1

mélangeur
type: SimpleNonPreferredTerm
modified: 2015-10-15T15:30:34+02:00
created: 2014-01-15T14:54:24+01:00
status: 1

machine à plier
type: Concept
modified: 2015-09-24T17:28:19+02:00
in scheme: Thésaurus de la désignation des objets mobiliers
broader: machine à organiser
alternative label: plieuse de rotative
alternative label: plieuse à poches
alternative label: plieuse à couteau
alternative label: machine à remplier
created: 2012-05-16T00:00:00+02:00
scope note: Ne pas confondre avec machine à former par pliage.
related: machine à former par pliage
definition: Machine à arranger un produit (cuir, papier, tissu, etc.) en en rabattant une partie sur elle-même.
TermeAssocie: machine à former par pliage
status: 1
narrow match: Plieuse

machine à homogénéiser
type: PreferredTerm
modified: 2015-10-15T15:30:34+02:00
created: 2014-01-15T14:54:24+01:00
status: 1

homogénéisateur
type: SimpleNonPreferredTerm
modified: 2015-10-15T15:30:34+02:00
created: 2014-01-15T14:54:24+01:00
status: 1

machine à recharger
type: SimpleNonPreferredTerm
modified: 2014-01-10T00:00:00+01:00
created: 2014-01-15T14:54:24+01:00
status: 1

machine à reconstituer
type: SimpleNonPreferredTerm
modified: 2014-01-10T00:00:00+01:00
created: 2014-01-15T14:54:24+01:00
status: 1

machine à conformer
type: PreferredTerm
modified: 2014-01-10T00:00:00+01:00
created: 2014-01-15T14:54:24+01:00
status: 1

machine à restaurer
type: SimpleNonPreferredTerm
modified: 2014-01-10T00:00:00+01:00
created: 2014-01-15T14:54:24+01:00
status: 1

potager
type: Concept
modified: 2014-12-05T10:53:02+01:00
in scheme: Thésaurus de la désignation des objets mobiliers
broader: meuble pour le feu ou le réchauffage
created: 2012-05-16T00:00:00+02:00
definition: Construction en maçonnerie ou meuble indépendant comportant plusieurs récipients à braises ou charbon de bois, au-dessus desquels les aliments sont cuits ou maintenus au chaud. Le dessus est souvent constitué de carreaux de céramique, parfois d'une dalle de pierre ou d'une plaque de fonte.
status: 1
broad match: cb13337214n

potager
type: PreferredTerm
modified: 2014-12-05T10:53:02+01:00
created: 2014-01-15T14:54:24+01:00
status: 1

table à écrire
type: Concept
modified: 2014-12-05T14:00:08+01:00
in scheme: Thésaurus de la désignation des objets mobiliers
preferred label: writing tables @en-us
broader: table pour le bureau ou les loisirs
created: 2012-05-16T00:00:00+02:00
related: objet pour écrire ou de bureau
related: secrétaire
definition: Table, à dessus ou tablette tirante garni(e) de velours ou de cuir, servant à écrire. Elle comporte généralement un tiroir divisé en cases destinées au papier et au matériel d’écriture (encrier, éponge, canif, cire, etc).
TermeAssocie: objet pour écrire ou de bureau
TermeAssocie: secrétaire
status: 1

table à écrire
type: PreferredTerm
modified: 2014-12-05T14:00:08+01:00
created: 2014-01-15T14:54:24+01:00
status: 1

mont des Oliviers
type: Concept
modified: 2015-02-24T12:17:12+01:00
in scheme: Thésaurus de la désignation des objets mobiliers
broader: édicule religieux chrétien
created: 2012-05-16T00:00:00+02:00
definition: Groupe sculpté, et par extension l’édicule qui peut l’abriter, placé à l'extérieur ou à l'intérieur d'un édifice religieux et représentant l'agonie du Christ au Mont des Oliviers.
status: 1
broad match: http://vocab.getty.edu/aat/300006958

mont des Oliviers
type: PreferredTerm
modified: 2015-02-24T12:17:12+01:00
created: 2014-01-15T14:54:24+01:00
status: 1

gémellions
type: Concept
modified: 2014-11-27T11:33:12+01:00
in scheme: Thésaurus de la désignation des objets mobiliers
preferred label: gemellions @en-us
preferred label: bacili gemeli @it
preferred label: bacias geminadas @pt
broader: objet lié à l'ablution, à l'aspersion et à l'encensement
alternative label: gémellion
created: 2012-05-16T00:00:00+02:00
related: bassin de table
definition: Paire de bassins circulaires, en métal, de même forme et de même décor, s'emboîtant l'un dans l'autre et servant aux ablutions liturgiques. L'un permet de verser l'eau grâce à un orifice ou un petit goulot, l'autre sert de réceptacle.
TermeAssocie: bassin de table
status: 1
broad match: http://data.bnf.fr/ark:/12148/cb119378560
broad match: Objets du culte catholique

gémellion
type: SimpleNonPreferredTerm
modified: 2014-11-27T11:33:12+01:00
created: 2014-01-15T14:54:24+01:00
status: 1

gémellions
type: PreferredTerm
modified: 2014-11-27T11:33:12+01:00
created: 2014-01-15T14:54:24+01:00
status: 1

rouleau à pâte
type: Concept
modified: 2014-12-05T16:34:26+01:00
in scheme: Thésaurus de la désignation des objets mobiliers
preferred label: rolling pins @en-us
broader: instrument pour la préparation - le service ou la consommation des aliments et des boissons
alternative label: rouleau à pâtisserie
alternative label: laminoir à pâte
created: 2012-05-16T00:00:00+02:00
definition: Instrument servant à étaler la pâte. Il se présente le plus souvent comme un cylindre muni ou non d'éléments de prise aux extrémités.
status: 1
broad match: cb11956938h

rouleau à pâtisserie
type: SimpleNonPreferredTerm
modified: 2014-12-05T16:34:26+01:00
created: 2014-01-15T14:54:24+01:00
status: 1

laminoir à pâte
type: SimpleNonPreferredTerm
modified: 2014-12-05T16:34:26+01:00
created: 2014-01-15T14:54:24+01:00
status: 1

rouleau à pâte
type: PreferredTerm
modified: 2014-12-05T16:34:26+01:00
created: 2014-01-15T14:54:24+01:00
status: 1

cor naturel
type: Concept
modified: 2014-12-15T10:56:44+01:00
in scheme: Thésaurus de la désignation des objets mobiliers
preferred label: natural horns @en-us
broader: trompette naturelle
alternative label: cornet de poste
alternative label: cor de chasse
alternative label: cor d'orchestre
created: 2012-05-16T00:00:00+02:00
definition: Instrument en cuivre formé d'un tuyau plus ou moins long enroulé sur lui-même et à pavillon.
status: 1

cor de chasse
type: SimpleNonPreferredTerm
modified: 2014-12-15T10:56:44+01:00
created: 2014-01-15T14:54:24+01:00
status: 1

cor naturel
type: PreferredTerm
modified: 2014-12-15T10:56:44+01:00
created: 2014-01-15T14:54:24+01:00
status: 1

cornet de poste
type: SimpleNonPreferredTerm
modified: 2014-12-15T10:56:44+01:00
created: 2014-01-15T14:54:24+01:00
status: 1

cor d'orchestre
type: SimpleNonPreferredTerm
modified: 2014-12-15T10:56:44+01:00
created: 2014-01-15T14:54:24+01:00
status: 1

aérostat
type: Concept
modified: 2014-10-14T15:51:35+02:00
in scheme: Thésaurus de la désignation des objets mobiliers
preferred label: lighter than air aircraft @en-us
narrower: ballon captif
narrower: dirigeable
narrower: ballon sonde
narrower: ballon libre
broader: aéronef
alternative label: aéronef plus léger que l'air
alternative label: ballon aérostatique
created: 2013-11-06T00:00:00+01:00
definition: Appareil composé d'une nacelle et d'un ballon qui, rempli d'air chaud ou d'un gaz plus léger que l'air, lui permet de s'élever et de se maintenir dans les airs (sustentation).
status: 1

ballon aérostatique
type: SimpleNonPreferredTerm
modified: 2014-10-14T15:51:35+02:00
created: 2014-01-15T14:54:24+01:00
status: 1

ballon captif
type: Concept
modified: 2014-12-17T14:32:39+01:00
in scheme: Thésaurus de la désignation des objets mobiliers
preferred label: captive balloons @en-us
broader: aérostat
created: 2013-11-06T00:00:00+01:00
definition: Aérostat relié au sol par des cordes.
status: 1
broad match: http://data.bnf.fr/ark:/12148/cb11941876c

dirigeable
type: Concept
modified: 2014-12-17T14:36:19+01:00
in scheme: Thésaurus de la désignation des objets mobiliers
preferred label: airships @en-us
broader: aérostat
alternative label: ballon dirigeable
created: 2013-11-06T00:00:00+01:00
definition: Aérostat doté de systèmes de propulsion et de direction.
status: 1

aérostat
type: PreferredTerm
modified: 2014-10-14T15:51:35+02:00
created: 2014-01-15T14:54:24+01:00
status: 1

aéronef plus léger que l'air
type: SimpleNonPreferredTerm
modified: 2014-10-14T15:51:35+02:00
created: 2014-01-15T14:54:24+01:00
status: 1

ballon sonde
type: Concept
modified: 2014-10-14T15:54:28+02:00
in scheme: Thésaurus de la désignation des objets mobiliers
preferred label: sounding and meteorological balloons @en-us
broader: aérostat
created: 2013-11-06T00:00:00+01:00
definition: Aérostat utilisé dans les domaines de la météorologie et de l'astronautique. Le ballon libre, non habité, emporte des instruments pour effectuer des mesures dans l'atmosphère.
status: 1

ballon libre
type: Concept
modified: 2014-12-17T14:34:15+01:00
in scheme: Thésaurus de la désignation des objets mobiliers
preferred label: free balloons @en-us
broader: aérostat
alternative label: montgolfière
created: 2013-11-06T00:00:00+01:00
definition: Aérostat qui se déplace au gré des courants atmosphériques.
status: 1
broad match: http://vocab.getty.edu/aat/300222189

coffre à aumônes
type: Concept
modified: 2014-12-01T17:16:29+01:00
in scheme: Thésaurus de la désignation des objets mobiliers
preferred label: alms chests @en-us
preferred label: cassa per elmosine @it
broader: tronc
created: 2012-05-16T00:00:00+02:00
definition: Forme spécifique du tronc à aumônes.
status: 1
broad match: http://vocab.getty.edu/aat/300263336
broad match: Tronc (église)

tronc
type: Concept
modified: 2014-12-01T17:14:43+01:00
in scheme: Thésaurus de la désignation des objets mobiliers
preferred label: cassetta per elemosine @it
preferred label: collection boxes (furniture) @en-us
preferred label: caixa de esmolas @pt
narrower: coffre à aumônes
broader: meuble lié à l'offrande
alternative label: tronc d'église
alternative label: tronc à aumônes
created: 2012-05-16T00:00:00+02:00
definition: Boîte ou coffret fixé au sol ou au mur, muni d'une fente et fermant à clé, servant à recueillir l'argent destiné aux aumônes et au paiement des objets vendus dans une église. Il peut porter une inscription ou une iconographie relative à la destination de l'offrande.
status: 1
broad match: http://data.bnf.fr/ark:/12148/cb131627054

coffre à aumônes
type: PreferredTerm
modified: 2014-12-01T17:16:29+01:00
created: 2014-01-15T14:54:24+01:00
status: 1

mandoline
type: Concept
modified: 2014-12-15T11:45:53+01:00
in scheme: Thésaurus de la désignation des objets mobiliers
preferred label: mandolins @en-us
broader: cordophone composite à manche et cordes pincées
alternative label: mandoline napolitaine
alternative label: mandoline française
alternative label: mandoline lombarde
created: 2012-05-16T00:00:00+02:00
definition: Instrument plus petit que le luth, à caisse bombée, en forme de demi poire et manche fretté assez court.
status: 1

mandoline française
type: SimpleNonPreferredTerm
modified: 2014-12-15T11:45:53+01:00
created: 2014-01-15T14:54:24+01:00
status: 1

mandoline napolitaine
type: SimpleNonPreferredTerm
modified: 2014-12-15T11:45:53+01:00
created: 2014-01-15T14:54:24+01:00
status: 1

mandoline lombarde
type: SimpleNonPreferredTerm
modified: 2014-12-15T11:45:53+01:00
created: 2014-01-15T14:54:24+01:00
status: 1

mandoline
type: PreferredTerm
modified: 2014-12-15T11:45:53+01:00
created: 2014-01-15T14:54:24+01:00
status: 1

tabernacle suspendu
type: Concept
modified: 2014-12-01T16:57:24+01:00
in scheme: Thésaurus de la désignation des objets mobiliers
preferred label: suspended tabernacles @en-us
preferred label: tabernacolo pensile @it
preferred label: tabernáculo suspenso @pt
broader: meuble lié à l'Eucharistie
created: 2012-05-16T00:00:00+02:00
related: ciboire
related: colombe eucharistique
definition: Réceptacle accroché à une suspension eucharistique et servant à contenir la réserve eucharistique.
TermeAssocie: ciboire
TermeAssocie: colombe eucharistique
status: 1
broad match: http://data.bnf.fr/ark:/12148/cb121654992
broad match: http://vocab.getty.edu/aat/300207778

colombe eucharistique
type: Concept
modified: 2014-11-27T14:56:43+01:00
in scheme: Thésaurus de la désignation des objets mobiliers
preferred label: colomba eucaristica @it
preferred label: eucharistic doves @en-us
preferred label: pomba eucarística @pt
broader: objet lié à l'Eucharistie
alternative label: colombe d'autel
created: 2012-05-16T00:00:00+02:00
related: tabernacle suspendu
related: suspension eucharistique
definition: Vase sacré en forme de colombe, accroché à une suspension eucharistique au-dessus de l'autel, dans lequel étaient conservées les hosties consacrées. La colombe eucharistique devait être au moins dorée à l'intérieur, lorsqu'elle n'était pas en or.
TermeAssocie: tabernacle suspendu
TermeAssocie: suspension eucharistique
status: 1

tabernacle suspendu
type: PreferredTerm
modified: 2014-12-01T16:57:24+01:00
created: 2014-01-15T14:54:24+01:00
status: 1

convertisseur
type: Concept
modified: 2015-08-03T15:46:20+02:00
in scheme: Thésaurus de la désignation des objets mobiliers
narrower: convertisseur de pression
narrower: convertisseur électrique
narrower: T69-6052
broader: machine énergétique
created: 2012-05-16T00:00:00+02:00
definition: Machine énergétique adaptant une source d'énergie à une utilisation donnée, en en changeant les caractéristiques mais pas la nature.
status: 1

système de transmission
type: Concept
modified: 2015-10-08T10:53:52+02:00
in scheme: Thésaurus de la désignation des objets mobiliers
broader: machine énergétique
created: 2012-05-16T00:00:00+02:00
definition: Ensemble d'organes servant à transmettre la force mécanique de production par le biais d'arbres de transmission, d'engrenage, de poulies, de courroies, de chaînes, etc.
status: 1

moteur
type: Concept
modified: 2015-08-05T15:50:53+02:00
in scheme: Thésaurus de la désignation des objets mobiliers
narrower: moteur thermique
narrower: moteur à énergie mécanique
narrower: moteur électrique
broader: machine énergétique
created: 2012-05-16T00:00:00+02:00
definition: Machine produisant une énergie mécanique d'entraînement ou de propulsion.
status: 1

machine énergétique
type: PreferredTerm
modified: 2015-10-07T15:24:00+02:00
created: 2014-01-15T14:54:24+01:00
status: 1

régulateur
type: Concept
modified: 2015-08-06T17:03:22+02:00
in scheme: Thésaurus de la désignation des objets mobiliers
broader: machine énergétique
created: 2013-09-16T00:00:00+02:00
definition: Organe mécanique ou électrotechnique, généralement installé entre le générateur et le moteur, permettant de maintenir constant et régulier un débit énergétique afin d'éviter l'emballement du moteur ou la surchauffe du générateur.
status: 1

wagon postal
type: Concept
modified: 2014-12-18T10:35:30+01:00
in scheme: Thésaurus de la désignation des objets mobiliers
preferred label: mail cars @en-us
broader: matériel remorqué pour le transport ferroviaire des marchandises
alternative label: allège postale
alternative label: bureau ambulant postal
created: 2013-11-04T00:00:00+01:00
definition: Véhicule ferroviaire destiné à transporter et dans certains cas à trier le courrier.
status: 1
broad match: cb11931174j
broad match: http://vocab.getty.edu/aat/300212993

bureau ambulant postal
type: SimpleNonPreferredTerm
modified: 2014-12-18T10:35:30+01:00
created: 2014-01-15T14:54:24+01:00
status: 1

allège postale
type: SimpleNonPreferredTerm
modified: 2014-12-18T10:35:30+01:00
created: 2014-01-15T14:54:24+01:00
status: 1

wagon postal
type: PreferredTerm
modified: 2014-12-18T10:35:30+01:00
created: 2014-01-15T14:54:24+01:00
status: 1

pistolet
type: Concept
modified: 2014-12-12T14:43:05+01:00
in scheme: Thésaurus de la désignation des objets mobiliers
preferred label: pistols @en-us
broader: arme de poing
alternative label: pistolet à percussion
alternative label: pistolet à silex
created: 2012-05-16T00:00:00+02:00
definition: Arme de poing dont la chambre est intégrée au canon ou alignée avec lui et qui peut disposer d'un magasin ou d'un chargeur.
status: 1

pistolet à silex
type: SimpleNonPreferredTerm
modified: 2014-12-12T14:43:05+01:00
created: 2014-01-15T14:54:24+01:00
status: 1

pistolet
type: PreferredTerm
modified: 2014-12-12T14:43:05+01:00
created: 2014-01-15T14:54:24+01:00
status: 1

arme de poing
type: Concept
modified: 2014-10-09T11:44:35+02:00
in scheme: Thésaurus de la désignation des objets mobiliers
preferred label: handguns (small arms) @en-us
narrower: pistolet
narrower: revolver
broader: arme à feu
created: 2013-11-12T00:00:00+01:00
definition: Arme à feu individuelle de canon court qui s'utilise à une main.
status: 1
narrow match: http://data.bnf.fr/ark:/12148/cb119327079

pistolet à percussion
type: SimpleNonPreferredTerm
modified: 2014-12-12T14:43:05+01:00
created: 2014-01-15T14:54:24+01:00
status: 1

machine à boulonner
type: Concept
modified: 2015-08-10T16:01:41+02:00
in scheme: Thésaurus de la désignation des objets mobiliers
broader: machine à attacher
created: 2012-05-16T00:00:00+02:00
definition: Machine à attacher des produits à l'aide de vis et d'écrous.
status: 1

machine à riveter
type: Concept
modified: 2015-10-08T12:18:12+02:00
in scheme: Thésaurus de la désignation des objets mobiliers
broader: machine à attacher
alternative label: riveteuse
created: 2012-05-16T00:00:00+02:00
definition: Machine à attacher des produits à l'aide de rivets.
status: 1

machine à cheviller
type: Concept
modified: 2014-01-10T00:00:00+01:00
in scheme: Thésaurus de la désignation des objets mobiliers
broader: machine à attacher
created: 2012-05-16T00:00:00+02:00
definition: Machine à attacher des produits à l'aide de chevilles.
status: 1

machine à attacher
type: PreferredTerm
modified: 2015-10-08T11:48:53+02:00
created: 2014-01-15T14:54:24+01:00
status: 1

machine à visser
type: Concept
modified: 2015-10-08T12:25:32+02:00
in scheme: Thésaurus de la désignation des objets mobiliers
broader: machine à attacher
alternative label: visseuse
created: 2012-05-16T00:00:00+02:00
definition: Machine à attacher des produits à l'aide de vis.
status: 1

machine à clouer
type: Concept
modified: 2015-10-08T11:58:56+02:00
in scheme: Thésaurus de la désignation des objets mobiliers
broader: machine à attacher
created: 2012-05-16T00:00:00+02:00
definition: Machine à attacher des produits à l'aide de clous.
status: 1

machine à coudre industrielle
type: Concept
modified: 2015-10-08T12:03:17+02:00
in scheme: Thésaurus de la désignation des objets mobiliers
broader: machine à attacher
created: 2012-05-16T00:00:00+02:00
related: machine à coudre domestique
definition: Machine à attacher des produits par des points de couture réalisés à l'aide de deux fils noués par le jeu d'une aiguille.
TermeAssocie: machine à coudre domestique
status: 1

machine à agrafer
type: Concept
modified: 2015-08-10T15:57:48+02:00
in scheme: Thésaurus de la désignation des objets mobiliers
broader: machine à attacher
alternative label: agrafeuse
created: 2012-05-16T00:00:00+02:00
definition: Machine à attacher à l'aide d'agrafes.
status: 1

machine à enfiler
type: Concept
modified: 2014-01-10T00:00:00+01:00
in scheme: Thésaurus de la désignation des objets mobiliers
broader: machine à attacher
created: 2012-05-16T00:00:00+02:00
definition: Machine à attacher des produits en passant au travers un ou plusieurs fils.
status: 1

bassine à confit
type: PreferredTerm
modified: 2014-10-16T16:24:03+02:00
created: 2014-01-15T14:54:24+01:00
status: 1

moule à madeleine
type: SimpleNonPreferredTerm
modified: 2014-12-08T12:28:27+01:00
created: 2014-01-15T14:54:24+01:00
status: 1

moule à tarte
type: SimpleNonPreferredTerm
modified: 2014-12-08T12:28:27+01:00
created: 2014-01-15T14:54:24+01:00
status: 1

moule à charlotte
type: SimpleNonPreferredTerm
modified: 2014-12-08T12:28:27+01:00
created: 2014-01-15T14:54:24+01:00
status: 1

moule à gâteau de fête
type: SimpleNonPreferredTerm
modified: 2014-12-08T12:28:27+01:00
created: 2014-01-15T14:54:24+01:00
status: 1

moule à gâteau
type: PreferredTerm
modified: 2014-12-08T12:28:27+01:00
created: 2014-01-15T14:54:24+01:00
status: 1

moule à bordure
type: SimpleNonPreferredTerm
modified: 2014-12-08T12:28:27+01:00
created: 2014-01-15T14:54:24+01:00
status: 1

moule à kugelhoff
type: SimpleNonPreferredTerm
modified: 2014-12-08T12:28:27+01:00
created: 2014-01-15T14:54:24+01:00
status: 1

moule à dariole
type: SimpleNonPreferredTerm
modified: 2014-12-08T12:28:27+01:00
created: 2014-01-15T14:54:24+01:00
status: 1

moule à soufflé
type: SimpleNonPreferredTerm
modified: 2014-12-08T12:28:27+01:00
created: 2014-01-15T14:54:24+01:00
status: 1

plaque à tarte
type: SimpleNonPreferredTerm
modified: 2014-12-08T12:28:27+01:00
created: 2014-01-15T14:54:24+01:00
status: 1

moule à biscuits
type: SimpleNonPreferredTerm
modified: 2014-12-08T12:28:27+01:00
created: 2014-01-15T14:54:24+01:00
status: 1

moule à savarin
type: SimpleNonPreferredTerm
modified: 2014-12-08T12:28:27+01:00
created: 2014-01-15T14:54:24+01:00
status: 1

moule à pain d'épices
type: SimpleNonPreferredTerm
modified: 2014-12-08T12:28:27+01:00
created: 2014-01-15T14:54:24+01:00
status: 1

moule à cannelet
type: SimpleNonPreferredTerm
modified: 2014-12-08T12:28:27+01:00
created: 2014-01-15T14:54:24+01:00
status: 1

moule à pain d'anis
type: SimpleNonPreferredTerm
modified: 2014-12-08T12:28:27+01:00
created: 2014-01-15T14:54:24+01:00
status: 1

moule à massepain
type: SimpleNonPreferredTerm
modified: 2014-12-08T12:28:27+01:00
created: 2014-01-15T14:54:24+01:00
status: 1

protection d'animal
type: Concept
modified: 2014-10-09T11:22:16+02:00
in scheme: Thésaurus de la désignation des objets mobiliers
broader: arme défensive
alternative label: armure équestre
created: 2013-11-13T00:00:00+01:00
related: harnachement ou attelage
definition: Pièce ou ensemble des pièces, généralement métalliques, qui protègent le corps de la monture du combattant.
TermeAssocie: harnachement ou attelage
status: 1
narrow match: http://vocab.getty.edu/aat/300036900
broad match: cb12266187n

protection d'animal
type: PreferredTerm
modified: 2014-10-09T11:22:16+02:00
created: 2014-01-15T14:54:24+01:00
status: 1

armure équestre
type: SimpleNonPreferredTerm
modified: 2014-10-09T11:22:16+02:00
created: 2014-01-15T14:54:24+01:00
status: 1

buffet à confitures
type: PreferredTerm
modified: 2014-12-04T15:35:54+01:00
created: 2014-01-15T14:54:24+01:00
status: 1

pendeloques
type: Concept
modified: 2014-12-05T14:34:12+01:00
in scheme: Thésaurus de la désignation des objets mobiliers
preferred label: lusters (lighting device components) @en-us
broader: instrument ou accessoire pour l'éclairage
alternative label: girandoles
created: 2012-05-16T00:00:00+02:00
related: bras de lumière
related: luminaire d'applique
related: lustre
definition: Épaisses plaques de verre, de cristal ou de métal, découpées et taillées à facettes, suspendues aux girandoles, lustres et bras de lumière pour les décorer tout en diffusant leur lumière.
TermeAssocie: bras de lumière
TermeAssocie: luminaire d'applique
TermeAssocie: lustre
status: 1

pendeloques
type: PreferredTerm
modified: 2014-12-05T14:34:12+01:00
created: 2014-01-15T14:54:24+01:00
status: 1

bras de lumière
type: Concept
modified: 2014-12-04T11:52:25+01:00
in scheme: Thésaurus de la désignation des objets mobiliers
preferred label: sconces @en-us
broader: luminaire d'applique
alternative label: applique de lumière
alternative label: candélabre d'applique
alternative label: flambeau d'applique
alternative label: bras de lumière-girandole
alternative label: chandelier d'applique
alternative label: bras de cheminée
created: 2012-05-16T00:00:00+02:00
related: luminaire d'applique d'église
related: pendeloques
related: T69-1043
definition: Support pour une ou plusieurs bougies constitué par une plaque ou un motif d'applique auxquels sont fixés une ou plusieurs branches terminées chacune par une broche ou un binet ; le bras de lumière, en forme de buste ou de bras humain, est appliqué contre un mur, un meuble, une glace, une cheminée ou des lambris. Lorsqu’ils sont fixés sur un meuble, ils se présentent sous forme d’une ou plusieurs branches.
TermeAssocie: luminaire d'applique d'église
TermeAssocie: pendeloques
TermeAssocie: T69-1043
status: 1
broad match: Applique murale

girandoles
type: SimpleNonPreferredTerm
modified: 2014-12-05T14:34:12+01:00
created: 2014-01-15T14:54:24+01:00
status: 1

luminaire d'applique
type: Concept
modified: 2014-12-04T11:49:42+01:00
in scheme: Thésaurus de la désignation des objets mobiliers
preferred label: wall lamps @en-us
narrower: bras de lumière
broader: luminaire
created: 2012-05-16T00:00:00+02:00
related: luminaire d'applique d'église
related: pendeloques
related: chandelier
related: lanterne
definition: Luminaire attaché au mur par suspension ou fichage. Il peut comporter une ou plusieurs branches (demi-girandoles), à une ou plusieurs sources lumineuses. Il peut être à bois résineux, à chandelles(s) ou à bougie(s), à huile, à pétrole, à gaz ou électrique.
TermeAssocie: luminaire d'applique d'église
TermeAssocie: pendeloques
TermeAssocie: chandelier
TermeAssocie: lanterne
status: 1

lustre
type: Concept
modified: 2014-12-04T12:00:21+01:00
in scheme: Thésaurus de la désignation des objets mobiliers
preferred label: chandeliers (hanging lights) @en-us
broader: luminaire
created: 2012-05-16T00:00:00+02:00
related: lustre d'église
related: lustre de synagogue
related: pendeloques
related: chandelier
related: couronne de lumières
definition: Luminaire suspendu au plafond et comportant plusieurs sources lumineuses. Le lustre peut être en forme d'anneau (couronne de lumières) ou de roue, avec des rayons. Il peut être à bougies, à huile, à pétrole, à gaz ou électrique.
TermeAssocie: lustre d'église
TermeAssocie: lustre de synagogue
TermeAssocie: pendeloques
TermeAssocie: chandelier
TermeAssocie: couronne de lumières
status: 1

épinette des Vosges
type: PreferredTerm
modified: 2014-10-10T13:10:01+02:00
created: 2014-01-15T14:54:24+01:00
status: 1

assiette de mariage
type: Concept
modified: 2014-01-10T00:00:00+01:00
in scheme: Thésaurus de la désignation des objets mobiliers
broader: objet lié au mariage
created: 2012-05-16T00:00:00+02:00
definition: Assiette souvent richement décorée offerte lors d'un mariage.
status: 1

assiette de mariage
type: PreferredTerm
modified: 2014-01-10T00:00:00+01:00
created: 2014-01-15T14:54:24+01:00
status: 1

longue-vue
type: Concept
modified: 2014-12-15T13:53:10+01:00
in scheme: Thésaurus de la désignation des objets mobiliers
broader: lunette optique
alternative label: lunette marine
alternative label: jumelles
alternative label: lunette terrestre
alternative label: périscope
created: 2012-05-16T00:00:00+02:00
definition: Lunette d'approche destinée à l'observation terrestre ou marine et qui fournit des images redressée. La longue-vue se compose d'un objectif, d'un oculaire, constitués l'un et l'autre par un système de lentilles, et d'un système optique permettant de redresser l'image.
status: 1
broad match: cb11936397z

jumelles
type: SimpleNonPreferredTerm
modified: 2014-12-15T13:53:10+01:00
created: 2014-01-15T14:54:24+01:00
status: 1

lunette terrestre
type: SimpleNonPreferredTerm
modified: 2014-12-15T13:53:10+01:00
created: 2014-01-15T14:54:24+01:00
status: 1

longue-vue
type: PreferredTerm
modified: 2014-12-15T13:53:10+01:00
created: 2014-01-15T14:54:24+01:00
status: 1

périscope
type: SimpleNonPreferredTerm
modified: 2014-12-15T13:53:10+01:00
created: 2014-01-15T14:54:24+01:00
status: 1

lunette marine
type: SimpleNonPreferredTerm
modified: 2014-12-15T13:53:10+01:00
created: 2014-01-15T14:54:24+01:00
status: 1

réserve à huile sainte
type: SimpleNonPreferredTerm
modified: 2014-12-01T10:51:45+01:00
created: 2014-01-15T14:54:24+01:00
status: 1

réserve à huile des catéchumènes
type: PreferredTerm
modified: 2014-12-01T10:51:45+01:00
created: 2014-01-15T14:54:24+01:00
status: 1

pot à plantes
type: Concept
modified: 2014-12-05T15:29:00+01:00
in scheme: Thésaurus de la désignation des objets mobiliers
preferred label: flowerpots @en-us
broader: objet décoratif ou de rangement ou pour les plantes et les fleurs
alternative label: pot de culture
alternative label: fraisière
alternative label: caisse à plantes d'intérieur
alternative label: persillère
created: 2012-05-16T00:00:00+02:00
related: caisse à plantes
definition: Récipient à fond plat et généralement sans anses, dans lequel on cultive une plante. Il comporte un ou plusieurs trous d'aération dans le fond et comprendre un plateau assorti. Il peut être garni d'une doublure intérieure en zinc ou en fer comportant des trous d'aération au fond.
TermeAssocie: caisse à plantes
status: 1

caisse à plantes
type: Concept
modified: 2014-10-15T16:01:55+02:00
in scheme: Thésaurus de la désignation des objets mobiliers
preferred label: planters (containers) @en-us
broader: édicule et mobilier de jardin
alternative label: caisse à oranger
created: 2012-05-16T00:00:00+02:00
related: pot à plantes
definition: Caisse en bois à quatre pieds, plus ou moins hauts, servant à faire pousser des plantes en extérieur.
TermeAssocie: pot à plantes
status: 1

pot de culture
type: SimpleNonPreferredTerm
modified: 2014-12-05T15:29:00+01:00
created: 2014-01-15T14:54:24+01:00
status: 1

pot à plantes
type: PreferredTerm
modified: 2014-12-05T15:29:00+01:00
created: 2014-01-15T14:54:24+01:00
status: 1

caisse à plantes d'intérieur
type: SimpleNonPreferredTerm
modified: 2014-12-05T15:29:00+01:00
created: 2014-01-15T14:54:24+01:00
status: 1

fraisière
type: SimpleNonPreferredTerm
modified: 2014-12-05T15:29:00+01:00
created: 2014-01-15T14:54:24+01:00
status: 1

persillère
type: SimpleNonPreferredTerm
modified: 2014-12-05T15:29:00+01:00
created: 2014-01-15T14:54:24+01:00
status: 1

corne de bélier
type: SimpleNonPreferredTerm
modified: 2014-10-10T12:19:38+02:00
created: 2014-01-15T14:54:24+01:00
status: 1

shofar
type: SimpleNonPreferredTerm
modified: 2014-10-10T12:19:38+02:00
created: 2014-01-15T14:54:24+01:00
status: 1

corne d'appel judaïque
type: PreferredTerm
modified: 2014-10-10T12:19:38+02:00
created: 2014-01-15T14:54:24+01:00
status: 1

repousse-braises
type: Concept
modified: 2014-10-16T14:11:33+02:00
in scheme: Thésaurus de la désignation des objets mobiliers
preferred label: fenders (fire-controlling equipment) @en-us
broader: objet d'âtre
alternative label: repousse-cendres
alternative label: resserre-braises
alternative label: garde-cendres
created: 2012-05-16T00:00:00+02:00
definition: Cadre métallique posé devant les chenets pour empêcher les cendres de s'éparpiller.
status: 1
broad match: cb11931172v

garde-cendres
type: SimpleNonPreferredTerm
modified: 2014-10-16T14:11:33+02:00
created: 2014-01-15T14:54:24+01:00
status: 1

repousse-braises
type: PreferredTerm
modified: 2014-10-16T14:11:33+02:00
created: 2014-01-15T14:54:24+01:00
status: 1

repousse-cendres
type: SimpleNonPreferredTerm
modified: 2014-10-16T14:11:33+02:00
created: 2014-01-15T14:54:24+01:00
status: 1

resserre-braises
type: SimpleNonPreferredTerm
modified: 2014-10-16T14:11:33+02:00
created: 2014-01-15T14:54:24+01:00
status: 1

agenouilloir
type: Concept
modified: 2014-12-02T14:24:14+01:00
in scheme: Thésaurus de la désignation des objets mobiliers
preferred label: kneelers (furniture) @en-us
preferred label: inginocchiatoio (sgabello) @it
preferred label: banco genuflexório @pt
broader: siège et agenouilloir d'église du culte catholique
created: 2012-05-16T00:00:00+02:00
related: agenouilloir de communion
definition: Petit meuble en forme de banc ou de tabouret bas servant à s’agenouiller. Il peut être isolé, faire partie d'un banc de fidèle ou d'un prie-Dieu ; il est alors associé à un accoudoir ou à un pupitre.
TermeAssocie: agenouilloir de communion
status: 1
broad match: http://data.bnf.fr/ark:/12148/cb131627054

agenouilloir
type: PreferredTerm
modified: 2014-12-02T14:24:14+01:00
created: 2014-01-15T14:54:24+01:00
status: 1

agenouilloir de communion
type: Concept
modified: 2014-12-01T16:24:22+01:00
in scheme: Thésaurus de la désignation des objets mobiliers
preferred label: communion kneelers @en-us
preferred label: inginocchiatoio da comunione @it
preferred label: genuflexório de comunhão @pt
broader: meuble lié à l'Eucharistie
alternative label: banc de communion
created: 2012-05-16T00:00:00+02:00
related: agenouilloir
definition: Meuble en forme d'agenouilloir associé à un accoudoir, servant à s'agenouiller pour recevoir la communion en l'absence d'une table de communion portée par une clôture d'autel, une clôture de chapelle ou une clôture de chœur.
TermeAssocie: agenouilloir
status: 1
broad match: http://vocab.getty.edu/aat/300137869

métier à châssis
type: SimpleNonPreferredTerm
modified: 2014-12-10T14:32:40+01:00
created: 2014-01-15T14:54:24+01:00
status: 1

poinçon de brodeuse
type: SimpleNonPreferredTerm
modified: 2014-12-10T14:32:40+01:00
created: 2014-01-15T14:54:24+01:00
status: 1

poinçon à broder
type: SimpleNonPreferredTerm
modified: 2014-12-10T14:32:40+01:00
created: 2014-01-15T14:54:24+01:00
status: 1

métier à broder sur pieds
type: SimpleNonPreferredTerm
modified: 2014-12-10T14:32:40+01:00
created: 2014-01-15T14:54:24+01:00
status: 1

métier à tambour
type: SimpleNonPreferredTerm
modified: 2014-12-10T14:32:40+01:00
created: 2014-01-15T14:54:24+01:00
status: 1

métier à broder domestique
type: PreferredTerm
modified: 2014-12-10T14:32:40+01:00
created: 2014-01-15T14:54:24+01:00
status: 1

tambour à broder
type: SimpleNonPreferredTerm
modified: 2014-12-10T14:32:40+01:00
created: 2014-01-15T14:54:24+01:00
status: 1

métier à broder à poser
type: SimpleNonPreferredTerm
modified: 2014-12-10T14:32:40+01:00
created: 2014-01-15T14:54:24+01:00
status: 1

métier à broder les gants
type: SimpleNonPreferredTerm
modified: 2014-12-10T14:32:40+01:00
created: 2014-01-15T14:54:24+01:00
status: 1

bain d'œil
type: SimpleNonPreferredTerm
modified: 2015-03-09T10:52:28+01:00
created: 2014-01-15T14:54:24+01:00
status: 1

œillère
type: SimpleNonPreferredTerm
modified: 2015-03-09T10:52:28+01:00
created: 2014-01-15T14:54:24+01:00
status: 1

bateau chaland à clapets
type: Concept
modified: 2014-10-16T09:57:48+02:00
in scheme: Thésaurus de la désignation des objets mobiliers
preferred label: hopper barges @en-us
broader: bateau de génie civil
alternative label: marie-salope
created: 2012-05-16T00:00:00+02:00
definition: Bateau dont le fond s'ouvre pour libérer les produits de dragage ou de curage qu'il transporte.
status: 1
narrow match: Marie-salope
broad match: cb11953087h

marie-salope
type: SimpleNonPreferredTerm
modified: 2014-10-16T09:57:48+02:00
created: 2014-01-15T14:54:24+01:00
status: 1

bateau chaland à clapets
type: PreferredTerm
modified: 2014-10-16T09:57:48+02:00
created: 2014-01-15T14:54:24+01:00
status: 1

proskynétaire
type: PreferredTerm
modified: 2014-01-10T00:00:00+01:00
created: 2014-01-15T14:54:24+01:00
status: 1

racloir
type: Concept
modified: 2014-09-05T14:48:21+02:00
in scheme: Thésaurus de la désignation des objets mobiliers
preferred label: scrapers (idiophones) @en-us
broader: idiophone à émission par raclement
alternative label: racleur
alternative label: racle
created: 2012-05-16T00:00:00+02:00
definition: Instrument constitué d'une planche de bois entaillée. On racle la surface rugueuse à l'aide d'un petit bâton de bois. Il peut tenir lieu d'instrument pour les offices des Ténèbres.
status: 1

racleur
type: SimpleNonPreferredTerm
modified: 2014-09-05T14:48:21+02:00
created: 2014-01-15T14:54:24+01:00
status: 1

racloir
type: PreferredTerm
modified: 2014-09-05T14:48:21+02:00
created: 2014-01-15T14:54:24+01:00
status: 1

racle
type: SimpleNonPreferredTerm
modified: 2014-09-05T14:48:21+02:00
created: 2014-01-15T14:54:24+01:00
status: 1

idiophone à émission par raclement
type: Concept
modified: 2014-10-10T14:33:12+02:00
in scheme: Thésaurus de la désignation des objets mobiliers
preferred label: scraped idiophones @en-us
narrower: racloir
narrower: T69-4988
broader: idiophone
created: 2013-12-19T00:00:00+01:00
definition: Idiophone produisant un son lorsqu’il est gratté avec un objet dur.
status: 1
narrow match: http://vocab.getty.edu/aat/300041650
broad match: Idiophone

chaire à prêcher
type: Concept
modified: 2014-12-01T17:26:43+01:00
in scheme: Thésaurus de la désignation des objets mobiliers
preferred label: pulpits @en-us
preferred label: pulpito @it
preferred label: púlpito @pt
broader: T69-717
created: 2012-05-16T00:00:00+02:00
related: clôture de chaire à prêcher
related: T69-2287
definition: Tribune enclose par un garde-corps et destinée aux clercs pour la prédication. Elle est généralement située à l'intérieur d'une église et peut être fixe ou mobile. Elle comporte souvent un dorsal, un abat-voix et un escalier. Elle peut être recouverte d'un décor de tissu (parement de chaire à prêcher) et entourée d'une clôture.
TermeAssocie: clôture de chaire à prêcher
TermeAssocie: T69-2287
status: 1

clôture de chaire à prêcher
type: PreferredTerm
modified: 2014-12-01T14:31:45+01:00
created: 2014-01-15T14:54:24+01:00
status: 1

broc
type: Concept
modified: 2014-12-08T13:15:28+01:00
in scheme: Thésaurus de la désignation des objets mobiliers
narrower: pichet
broader: récipient pour le service et la consommation des boissons
alternative label: cimarre
alternative label: broc à vin
alternative label: broc à cidre
alternative label: broc à bec ponté
created: 2012-05-16T00:00:00+02:00
related: porte-couteau
related: canne à lait
definition: Récipient à anse, le plus souvent en métal ou en céramique, avec un bec évasé, utilisé pour transvaser et servir principalement du vin ou du cidre. Le couvercle, lorsqu'il existe, est généralement plat et à poucier. Le broc n’est jamais en verre, ce qui le différencie de la carafe.
TermeAssocie: porte-couteau
TermeAssocie: canne à lait
status: 1
narrow match: cb15880735g

cimarre
type: SimpleNonPreferredTerm
modified: 2014-12-08T13:15:28+01:00
created: 2014-01-15T14:54:24+01:00
status: 1

pichet
type: Concept
modified: 2014-12-08T13:18:48+01:00
in scheme: Thésaurus de la désignation des objets mobiliers
preferred label: pitchers (vessels) @en-us
broader: broc
alternative label: pot Jacqueline
alternative label: pichet zoomorphe
alternative label: pichet anthropomorphe
alternative label: bouteille à goutte
alternative label: pot à vin
created: 2012-05-16T00:00:00+02:00
definition: Petit broc en métal, bois, céramique ou verre, servant de mesure. Le pichet est à fond plat ou sur pied bas, muni d'un bec et d'une anse latérale verticale et souvent d'un couvercle à poucier. Les pichets correspondent à des capacités précises, parfois indiquées par une inscription, une marque de niveau ou un élément de structure. Ils sont quelquefois anthropomorphes ou zoomorphes et constituent souvent des séries de dimensions décroissantes.
status: 1

broc
type: PreferredTerm
modified: 2014-12-08T13:15:28+01:00
created: 2014-01-15T14:54:24+01:00
status: 1

broc à bec ponté
type: SimpleNonPreferredTerm
modified: 2014-12-08T13:15:28+01:00
created: 2014-01-15T14:54:24+01:00
status: 1

broc à vin
type: SimpleNonPreferredTerm
modified: 2014-12-08T13:15:28+01:00
created: 2014-01-15T14:54:24+01:00
status: 1

canne à lait
type: Concept
modified: 2014-12-08T11:45:46+01:00
in scheme: Thésaurus de la désignation des objets mobiliers
broader: récipient pour la conservation des aliments ou des boissons
created: 2012-05-16T00:00:00+02:00
related: broc
definition: Grand récipient en cuivre, en forme de broc ou de bonbonne, utilisé pour porter le lait sur la tête, à la main ou à bât.
TermeAssocie: broc
status: 1
broad match: http://vocab.getty.edu/aat/300198762
broad match: Récipient

broc à cidre
type: SimpleNonPreferredTerm
modified: 2014-12-08T13:15:28+01:00
created: 2014-01-15T14:54:24+01:00
status: 1

montre
type: Concept
modified: 2014-12-10T14:13:30+01:00
in scheme: Thésaurus de la désignation des objets mobiliers
preferred label: watches @en-us
broader: horloge
created: 2012-05-16T00:00:00+02:00
definition: Horloge à cadran de très petite dimension qui peut fonctionner dans toutes les positions et que l'on porte sur soi. Il peut s'agir d'une montre-bracelet, d'une montre de gousset, d'une montre chronomètre, etc.
status: 1

montre
type: PreferredTerm
modified: 2014-12-10T14:13:30+01:00
created: 2014-01-15T14:54:24+01:00
status: 1

machine à répartir
type: Concept
modified: 2014-01-10T00:00:00+01:00
in scheme: Thésaurus de la désignation des objets mobiliers
broader: machine à organiser
alternative label: répartiteur
created: 2012-05-16T00:00:00+02:00
definition: Machine à doser servant à délivrer un matériau ou un produit en couches uniformes.
status: 1

machine à répartir
type: PreferredTerm
modified: 2014-01-10T00:00:00+01:00
created: 2014-01-15T14:54:24+01:00
status: 1

répartiteur
type: SimpleNonPreferredTerm
modified: 2014-01-10T00:00:00+01:00
created: 2014-01-15T14:54:24+01:00
status: 1

meuble-foyer
type: Concept
modified: 2014-10-13T13:22:24+02:00
in scheme: Thésaurus de la désignation des objets mobiliers
broader: meuble pour le feu ou le réchauffage
created: 2012-05-16T00:00:00+02:00
definition: Meuble servant à faire du feu avec des bûches et constitué d'une caisse de dimensions variables, montée sur pieds courts, remplie d'une couche d'argile et de dalles de schiste.
status: 1
broad match: cb13337214n
broad match: http://vocab.getty.edu/aat/300200422

meuble-foyer
type: PreferredTerm
modified: 2014-10-13T13:22:24+02:00
created: 2014-01-15T14:54:24+01:00
status: 1

bassin à ablutions
type: Concept
modified: 2014-11-27T11:19:05+01:00
in scheme: Thésaurus de la désignation des objets mobiliers
preferred label: ablution basins @en-us
preferred label: bacile per abluzioni @it
preferred label: bacia de abluções @pt
broader: objet lié à l'ablution, à l'aspersion et à l'encensement
alternative label: bassin d'évêque
created: 2012-05-16T00:00:00+02:00
related: chapelle de messe
related: bassin de table
definition: Récipient creux permettant de recueillir l'eau des ablutions des messes pontificales et celle utilisée par les célébrants lors de diverses cérémonies liturgiques (Cendres, Rameaux, lavement des pieds le Jeudi saint, baptême). Il s'accompagne toujours d'une aiguière à ablutions et présente en son centre un ombilic destiné à assurer la stabilité de cette dernière.
TermeAssocie: chapelle de messe
TermeAssocie: bassin de table
status: 1
broad match: http://data.bnf.fr/ark:/12148/cb119378560

bassin de table
type: PreferredTerm
modified: 2014-10-16T15:04:59+02:00
created: 2014-01-15T14:54:24+01:00
status: 1

vase de pharmacie
type: SimpleNonPreferredTerm
modified: 2014-01-10T00:00:00+01:00
created: 2014-01-15T14:54:24+01:00
status: 1

pot de monstre
type: SimpleNonPreferredTerm
modified: 2014-01-10T00:00:00+01:00
created: 2014-01-15T14:54:24+01:00
status: 1

pot-canon
type: SimpleNonPreferredTerm
modified: 2014-01-10T00:00:00+01:00
created: 2014-01-15T14:54:24+01:00
status: 1

pilulier
type: SimpleNonPreferredTerm
modified: 2014-01-10T00:00:00+01:00
created: 2014-01-15T14:54:24+01:00
status: 1

pot à onguent
type: SimpleNonPreferredTerm
modified: 2014-01-10T00:00:00+01:00
created: 2014-01-15T14:54:24+01:00
status: 1

pot à pharmacie
type: PreferredTerm
modified: 2014-01-10T00:00:00+01:00
created: 2014-01-15T14:54:24+01:00
status: 1

bouteille de pharmacie
type: SimpleNonPreferredTerm
modified: 2014-01-10T00:00:00+01:00
created: 2014-01-15T14:54:24+01:00
status: 1

albarello
type: SimpleNonPreferredTerm
modified: 2014-01-10T00:00:00+01:00
created: 2014-01-15T14:54:24+01:00
status: 1

chevrette
type: SimpleNonPreferredTerm
modified: 2014-01-10T00:00:00+01:00
created: 2014-01-15T14:54:24+01:00
status: 1

pot à thériaque
type: SimpleNonPreferredTerm
modified: 2014-01-10T00:00:00+01:00
created: 2014-01-15T14:54:24+01:00
status: 1

boîte à pharmacie
type: SimpleNonPreferredTerm
modified: 2014-01-10T00:00:00+01:00
created: 2014-01-15T14:54:24+01:00
status: 1

table à jeu
type: Concept
modified: 2014-12-05T14:01:26+01:00
in scheme: Thésaurus de la désignation des objets mobiliers
preferred label: gaming tables @en-us
broader: table pour le bureau ou les loisirs
alternative label: table à plusieurs jeux
created: 2012-05-16T00:00:00+02:00
related: bougeoir
related: chandelier
definition: Table servant à jouer à un jeu de société. Sa fonction spécifique se distingue par la forme du plateau (comprenant parfois plusieurs positions modifiant ses dimensions), par le motif qui y est représenté ou par les accessoires qu'elle comporte (pour placer les bougies, les flambeaux, les cartes, les bourses, etc.). Elle peut être pliante et/ou démontable et le plateau couvert de velours ou de lin.
TermeAssocie: bougeoir
TermeAssocie: chandelier
status: 1

bougeoir
type: Concept
modified: 2014-12-05T14:19:11+01:00
in scheme: Thésaurus de la désignation des objets mobiliers
preferred label: candlesticks @en-us
broader: instrument ou accessoire pour l'éclairage
alternative label: bougeoir de paravent
alternative label: bougeoir porte-éteignoir
alternative label: bougeoir de table à jeu
alternative label: bougeoir de cave
alternative label: bougeoir à binet coulissant
alternative label: bougeoir porte-mouchettes
alternative label: bougeoir à manche réserve
alternative label: bougeoir à cardan
alternative label: bougeoir à ressort
alternative label: bougeoir double de voyage
alternative label: bougeoir pyrogène
created: 2012-05-16T00:00:00+02:00
related: table à jeu
related: bougeoir pontifical
definition: Support pour une seule bougie, constitué par une broche ou un binet fixés sur une plaque ou sur un petit plateau, et généralement muni d'un élément de prise latéral permettant de le transporter ou de le ficher.
TermeAssocie: table à jeu
TermeAssocie: bougeoir pontifical
status: 1

chandelier
type: Concept
modified: 2014-12-05T14:22:42+01:00
in scheme: Thésaurus de la désignation des objets mobiliers
preferred label: candleholders @en-us
broader: instrument ou accessoire pour l'éclairage
alternative label: flambeau en faisceau
alternative label: chandelier à tige hélicoïdale
alternative label: torchère
alternative label: chandelier à crémaillère
alternative label: candélabre porte-mouchettes
alternative label: chandelier à ressort
alternative label: chandelier à éteignoir automatique
alternative label: flambeau de table
alternative label: chandelier à binet coulissant
alternative label: girandole
alternative label: candélabre de jeu
alternative label: flambeau
alternative label: flambeau porte-mouchettes
alternative label: flambeau de jardin
alternative label: chandelier à broches
alternative label: chandelier de cave
alternative label: candélabre
alternative label: chandelier à branches
alternative label: chandelier à douille
alternative label: chandelier brûle-bout
created: 2012-05-16T00:00:00+02:00
related: porte-luminaire
related: luminaire d'applique
related: lustre
related: table à jeu
definition: Support sur lequel on pique ou dans lequel on encastre une ou plusieurs bougies. Il est constitué d’une tige portée par un ou plusieurs pieds et terminée par une broche ou un binet parfois complété par une bobèche fixe ou amovible. Il peut être complété par un écran de lumière, un réflecteur ou un abat-jour mobiles. Le flambeau est un chandelier pour une seule bougie. Le candélabre est un chandelier à plusieurs branches partant de la tige central. La girandole est un candélabre comportant des guirlandes et des pendeloques en verre.
TermeAssocie: porte-luminaire
TermeAssocie: luminaire d'applique
TermeAssocie: lustre
TermeAssocie: table à jeu
status: 1

table à plusieurs jeux
type: SimpleNonPreferredTerm
modified: 2014-12-05T14:01:26+01:00
created: 2014-01-15T14:54:24+01:00
status: 1

table à jeu
type: PreferredTerm
modified: 2014-12-05T14:01:26+01:00
created: 2014-01-15T14:54:24+01:00
status: 1

prie-Dieu brisé
type: Concept
modified: 2014-12-02T14:45:50+01:00
in scheme: Thésaurus de la désignation des objets mobiliers
preferred label: raisable prie-dieus @en-us
preferred label: sedia-inginocchiatoio a ribalta @it
preferred label: cadeira com genuflexório @pt
broader: chaise d'église
alternative label: prie-Dieu siège
created: 2012-05-16T00:00:00+02:00
definition: Chaise dont le siège se soulève pour dégager un agenouilloir et dont le dossier comporte un accoudoir.
status: 1

prie-Dieu brisé
type: PreferredTerm
modified: 2014-12-02T14:45:50+01:00
created: 2014-01-15T14:54:24+01:00
status: 1

chaise d'église
type: Concept
modified: 2014-12-02T14:37:40+01:00
in scheme: Thésaurus de la désignation des objets mobiliers
preferred label: sedia da chiesa @it
preferred label: church chairs @en-us
preferred label: cadeira de igreja @pt
narrower: prie-Dieu brisé
narrower: chaise à prie-Dieu
narrower: chaise prie-Dieu
broader: siège et agenouilloir d'église du culte catholique
alternative label: chaise de fidèle
created: 2012-05-16T00:00:00+02:00
definition: Chaise de fidèle placée à l'extérieur du sanctuaire, en bois, généralement paillée, présentant souvent un accoudoir et un décor religieux et parfois reliée à d'autres pour former un rang.
status: 1
broad match: http://vocab.getty.edu/aat/300037772

prie-Dieu siège
type: SimpleNonPreferredTerm
modified: 2014-12-02T14:45:50+01:00
created: 2014-01-15T14:54:24+01:00
status: 1

trompe
type: Concept
modified: 2014-10-10T12:21:23+02:00
in scheme: Thésaurus de la désignation des objets mobiliers
broader: trompette naturelle
alternative label: trompe d'appel
created: 2012-05-16T00:00:00+02:00
definition: Instrument en terre cuite ou en faïence imitant une corne ou un oliphant. Il est plutôt destiné à l'appel qu'à la musique proprement dite.
status: 1
broad match: http://data.bnf.fr/ark:/12148/cb16687219b

trompe d'appel
type: SimpleNonPreferredTerm
modified: 2014-10-10T12:21:23+02:00
created: 2014-01-15T14:54:24+01:00
status: 1

trompe
type: PreferredTerm
modified: 2014-10-10T12:21:23+02:00
created: 2014-01-15T14:54:24+01:00
status: 1

encensoir
type: PreferredTerm
modified: 2014-11-27T11:31:49+01:00
created: 2014-01-15T14:54:24+01:00
status: 1

encensoir orthodoxe
type: Concept
modified: 2014-01-10T00:00:00+01:00
in scheme: Thésaurus de la désignation des objets mobiliers
broader: objet du culte orthodoxe
alternative label: chazion
alternative label: encensoir à main
created: 2012-05-16T00:00:00+02:00
related: encensoir
definition: Encensoir de même structure et usage que les encensoirs du culte catholique, mais avec des chaînes plus courtes. Dans le rite grec, les encensoirs comportent soit douze grelots accrochés trois par trois aux quatre chaînes, symboles des douze apôtres, soit une anse latérale.
TermeAssocie: encensoir
status: 1

objet lié aux cycles de la vie
type: Concept
modified: 2014-01-10T00:00:00+01:00
in scheme: Thésaurus de la désignation des objets mobiliers
narrower: objet lié au mariage
narrower: objet lié à la naissance et à la circoncision
narrower: T69-2061
broader: objet lié au culte domestique
created: 2012-05-16T00:00:00+02:00
status: 1

objet lié au mariage
type: PreferredTerm
modified: 2014-01-10T00:00:00+01:00
created: 2014-01-15T14:54:24+01:00
status: 1

gilet de sauvetage
type: SimpleNonPreferredTerm
modified: 2014-12-19T16:41:07+01:00
created: 2014-01-15T14:54:24+01:00
status: 1

brassière de sauvetage
type: SimpleNonPreferredTerm
modified: 2014-12-19T16:41:07+01:00
created: 2014-01-15T14:54:24+01:00
status: 1

équipement de survie maritime
type: PreferredTerm
modified: 2014-12-19T16:41:07+01:00
created: 2014-01-15T14:54:24+01:00
status: 1

bateau de survie
type: SimpleNonPreferredTerm
modified: 2014-12-19T16:41:07+01:00
created: 2014-01-15T14:54:24+01:00
status: 1

bouée de sauvetage
type: SimpleNonPreferredTerm
modified: 2014-12-19T16:41:07+01:00
created: 2014-01-15T14:54:24+01:00
status: 1

boîte de croix
type: Concept
modified: 2014-11-26T12:28:40+01:00
in scheme: Thésaurus de la désignation des objets mobiliers
preferred label: custodia di croce @it
preferred label: cross boxes @en-us
preferred label: estojo de cruz @pt
broader: boîte et coffret pour le rangement des objets liturgiques
alternative label: écrin de croix
alternative label: boîte à croix
alternative label: étui de croix
created: 2012-05-16T00:00:00+02:00
related: croix
definition: Coffret dans lequel est conservée une croix.
TermeAssocie: croix
status: 1
broad match: http://vocab.getty.edu/aat/300235443

étui de croix
type: SimpleNonPreferredTerm
modified: 2014-11-26T12:28:40+01:00
created: 2014-01-15T14:54:24+01:00
status: 1

boîte de croix
type: PreferredTerm
modified: 2014-11-26T12:28:40+01:00
created: 2014-01-15T14:54:24+01:00
status: 1

écrin de croix
type: SimpleNonPreferredTerm
modified: 2014-11-26T12:28:40+01:00
created: 2014-01-15T14:54:24+01:00
status: 1

boîte à croix
type: SimpleNonPreferredTerm
modified: 2014-11-26T12:28:40+01:00
created: 2014-01-15T14:54:24+01:00
status: 1

cale-pot
type: SimpleNonPreferredTerm
modified: 2014-12-05T15:02:35+01:00
created: 2014-01-15T14:54:24+01:00
status: 1

accote-pot
type: SimpleNonPreferredTerm
modified: 2014-12-05T15:02:35+01:00
created: 2014-01-15T14:54:24+01:00
status: 1

trépied cale-pot
type: SimpleNonPreferredTerm
modified: 2014-12-05T15:02:35+01:00
created: 2014-01-15T14:54:24+01:00
status: 1

trépied
type: PreferredTerm
modified: 2014-12-05T15:02:35+01:00
created: 2014-01-15T14:54:24+01:00
status: 1

appuie-pot
type: SimpleNonPreferredTerm
modified: 2014-12-05T15:02:35+01:00
created: 2014-01-15T14:54:24+01:00
status: 1

galetière
type: SimpleNonPreferredTerm
modified: 2014-12-08T12:33:35+01:00
created: 2014-01-15T14:54:24+01:00
status: 1

plaque à galettes
type: SimpleNonPreferredTerm
modified: 2014-12-08T12:33:35+01:00
created: 2014-01-15T14:54:24+01:00
status: 1

poêle à galettes
type: PreferredTerm
modified: 2014-12-08T12:33:35+01:00
created: 2014-01-15T14:54:24+01:00
status: 1

enclume
type: Concept
modified: 2014-01-10T00:00:00+01:00
in scheme: Thésaurus de la désignation des objets mobiliers
broader: outil
alternative label: bigorne
created: 2013-12-16T00:00:00+01:00
status: 1

bigorne
type: SimpleNonPreferredTerm
modified: 2014-01-10T00:00:00+01:00
created: 2014-01-15T14:54:24+01:00
status: 1

enclume
type: PreferredTerm
modified: 2014-01-10T00:00:00+01:00
created: 2014-01-15T14:54:24+01:00
status: 1

porte-instruments d'âtre
type: Concept
modified: 2014-12-05T14:49:58+01:00
in scheme: Thésaurus de la désignation des objets mobiliers
preferred label: firesets @en-us
broader: objet d'âtre
created: 2012-05-16T00:00:00+02:00
definition: Support des objets d'âtre qui leur est généralement assorti.
status: 1
broad match: cb11931172v

porte-instruments d'âtre
type: PreferredTerm
modified: 2014-12-05T14:49:58+01:00
created: 2014-01-15T14:54:24+01:00
status: 1

banc d'exèdre
type: Concept
modified: 2014-12-02T14:25:46+01:00
in scheme: Thésaurus de la désignation des objets mobiliers
preferred label: sedile d'esedra @it
preferred label: exedra benches @en-us
preferred label: banco de êxedra @pt
broader: siège et agenouilloir d'église du culte catholique
alternative label: banc presbytéral
created: 2012-05-16T00:00:00+02:00
related: T69-1094
definition: Banc réservé aux clercs, en pierre, parfois en bois, allant souvent par paire et accolé au mur de l'abside dont il épouse la forme. Encadrant le trône épiscopal, les bancs d'exèdre étaient destinés aux prêtres à l'époque paléochrétienne.
TermeAssocie: T69-1094
status: 1

tabouret de chantre
type: Concept
modified: 2014-12-02T15:21:19+01:00
in scheme: Thésaurus de la désignation des objets mobiliers
preferred label: chorister's stools @en-us
preferred label: sgabello del cantore @it
preferred label: tamborete de chantre @pt
broader: siège et agenouilloir d'église du culte catholique
created: 2012-05-16T00:00:00+02:00
definition: Tabouret réservé à un chantre durant les offices. Il se compose d'une large plate-forme ou d'un marchepied et d'un siège haut permettant de s'asseoir tout en paraissant être debout.
status: 1
broad match: http://vocab.getty.edu/aat/300038418

stalle
type: Concept
modified: 2014-12-02T15:18:05+01:00
in scheme: Thésaurus de la désignation des objets mobiliers
preferred label: stalli del coro @it
preferred label: choir stalls @en-us
preferred label: cadeiral @pt
broader: siège et agenouilloir d'église du culte catholique
alternative label: miséricorde
alternative label: jouée de stalles
alternative label: parclose
alternative label: stalles
created: 2012-05-16T00:00:00+02:00
definition: Siège ou ensemble de sièges situé dans le chœur liturgique et réservé aux membres du clergé ou aux religieux dans un monastère pendant les offices. Chaque stalle comporte un dossier, des accotoirs et un fond mobile, la sellette, sous laquelle est fixée une miséricorde, qui permet de s'asseoir tout en paraissant être debout. Les stalles comportent également des parcloses, panneaux séparant verticalement deux stalles et des jouées, panneaux situés aux extrémités de chaque série de stalles. Les stalles peuvent être disposées sur deux rangs : stalles hautes à l'arrière et stalles basses à l'avant. Les stalles qui se trouvent à l'entrée ou au fond du chœur, réservées au clergé de rang le plus élevé, se distinguent par l'importance de leur taille et de leur décor.
status: 1

tabouret d'église
type: Concept
modified: 2014-12-02T15:19:22+01:00
in scheme: Thésaurus de la désignation des objets mobiliers
preferred label: church stools @en-us
broader: siège et agenouilloir d'église du culte catholique
created: 2012-05-16T00:00:00+02:00
definition: Tabouret mobile en bois, parfois paillé et destiné aux fidèles.
status: 1
broad match: http://vocab.getty.edu/aat/300038418

siège et agenouilloir d'église du culte catholique
type: PreferredTerm
modified: 2014-12-02T14:21:37+01:00
created: 2014-01-15T14:54:24+01:00
status: 1

siège de célébrant
type: Concept
modified: 2014-12-02T14:58:48+01:00
in scheme: Thésaurus de la désignation des objets mobiliers
preferred label: sedilia @en-us
preferred label: sedile per concelebrazione @it
preferred label: assento de celebrante @pt
narrower: T69-839
narrower: T69-837
narrower: T69-835
narrower: T69-830
narrower: T69-832
narrower: T69-824
narrower: T69-826
narrower: T69-828
broader: siège et agenouilloir d'église du culte catholique
created: 2012-05-16T00:00:00+02:00
definition: Siège de chœur à une ou plusieurs places utilisé lors de la célébration d'une messe par les officiants. Placés du côté de l'Epître, ces sièges sont souvent au nombre de trois. Celui du centre, à une place et généralement le plus important, est réservé au célébrant principal. Les sièges latéraux, souvent assortis, peuvent être des chaises, des fauteuils, des tabourets, de petits bancs. Les sièges de célébrant sont parfois solidaires et intégrés au décor du chœur.
status: 1

chandelier de bénédiction
type: Concept
modified: 2014-01-10T00:00:00+01:00
in scheme: Thésaurus de la désignation des objets mobiliers
broader: objet du culte orthodoxe
alternative label: dikirion
alternative label: trikirion
created: 2012-05-16T00:00:00+02:00
scope note: Les deux bougies sont symboles de la double nature du Christ, les trois symbolisent la Trinité. Employer les synonymes interdits (contenus dans le champ EP) dans le champ PDEN.
definition: Ensemble de deux chandeliers servant à la bénédiction donnée par l'évêque, portés par celui-ci chacun dans une main. L'un des chandeliers comporte deux bougies, dikirion, l'autre trois, trikirion. Les bougies doivent se rejoindre à leurs extrémités en signe d'unité.
status: 1

chandelier de bénédiction
type: PreferredTerm
modified: 2014-01-10T00:00:00+01:00
created: 2014-01-15T14:54:24+01:00
status: 1

trikirion
type: SimpleNonPreferredTerm
modified: 2014-01-10T00:00:00+01:00
created: 2014-01-15T14:54:24+01:00
status: 1

dikirion
type: SimpleNonPreferredTerm
modified: 2014-01-10T00:00:00+01:00
created: 2014-01-15T14:54:24+01:00
status: 1

rafraîchissoir à bouteilles
type: SimpleNonPreferredTerm
modified: 2014-12-05T15:53:55+01:00
created: 2014-01-15T14:54:24+01:00
status: 1

seau à bouteille
type: SimpleNonPreferredTerm
modified: 2014-12-05T15:53:55+01:00
created: 2014-01-15T14:54:24+01:00
status: 1

rafraîchissoir à bouteille
type: PreferredTerm
modified: 2014-12-05T15:53:55+01:00
created: 2014-01-15T14:54:24+01:00
status: 1

réserve à huile des malades
type: PreferredTerm
modified: 2014-12-01T10:54:13+01:00
created: 2014-01-15T14:54:24+01:00
status: 1

réserve à huile des infirmes
type: SimpleNonPreferredTerm
modified: 2014-12-01T10:54:13+01:00
created: 2014-01-15T14:54:24+01:00
status: 1

tabouret de chantre
type: PreferredTerm
modified: 2014-12-02T15:21:19+01:00
created: 2014-01-15T14:54:24+01:00
status: 1

avion de reconnaissance et de surveillance
type: Concept
modified: 2014-10-14T15:45:35+02:00
in scheme: Thésaurus de la désignation des objets mobiliers
preferred label: reconnaissance aircraft @en-us
broader: avion militaire
alternative label: avion radar
alternative label: avion de contre mesures électroniques
alternative label: avion de reconnaissance photographique
alternative label: drone
created: 2013-11-06T00:00:00+01:00
definition: Avion conçu pour contrôler l'espace aérien et maritime, identifier des objectifs potentiels en territoire ennemi, et plus généralement obtenir des renseignements sur les mouvements d'une force armée.
status: 1

avion de reconnaissance et de surveillance
type: PreferredTerm
modified: 2014-10-14T15:45:35+02:00
created: 2014-01-15T14:54:24+01:00
status: 1

drone
type: SimpleNonPreferredTerm
modified: 2014-10-14T15:45:35+02:00
created: 2014-01-15T14:54:24+01:00
status: 1

avion de contre mesures électroniques
type: SimpleNonPreferredTerm
modified: 2014-10-14T15:45:35+02:00
created: 2014-01-15T14:54:24+01:00
status: 1

avion de reconnaissance photographique
type: SimpleNonPreferredTerm
modified: 2014-10-14T15:45:35+02:00
created: 2014-01-15T14:54:24+01:00
status: 1

avion radar
type: SimpleNonPreferredTerm
modified: 2014-10-14T15:45:35+02:00
created: 2014-01-15T14:54:24+01:00
status: 1

tranche-caillé
type: SimpleNonPreferredTerm
modified: 2014-10-16T15:24:25+02:00
created: 2014-01-15T14:54:24+01:00
status: 1

pelle de service
type: Concept
modified: 2014-10-16T15:51:54+02:00
in scheme: Thésaurus de la désignation des objets mobiliers
preferred label: scoops (serving ustensils) @en-us
broader: instrument pour la préparation - le service ou la consommation des aliments et des boissons
alternative label: pelle à asperges
alternative label: pelle à gâteau
alternative label: pelle à petits fours
alternative label: pelle à beurre
alternative label: pelle à pâté
alternative label: pelle à thon
alternative label: pelle à poisson
alternative label: pelle à glace
created: 2012-05-16T00:00:00+02:00
related: drageoir
definition: Instrument de service en métal utilisé pour découper et/ou servir un aliment. Il est constitué d'une spatule de formes variées, ajourée ou non, prolongée par un manche.
TermeAssocie: drageoir
status: 1
narrow match: Pelle à tarte
broad match: http://data.bnf.fr/ark:/12148/cb11978277c

rase-galettes
type: SimpleNonPreferredTerm
modified: 2014-10-16T15:24:25+02:00
created: 2014-01-15T14:54:24+01:00
status: 1

fourchette
type: Concept
modified: 2014-12-05T16:12:05+01:00
in scheme: Thésaurus de la désignation des objets mobiliers
preferred label: forks (flatware) @en-us
broader: instrument pour la préparation - le service ou la consommation des aliments et des boissons
alternative label: fourchette à griller
alternative label: fourchette à gâteau
alternative label: fourchette à piquer
alternative label: fourchette à poisson
alternative label: fourchette à sardines
alternative label: fourchette à servir
alternative label: fourchette de table
alternative label: fourchette à melon
alternative label: fourchette à mangue
alternative label: fourchette à entremets
alternative label: fourchette à noix
alternative label: fourchette de service à poisson
alternative label: fourchette-cuiller
alternative label: fourchette pliante
alternative label: fourchette à découper
alternative label: fourchette à cornichons
alternative label: décrochoir
alternative label: fourchette à salade
alternative label: fourchette à escargots
alternative label: fourchette à crustacés
alternative label: fourchette pour fruits confits
alternative label: fourchette à saucisson
alternative label: fourchette à huîtres
alternative label: fourchette d'âtre
created: 2012-05-16T00:00:00+02:00
definition: Instrument servant à piquer les aliments et à les porter à la bouche, à les préparer ou à les transvaser d'un récipient dans un autre. Il est constitué par un fourchon en métal à dents pointues, parallèles, droites ou légèrement incurvées et un manche de longueur variable, terminé ou non par une spatule.
status: 1

spatule de cuisine
type: SimpleNonPreferredTerm
modified: 2014-10-16T15:24:25+02:00
created: 2014-01-15T14:54:24+01:00
status: 1

pince à sucre
type: Concept
modified: 2014-10-16T15:56:50+02:00
in scheme: Thésaurus de la désignation des objets mobiliers
preferred label: sugar tongs @en-us
broader: instrument pour la préparation - le service ou la consommation des aliments et des boissons
created: 2012-05-16T00:00:00+02:00
definition: Pince en métal avec laquelle on sert les morceaux de sucre. De forme semblable à la pince à glace, elle présente à chacune de ses extrémités une petite spatule découpée ou non en griffes.
status: 1

marque à biscuits
type: Concept
modified: 2014-10-16T15:46:22+02:00
in scheme: Thésaurus de la désignation des objets mobiliers
preferred label: springerle rollers @en-us
broader: instrument pour la préparation - le service ou la consommation des aliments et des boissons
created: 2012-05-16T00:00:00+02:00
definition: Instrument en bois ou en céramique, dont toutes les faces comportent un décor en creux et que l'on applique sur la pâte à biscuit crue pour y imprimer les motifs et les formes que l'on découpe ensuite avant cuisson avec une lame pour former les biscuits.
status: 1
broad match: http://data.bnf.fr/ark:/12148/cb146493415

hache à sucre
type: Concept
modified: 2014-10-16T15:41:26+02:00
in scheme: Thésaurus de la désignation des objets mobiliers
preferred label: sugar cutters @en-us
broader: instrument pour la préparation - le service ou la consommation des aliments et des boissons
alternative label: marteau à sucre
alternative label: pique-sucre
created: 2012-05-16T00:00:00+02:00
definition: Instrument en métal, en forme de hache, de marteau ou de pique, avec lequel on fend, casse ou débite un pain de sucre. La hache comporte une lame courbe, le marteau une pointe droite ou courbe.
status: 1
broad match: http://data.bnf.fr/ark:/12148/cb137554066

pince à asperges
type: SimpleNonPreferredTerm
modified: 2014-10-16T15:24:25+02:00
created: 2014-01-15T14:54:24+01:00
status: 1

décacheteur à bouteilles
type: SimpleNonPreferredTerm
modified: 2014-10-16T15:24:25+02:00
created: 2014-01-15T14:54:24+01:00
status: 1

ouvre-boîte
type: SimpleNonPreferredTerm
modified: 2014-10-16T15:24:25+02:00
created: 2014-01-15T14:54:24+01:00
status: 1

passoire à thé
type: Concept
modified: 2014-12-05T16:23:30+01:00
in scheme: Thésaurus de la désignation des objets mobiliers
preferred label: tea strainers @en-us
broader: instrument pour la préparation - le service ou la consommation des aliments et des boissons
alternative label: passe-thé
created: 2012-05-16T00:00:00+02:00
definition: Instrument en métal utilisé pour retenir les feuilles de thé à la sortie de la théière. Il est généralement constitué par un réceptacle circulaire muni d'un petit manche latéral, de deux oreilles horizontales ou d'une anse mobile pour le suspendre au goulot de la théière.
status: 1
broad match: http://data.bnf.fr/ark:/12148/cb12469490f

coupe-pâte
type: Concept
modified: 2014-10-16T15:34:21+02:00
in scheme: Thésaurus de la désignation des objets mobiliers
broader: instrument pour la préparation - le service ou la consommation des aliments et des boissons
alternative label: pince à pâte
alternative label: rouleau-couperet
created: 2012-05-16T00:00:00+02:00
definition: Lame en métal à bord coupant droit ou courbe, fixée à un manche pour découper la pâte crue et la façonner.
status: 1
broad match: List of food preparation utensils

fouet à œufs
type: SimpleNonPreferredTerm
modified: 2014-10-16T15:24:25+02:00
created: 2014-01-15T14:54:24+01:00
status: 1

pince à châtaignes
type: SimpleNonPreferredTerm
modified: 2014-10-16T15:24:25+02:00
created: 2014-01-15T14:54:24+01:00
status: 1

raclette à plat
type: Concept
modified: 2014-12-05T16:32:33+01:00
in scheme: Thésaurus de la désignation des objets mobiliers
broader: instrument pour la préparation - le service ou la consommation des aliments et des boissons
created: 2012-05-16T00:00:00+02:00
definition: Petite spatule en métal prolongée par un manche court, pour gratter le fond des plats. Elle est munie d'un anneau et suspendue à la barre porte-instruments de cuisine.
status: 1
broad match: cb11956938h

ouvre-bouteille
type: SimpleNonPreferredTerm
modified: 2014-10-16T15:24:25+02:00
created: 2014-01-15T14:54:24+01:00
status: 1

emporte-pièce
type: SimpleNonPreferredTerm
modified: 2014-10-16T15:24:25+02:00
created: 2014-01-15T14:54:24+01:00
status: 1

plateau domestique
type: SimpleNonPreferredTerm
modified: 2014-10-16T15:24:25+02:00
created: 2014-01-15T14:54:24+01:00
status: 1

alambic de table
type: Concept
modified: 2014-12-05T16:01:32+01:00
in scheme: Thésaurus de la désignation des objets mobiliers
broader: instrument pour la préparation - le service ou la consommation des aliments et des boissons
created: 2012-05-16T00:00:00+02:00
definition: Instrument, à poser sur une table, destiné à la distillation de moûts fermentés ou de substances médicinales. Il est constitué d’une chaudière ou cucurbite chauffée par un foyer ou par tout autre moyen. Les vapeurs émises passent à travers un serpentin où elles sont réfrigérées et reviennent ainsi à l'état liquide.
status: 1
broad match: http://data.bnf.fr/ark:/12148/cb135555122
broad match: http://vocab.getty.edu/aat/300197358

décapsuleur
type: SimpleNonPreferredTerm
modified: 2014-10-16T15:24:25+02:00
created: 2014-01-15T14:54:24+01:00
status: 1

pelle à farine
type: Concept
modified: 2014-10-16T15:50:46+02:00
in scheme: Thésaurus de la désignation des objets mobiliers
preferred label: flour scoops @en-us
broader: instrument pour la préparation - le service ou la consommation des aliments et des boissons
created: 2012-05-16T00:00:00+02:00
related: T69-4162
related: T69-2926
definition: Instrument en bois à manche court et spatule pourvue sur trois côtés d'un haut rebord, pour puiser la farine dans le coffre à farine ou la boîte à farine.
TermeAssocie: T69-4162
TermeAssocie: T69-2926
status: 1

pince à plat
type: SimpleNonPreferredTerm
modified: 2014-10-16T15:24:25+02:00
created: 2014-01-15T14:54:24+01:00
status: 1

casse-sucre
type: SimpleNonPreferredTerm
modified: 2014-10-16T15:24:25+02:00
created: 2014-01-15T14:54:24+01:00
status: 1

marque à pain
type: Concept
modified: 2014-12-05T16:20:50+01:00
in scheme: Thésaurus de la désignation des objets mobiliers
broader: instrument pour la préparation - le service ou la consommation des aliments et des boissons
created: 2012-05-16T00:00:00+02:00
definition: Instrument en bois, cubique, dont les six faces sont pourvues d'un élément circulaire saillant comportant un décor en creux ou en relief que l'on applique, avant cuisson dans un four collectif, sur le pain pour le décorer et en reconnaître le propriétaire.
status: 1

pince à escargots
type: SimpleNonPreferredTerm
modified: 2014-10-16T15:24:25+02:00
created: 2014-01-15T14:54:24+01:00
status: 1

raclette à pétrin
type: SimpleNonPreferredTerm
modified: 2014-10-16T15:24:25+02:00
created: 2014-01-15T14:54:24+01:00
status: 1

poche à huile
type: SimpleNonPreferredTerm
modified: 2014-10-16T15:24:25+02:00
created: 2014-01-15T14:54:24+01:00
status: 1

coupe-pain
type: Concept
modified: 2014-12-05T16:05:03+01:00
in scheme: Thésaurus de la désignation des objets mobiliers
broader: instrument pour la préparation - le service ou la consommation des aliments et des boissons
alternative label: coupe-pain à levier
created: 2012-05-16T00:00:00+02:00
definition: Instrument en métal, en forme de faucille ou de lame droite ou courbe, pour couper le pain. Lorsqu’elle est montée sur une planche, elle forme levier.
status: 1
broad match: List of food preparation utensils

taille-soupe
type: SimpleNonPreferredTerm
modified: 2014-10-16T15:24:25+02:00
created: 2014-01-15T14:54:24+01:00
status: 1

fer à beignet
type: SimpleNonPreferredTerm
modified: 2014-10-16T15:24:25+02:00
created: 2014-01-15T14:54:24+01:00
status: 1

pilon
type: Concept
modified: 2014-12-05T16:26:02+01:00
in scheme: Thésaurus de la désignation des objets mobiliers
preferred label: pestles @en-us
broader: instrument pour la préparation - le service ou la consommation des aliments et des boissons
alternative label: pétrisseur à pâte
created: 2012-05-16T00:00:00+02:00
related: mortier de cuisine
related: passoire
definition: Instrument servant à écraser des aliments dans un mortier, dans une passoire ou dans une presse à légumes. Il est constitué d’une masse fixée à un manche ou faisant corps avec lui.
TermeAssocie: mortier de cuisine
TermeAssocie: passoire
status: 1

presse-viande
type: SimpleNonPreferredTerm
modified: 2014-10-16T15:24:25+02:00
created: 2014-01-15T14:54:24+01:00
status: 1

coupe-œuf
type: SimpleNonPreferredTerm
modified: 2014-10-16T15:24:25+02:00
created: 2014-01-15T14:54:24+01:00
status: 1

tire-bouchon
type: SimpleNonPreferredTerm
modified: 2014-10-16T15:24:25+02:00
created: 2014-01-15T14:54:24+01:00
status: 1

fouet à mayonnaise
type: SimpleNonPreferredTerm
modified: 2014-10-16T15:24:25+02:00
created: 2014-01-15T14:54:24+01:00
status: 1

manche à gigot
type: SimpleNonPreferredTerm
modified: 2014-10-16T15:24:25+02:00
created: 2014-01-15T14:54:24+01:00
status: 1

pique-pâte
type: SimpleNonPreferredTerm
modified: 2014-10-16T15:24:25+02:00
created: 2014-01-15T14:54:24+01:00
status: 1

couteau
type: Concept
modified: 2014-12-05T16:07:28+01:00
in scheme: Thésaurus de la désignation des objets mobiliers
preferred label: knives @en-us
broader: instrument pour la préparation - le service ou la consommation des aliments et des boissons
alternative label: couteau à fromage
alternative label: couteau à gâteau
alternative label: couteau double
alternative label: couteau à pompe
alternative label: couteau de table
alternative label: couteau à hacher
alternative label: couteau à éplucher
alternative label: couteau à servir le fromage
alternative label: serpette à glace
alternative label: couteau à chester
alternative label: couteau à ressort
alternative label: couteau de femme
alternative label: couteau à lame rentrante
alternative label: couteau pour peler les oranges
alternative label: couteau à servir le poisson
alternative label: couteau à huîtres
alternative label: couteau à dépecer
alternative label: couteau jambette
alternative label: couteau à poisson
alternative label: couteau triple
alternative label: couteau à pâte
alternative label: couteau à bascule
alternative label: couteau cadet
alternative label: couteau présentoir
alternative label: couteau camard
alternative label: couteau à melon
alternative label: couteau à trancher
alternative label: couteau étui
alternative label: couteau à tête de compas
alternative label: couteau à dessert
alternative label: couteau à beurre
alternative label: couteau à la turque
alternative label: couteau à caillé
alternative label: couteau-fourchette
alternative label: couteau à attrape
alternative label: couteau à crustacés
alternative label: couteau à noix
alternative label: couteau à lame gaine
alternative label: canif
alternative label: couteau à la crosse
alternative label: couteau à pain
alternative label: couteau à lame(s) pliante(s)
alternative label: couteau à secret
alternative label: couteau à lamelles
alternative label: couteau à glace
alternative label: couteau à lames interchangeables
alternative label: couteau à bec de corbin
alternative label: épluchoir
alternative label: couteau à la d'Estaing
created: 2012-05-16T00:00:00+02:00
definition: Instrument tranchant muni d’un manche, servant à couper les aliments, mais aussi à les piquer et à les porter à la bouche. Le couteau se compose essentiellement d'une ou plusieurs lames, fixes, rentrantes ou articulées, à un ou deux tranchants.
status: 1

ciseaux à raisin
type: Concept
modified: 2014-10-16T15:32:40+02:00
in scheme: Thésaurus de la désignation des objets mobiliers
preferred label: grape shears @en-us
broader: instrument pour la préparation - le service ou la consommation des aliments et des boissons
created: 2012-05-16T00:00:00+02:00
definition: Ciseaux à courtes lames épaisses, parfois écartées, pour couper les tiges des grappes de raisin présentées sur la table ou pour les servir. Ils sont généralement décorés de grappes de raisin.
status: 1

aiguille à brider
type: Concept
modified: 2014-10-16T15:26:54+02:00
in scheme: Thésaurus de la désignation des objets mobiliers
preferred label: trussing needles @en-us
broader: instrument pour la préparation - le service ou la consommation des aliments et des boissons
alternative label: aiguiseur à trousser
created: 2012-05-16T00:00:00+02:00
definition: Aiguille à coudre aplatie à l'extrémité, servant à maintenir les pièces de viande afin qu'elles ne se déforment pas à la cuisson. Les aiguilles à brider sont rangées dans l'étui à aiguilles à brider.
status: 1
broad match: http://data.bnf.fr/ark:/12148/cb119776370

découpoir
type: SimpleNonPreferredTerm
modified: 2014-10-16T15:24:25+02:00
created: 2014-01-15T14:54:24+01:00
status: 1

essoreuse à beurre
type: SimpleNonPreferredTerm
modified: 2014-10-16T15:24:25+02:00
created: 2014-01-15T14:54:24+01:00
status: 1

marque à beurre
type: Concept
modified: 2014-12-05T16:18:08+01:00
in scheme: Thésaurus de la désignation des objets mobiliers
preferred label: butter prints @en-us
broader: instrument pour la préparation - le service ou la consommation des aliments et des boissons
alternative label: rouleau à beurre
alternative label: plaque à beurre
created: 2012-05-16T00:00:00+02:00
definition: Rouleau, plaque ou gros cachet circulaire ou en amande, en bois ou en céramique, à décor en creux, que l'on applique sur la motte de beurre pour la décorer. Les motifs et inscriptions peuvent indiquer la provenance et parfois la quantité.
status: 1

pince à glace
type: SimpleNonPreferredTerm
modified: 2014-10-16T15:24:25+02:00
created: 2014-01-15T14:54:24+01:00
status: 1

écumoire
type: SimpleNonPreferredTerm
modified: 2014-10-16T15:24:25+02:00
created: 2014-01-15T14:54:24+01:00
status: 1

attendrisseur à viande
type: SimpleNonPreferredTerm
modified: 2014-10-16T15:24:25+02:00
created: 2014-01-15T14:54:24+01:00
status: 1

molette à pâte
type: SimpleNonPreferredTerm
modified: 2014-10-16T15:24:25+02:00
created: 2014-01-15T14:54:24+01:00
status: 1

manche à côtelette
type: SimpleNonPreferredTerm
modified: 2014-10-16T15:24:25+02:00
created: 2014-01-15T14:54:24+01:00
status: 1

instrument pour la préparation - le service ou la consommation des aliments et des boissons
type: PreferredTerm
modified: 2014-10-16T15:24:25+02:00
created: 2014-01-15T14:54:24+01:00
status: 1

palette à essorer le beurre
type: SimpleNonPreferredTerm
modified: 2014-10-16T15:24:25+02:00
created: 2014-01-15T14:54:24+01:00
status: 1

aiguille à larder
type: SimpleNonPreferredTerm
modified: 2014-10-16T15:24:25+02:00
created: 2014-01-15T14:54:24+01:00
status: 1

mouvette
type: SimpleNonPreferredTerm
modified: 2014-10-16T15:24:25+02:00
created: 2014-01-15T14:54:24+01:00
status: 1

pétrisseur à beurre
type: SimpleNonPreferredTerm
modified: 2014-10-16T15:24:25+02:00
created: 2014-01-15T14:54:24+01:00
status: 1

lardoir
type: SimpleNonPreferredTerm
modified: 2014-10-16T15:24:25+02:00
created: 2014-01-15T14:54:24+01:00
status: 1

hachoir
type: Concept
modified: 2014-12-05T16:14:43+01:00
in scheme: Thésaurus de la désignation des objets mobiliers
preferred label: chopping knives @en-us
broader: instrument pour la préparation - le service ou la consommation des aliments et des boissons
alternative label: râpe à choux
alternative label: hachoir mécanique
alternative label: râpe à choucroute
alternative label: râpe à navets
alternative label: hachoir à légumes
alternative label: hachoir à persil
alternative label: hachoir à choux
alternative label: moulin à hâcher
created: 2012-05-16T00:00:00+02:00
related: T69-3376
definition: Instrument généralement constitué par une ou deux lames courbes terminées par un petit manche ou une poignée, que l'on balance pour hacher les aliments en petits morceaux.
TermeAssocie: T69-3376
status: 1
broad match: cb11956938h

palette à égoutter
type: SimpleNonPreferredTerm
modified: 2014-10-16T15:24:25+02:00
created: 2014-01-15T14:54:24+01:00
status: 1

flamboir
type: SimpleNonPreferredTerm
modified: 2014-10-16T15:24:25+02:00
created: 2014-01-15T14:54:24+01:00
status: 1

casse-noix
type: Concept
modified: 2014-12-05T16:02:26+01:00
in scheme: Thésaurus de la désignation des objets mobiliers
preferred label: nutcrackers @en-us
broader: instrument pour la préparation - le service ou la consommation des aliments et des boissons
alternative label: casse-chocolat
alternative label: casse-noisettes
created: 2012-05-16T00:00:00+02:00
definition: Instrument en bois ou en métal pour casser les noix ou les noisettes. Il se présente généralement sous la forme d'une pince, d'une tenaille, d’un marteau ou d’un réceptacle dans lequel vient pénétrer une vis qui écrase le fruit.
status: 1

chalumeau à boire
type: Concept
modified: 2014-12-05T16:03:25+01:00
in scheme: Thésaurus de la désignation des objets mobiliers
preferred label: drinking straws @en-us
broader: instrument pour la préparation - le service ou la consommation des aliments et des boissons
created: 2012-05-16T00:00:00+02:00
definition: Petit tuyau en bois, os ou métal permettant de boire par aspiration une petite quantité de liquide.
status: 1
broad match: http://data.bnf.fr/ark:/12148/cb11978277c

couperet
type: Concept
modified: 2014-12-05T16:06:20+01:00
in scheme: Thésaurus de la désignation des objets mobiliers
preferred label: cleavers @en-us
broader: instrument pour la préparation - le service ou la consommation des aliments et des boissons
created: 2012-05-16T00:00:00+02:00
definition: Instrument en métal servant à trancher la viande, constitué d'une lame large et très épaisse, droite ou curviligne, à tranchant droit, dont le manche est généralement dans le prolongement du dos et avec lequel il fait corps.
status: 1
broad match: cb12288795t

support d'ustensile de cuisine
type: SimpleNonPreferredTerm
modified: 2014-10-16T15:24:25+02:00
created: 2014-01-15T14:54:24+01:00
status: 1

fer à glacer
type: SimpleNonPreferredTerm
modified: 2014-10-16T15:24:25+02:00
created: 2014-01-15T14:54:24+01:00
status: 1

affûtoir
type: Concept
modified: 2014-12-05T16:00:35+01:00
in scheme: Thésaurus de la désignation des objets mobiliers
preferred label: sharpeners @en-us
broader: instrument pour la préparation - le service ou la consommation des aliments et des boissons
alternative label: fusil à affûter
alternative label: aiguiseur à couteau
created: 2012-05-16T00:00:00+02:00
definition: Instrument en métal fixé dans un manche, servant à aiguiser la lame d’un couteau. Il se présente sous la forme d’une tige non polie, de section circulaire, ou de disques tournant autour d’un axe. L'affûtoir peut faire partie du service à découper.
status: 1

fouet de cuisine
type: SimpleNonPreferredTerm
modified: 2014-10-16T15:24:25+02:00
created: 2014-01-15T14:54:24+01:00
status: 1

presse à fruits ou à légumes
type: Concept
modified: 2014-12-05T16:31:38+01:00
in scheme: Thésaurus de la désignation des objets mobiliers
broader: instrument pour la préparation - le service ou la consommation des aliments et des boissons
alternative label: presse à cassis
alternative label: presse à groseilles
alternative label: presse à raison
alternative label: presse à fruits
alternative label: presse à légumes
alternative label: presse-purée
alternative label: presse-citron
alternative label: presse-tranche de citron
created: 2012-05-16T00:00:00+02:00
definition: Instrument servant à écraser des fruits ou des légumes cuits. Il est constitué d’un réceptacle à parois entièrement perforées, dans lequel pénètre un pilon qui écrase les aliments. Le jus des fruits ou des légumes est recueilli dans un réceptacle fixé au-dessous, comportant une rigole et un bec d'évacuation.
status: 1
broad match: cb11956938h

videlle
type: SimpleNonPreferredTerm
modified: 2014-10-16T15:24:25+02:00
created: 2014-01-15T14:54:24+01:00
status: 1

râpe
type: Concept
modified: 2014-12-05T16:33:30+01:00
in scheme: Thésaurus de la désignation des objets mobiliers
preferred label: graters @en-us
broader: instrument pour la préparation - le service ou la consommation des aliments et des boissons
alternative label: moulin à râper
alternative label: râpe à fromage
alternative label: écailleur
alternative label: râpe à muscade
alternative label: râpe à légumes
created: 2012-05-16T00:00:00+02:00
definition: Plaque métallique plate, bombée ou circulaire, hérissée d’aspérités pour réduire des aliments en poudre, grains ou lamelle. Elle peut être fixée sur une plaque ou dans un bâti ou être d’applique et complétée par un réceptacle placé à sa partie inférieure.
status: 1

gril
type: Concept
modified: 2014-10-16T15:38:51+02:00
in scheme: Thésaurus de la désignation des objets mobiliers
preferred label: gridirons (culinary tools) @en-us
narrower: T69-4012
broader: instrument pour la préparation - le service ou la consommation des aliments et des boissons
alternative label: gril à poisson
alternative label: gril-lèchefrite
alternative label: gril double
alternative label: gril à galettes
alternative label: gril tournant
alternative label: gril à andouille
created: 2012-05-16T00:00:00+02:00
definition: Plaque ou support ajouré, en métal, sur lequel on fait griller des aliments directement au-dessus du feu. Le gril comporte un manche latéral, généralement des pieds et parfois un tiroir pour contenir des braises.
status: 1

porte-couverts
type: Concept
modified: 2014-10-16T15:58:58+02:00
in scheme: Thésaurus de la désignation des objets mobiliers
preferred label: cutlery holders @en-us
broader: instrument pour la préparation - le service ou la consommation des aliments et des boissons
alternative label: plaque à couverts
alternative label: égouttoir à couverts
alternative label: casier à couverts
created: 2012-05-16T00:00:00+02:00
related: porte-couteau
definition: Récipient ou instrument ajouré en métal dans lequel on range verticalement les couverts, manche en bas. Le porte-couverts peut être d'applique, suspendu ou à poser.
TermeAssocie: porte-couteau
status: 1
narrow match: http://vocab.getty.edu/aat/300043089
broad match: http://data.bnf.fr/ark:/12148/cb122111177

pince à côtelettes
type: SimpleNonPreferredTerm
modified: 2014-10-16T15:24:25+02:00
created: 2014-01-15T14:54:24+01:00
status: 1

brise-caillé
type: SimpleNonPreferredTerm
modified: 2014-10-16T15:24:25+02:00
created: 2014-01-15T14:54:24+01:00
status: 1

aiguille à piquer
type: SimpleNonPreferredTerm
modified: 2014-10-16T15:24:25+02:00
created: 2014-01-15T14:54:24+01:00
status: 1

cul-de-lampe
type: Concept
modified: 2015-02-05T17:08:00+01:00
in scheme: Thésaurus de la désignation des objets mobiliers
preferred label: culs-de-lampe @en-us
broader: support en surplomb
created: 2012-05-16T00:00:00+02:00
definition: Organe en surplomb portant une charge, formé de plusieurs assises appareillées en cône, en pyramide renversée ou en quart de sphère.
status: 1

support en surplomb
type: Concept
modified: 2015-02-11T12:44:10+01:00
in scheme: Thésaurus de la désignation des objets mobiliers
narrower: cul-de-lampe
narrower: culot
narrower: corbeau
narrower: coussinet
narrower: console d'architecture
narrower: modillon
broader: support ou organe de stabilité
created: 2012-05-16T00:00:00+02:00
definition: Elément formant saillie et portant une charge.
status: 1
broad match: http://vocab.getty.edu/aat/300078048

cul-de-lampe
type: PreferredTerm
modified: 2015-02-05T17:08:00+01:00
created: 2014-01-15T14:54:24+01:00
status: 1

dé à coudre
type: Concept
modified: 2014-12-10T14:23:15+01:00
in scheme: Thésaurus de la désignation des objets mobiliers
preferred label: thimbles @en-us
broader: objet ou matériel pour les ouvrages textiles
created: 2012-05-16T00:00:00+02:00
definition: Élément creux, piqueté à l'extérieur, que l'on enfile au bout du doigt pour pousser l'aiguille sans se piquer.
status: 1

dé à coudre
type: PreferredTerm
modified: 2014-12-10T14:23:15+01:00
created: 2014-01-15T14:54:24+01:00
status: 1

placard
type: Concept
modified: 2014-12-04T17:05:45+01:00
in scheme: Thésaurus de la désignation des objets mobiliers
preferred label: closets (storage spaces) @en-us
narrower: placard-bibliothèque
narrower: placard-garde-manger
narrower: placard-buffet
broader: meuble de rangement et d'exposition
created: 2012-05-16T00:00:00+02:00
definition: Meuble inamovible de rangement ou de conservation construit contre un mur et fermé par des battants. Il peut être en relief sur le mur, semi-encastré ou totalement encastré dans le mur. Dans ce cas les battants sont au plat du mur. Les parois sont constituées par le mur ou sont propres.
status: 1
broad match: cb13562642r

placard-bibliothèque
type: Concept
modified: 2014-10-13T12:42:11+02:00
in scheme: Thésaurus de la désignation des objets mobiliers
preferred label: bookcases @en-us
broader: placard
created: 2012-05-16T00:00:00+02:00
definition: Placard réservé aux livres.
status: 1

placard-garde-manger
type: Concept
modified: 2014-12-04T17:08:35+01:00
in scheme: Thésaurus de la désignation des objets mobiliers
preferred label: food cupboards (general cupboards) @en-us
broader: placard
created: 2012-05-16T00:00:00+02:00
definition: Niche creusée dans le mur et fermée par un ou deux battants à claire-voie, servant à la conservation des aliments.
status: 1
broad match: cb13562642r

placard
type: PreferredTerm
modified: 2014-12-04T17:05:45+01:00
created: 2014-01-15T14:54:24+01:00
status: 1

placard-buffet
type: Concept
modified: 2014-12-04T17:07:30+01:00
in scheme: Thésaurus de la désignation des objets mobiliers
broader: placard
created: 2012-05-16T00:00:00+02:00
definition: Placard servant à ranger la vaisselle et accessoirement à entreposer quelques aliments. Il peut être à un ou deux corps ou en niche.
status: 1

wagon de transport en vrac
type: Concept
modified: 2014-12-18T10:38:52+01:00
in scheme: Thésaurus de la désignation des objets mobiliers
preferred label: hopper cars @en-us
broader: matériel remorqué pour le transport ferroviaire des marchandises
alternative label: wagon céréalier
alternative label: wagon houiller
alternative label: wagon-trémie
alternative label: wagon minéralier
created: 2013-11-04T00:00:00+01:00
definition: Véhicule ferroviaire fermé destiné au transport de pulvérulents en vrac.
status: 1
broad match: cb11931174j

wagon de transport en vrac
type: PreferredTerm
modified: 2014-12-18T10:38:52+01:00
created: 2014-01-15T14:54:24+01:00
status: 1

wagon céréalier
type: SimpleNonPreferredTerm
modified: 2014-12-18T10:38:52+01:00
created: 2014-01-15T14:54:24+01:00
status: 1

wagon houiller
type: SimpleNonPreferredTerm
modified: 2014-12-18T10:38:52+01:00
created: 2014-01-15T14:54:24+01:00
status: 1

wagon minéralier
type: SimpleNonPreferredTerm
modified: 2014-12-18T10:38:52+01:00
created: 2014-01-15T14:54:24+01:00
status: 1

wagon-trémie
type: SimpleNonPreferredTerm
modified: 2014-12-18T10:38:52+01:00
created: 2014-01-15T14:54:24+01:00
status: 1

générateur d'ondes mécaniques
type: Concept
modified: 2015-10-07T15:45:50+02:00
in scheme: Thésaurus de la désignation des objets mobiliers
broader: générateur
alternative label: générateur d'ondes sonores
alternative label: sirène
alternative label: oscillateur à diapason
alternative label: moteur phonique
created: 2012-05-16T00:00:00+02:00
related: instrument de démonstration en acoustique
related: instrument de mesure des phénomènes ondulatoires mécaniques
definition: Générateur d'ondes se propageant par vibration de matière : l'eau, l’air (ondes sonores), etc.
TermeAssocie: instrument de démonstration en acoustique
TermeAssocie: instrument de mesure des phénomènes ondulatoires mécaniques
status: 1
narrow match: Sirène (appareil sonore)
narrow match: http://vocab.getty.edu/aat/300207459

moteur phonique
type: SimpleNonPreferredTerm
modified: 2015-10-07T15:45:50+02:00
created: 2014-01-15T14:54:24+01:00
status: 1

générateur d'ondes mécaniques
type: PreferredTerm
modified: 2015-10-07T15:45:50+02:00
created: 2014-01-15T14:54:24+01:00
status: 1

sirène
type: SimpleNonPreferredTerm
modified: 2015-10-07T15:45:50+02:00
created: 2014-01-15T14:54:24+01:00
status: 1

oscillateur à diapason
type: SimpleNonPreferredTerm
modified: 2015-10-07T15:45:50+02:00
created: 2014-01-15T14:54:24+01:00
status: 1

instrument de mesure des phénomènes ondulatoires mécaniques
type: Concept
modified: 2014-12-15T14:32:12+01:00
in scheme: Thésaurus de la désignation des objets mobiliers
broader: instrument de mesure de phénomènes ondulatoires
alternative label: vibroscope
alternative label: sismomètre
alternative label: sonomètre
created: 2012-05-16T00:00:00+02:00
scope note: Instrument de mesure d'ondes mécaniques, audibles ou non (sons, infrasons, ultrasons), par comparaison avec une modulation émise par l'appareil lui-même, ou bien par représentation graphique ou optique.
related: générateur d'ondes mécaniques
TermeAssocie: générateur d'ondes mécaniques
status: 1
narrow match: Sismographe
broad match: http://vocab.getty.edu/aat/300207870
broad match: http://data.bnf.fr/ark:/12148/cb119324889

générateur d'ondes sonores
type: SimpleNonPreferredTerm
modified: 2015-10-07T15:45:50+02:00
created: 2014-01-15T14:54:24+01:00
status: 1

machine à extruder
type: Concept
modified: 2015-10-14T11:56:58+02:00
in scheme: Thésaurus de la désignation des objets mobiliers
broader: machine à allonger
alternative label: étireuse
alternative label: presse à extruder
alternative label: presse à filer
alternative label: boudineuse
alternative label: extrudeuse
created: 2012-05-16T00:00:00+02:00
definition: Machine à étirer un matériau ou un produit par compression à travers une filière.
status: 1
narrow match: http://vocab.getty.edu/aat/300233440
broad match: cb11982574x

presse à filer
type: SimpleNonPreferredTerm
modified: 2015-10-14T11:56:58+02:00
created: 2014-01-15T14:54:24+01:00
status: 1

presse à extruder
type: SimpleNonPreferredTerm
modified: 2015-10-14T11:56:58+02:00
created: 2014-01-15T14:54:24+01:00
status: 1

extrudeuse
type: SimpleNonPreferredTerm
modified: 2015-10-14T11:56:58+02:00
created: 2014-01-15T14:54:24+01:00
status: 1

boudineuse
type: SimpleNonPreferredTerm
modified: 2015-10-14T11:56:58+02:00
created: 2014-01-15T14:54:24+01:00
status: 1

étireuse
type: SimpleNonPreferredTerm
modified: 2015-10-14T11:56:58+02:00
created: 2014-01-15T14:54:24+01:00
status: 1

machine à extruder
type: PreferredTerm
modified: 2015-10-14T11:56:58+02:00
created: 2014-01-15T14:54:24+01:00
status: 1

locomotive-tender
type: Concept
modified: 2014-12-18T10:08:59+01:00
in scheme: Thésaurus de la désignation des objets mobiliers
broader: locomotive à vapeur
created: 2013-11-04T00:00:00+01:00
definition: Véhicule ferroviaire à moteur à vapeur qui porte sur son châssis ses réservoirs d'eau et de combustible.
status: 1
broad match: http://vocab.getty.edu/aat/300228422
broad match: cb11932302g

locomotive-tender
type: PreferredTerm
modified: 2014-12-18T10:08:59+01:00
created: 2014-01-15T14:54:24+01:00
status: 1

chaire à prêcher de synagogue
type: Concept
modified: 2014-01-10T00:00:00+01:00
in scheme: Thésaurus de la désignation des objets mobiliers
broader: meuble du culte synagogal
created: 2012-05-16T00:00:00+02:00
definition: La chaire à prêcher destinée à l'officiant est d'une forme très proche de celle du culte catholique et apparaît dans les synagogues, au XIXe siècle, dans le cadre du courant réformiste et assimilateur.
status: 1

chaire à prêcher de synagogue
type: PreferredTerm
modified: 2014-01-10T00:00:00+01:00
created: 2014-01-15T14:54:24+01:00
status: 1

chopine
type: Concept
modified: 2014-12-08T15:52:07+01:00
in scheme: Thésaurus de la désignation des objets mobiliers
narrower: chope
broader: récipient pour le service et la consommation des boissons
alternative label: moque
created: 2012-05-16T00:00:00+02:00
definition: Récipient à boire, servant de mesure pour le vin et les alcools et dont la capacité correspond aujourd'hui à un demi-litre. Elle est cylindrique, à fond plat, couverte ou non et munie d'une anse latérale. Les capacités peuvent être indiquées par un chiffre ou une inscription. La pinte équivaut à deux chopines, la quarte à deux pintes. La moque est une petite chopine pour boire du cidre.
status: 1
narrow match: http://data.bnf.fr/ark:/12148/cb120484020

moque
type: SimpleNonPreferredTerm
modified: 2014-12-08T15:52:07+01:00
created: 2014-01-15T14:54:24+01:00
status: 1

chopine
type: PreferredTerm
modified: 2014-12-08T15:52:07+01:00
created: 2014-01-15T14:54:24+01:00
status: 1

chope
type: Concept
modified: 2014-12-08T15:53:25+01:00
in scheme: Thésaurus de la désignation des objets mobiliers
preferred label: tankards @en-us
broader: chopine
created: 2012-05-16T00:00:00+02:00
definition: Récipient pour boire de la bière, de même forme que la chopine, mais sans capacité précise.
status: 1

machine à fondre
type: Concept
modified: 2015-09-25T14:43:07+02:00
in scheme: Thésaurus de la désignation des objets mobiliers
broader: machine à changer d'état
alternative label: fondeuse de lignes-blocs
alternative label: fondeuse de filets
alternative label: four à refondre
created: 2012-05-16T00:00:00+02:00
definition: Machine à changer d'état un produit solide en le liquéfiant sous l'action de la chaleur.
status: 1

fondeuse de filets
type: SimpleNonPreferredTerm
modified: 2015-09-25T14:43:07+02:00
created: 2014-01-15T14:54:24+01:00
status: 1

machine à fondre
type: PreferredTerm
modified: 2015-09-25T14:43:07+02:00
created: 2014-01-15T14:54:24+01:00
status: 1

fondeuse de lignes-blocs
type: SimpleNonPreferredTerm
modified: 2015-09-25T14:43:07+02:00
created: 2014-01-15T14:54:24+01:00
status: 1

four à refondre
type: SimpleNonPreferredTerm
modified: 2015-09-25T14:43:07+02:00
created: 2014-01-15T14:54:24+01:00
status: 1

matériel d'intervention sous-marin habité
type: Concept
modified: 2014-12-19T12:37:35+01:00
in scheme: Thésaurus de la désignation des objets mobiliers
preferred label: bathyscaphes @en-us
broader: bateau scientifique
alternative label: bathyscaphe
alternative label: soucoupe plongeante
created: 2013-11-04T00:00:00+01:00
definition: Engin permettant à un équipage restreint d'atteindre de grandes profondeurs à des fins d'investigation.
status: 1

soucoupe plongeante
type: SimpleNonPreferredTerm
modified: 2014-12-19T12:37:35+01:00
created: 2014-01-15T14:54:24+01:00
status: 1

matériel d'intervention sous-marin habité
type: PreferredTerm
modified: 2014-12-19T12:37:35+01:00
created: 2014-01-15T14:54:24+01:00
status: 1

bathyscaphe
type: SimpleNonPreferredTerm
modified: 2014-12-19T12:37:35+01:00
created: 2014-01-15T14:54:24+01:00
status: 1

machine à toupiller
type: Concept
modified: 2015-09-02T17:10:43+02:00
in scheme: Thésaurus de la désignation des objets mobiliers
broader: machine à usiner par outil de coupe
alternative label: toupie industrielle
alternative label: toupie à bois
created: 2012-05-16T00:00:00+02:00
definition: Machine à usiner par outil de coupe tournant à grande vitesse, pour profiler un chant (moulure, feuillure, etc).
status: 1
narrow match: Toupie
narrow match: cb12325529p
narrow match: http://vocab.getty.edu/aat/300023958

machine à raboter
type: Concept
modified: 2015-10-14T14:30:11+02:00
in scheme: Thésaurus de la désignation des objets mobiliers
broader: machine à usiner par outil de coupe
alternative label: raboteuse
created: 2012-05-16T00:00:00+02:00
definition: Machine à usiner par outil de coupe à mouvement alternatif, pour donner à une surface plane l'épaisseur voulue.
status: 1
narrow match: Raboteuse

machine à tourner
type: Concept
modified: 2015-09-02T17:14:46+02:00
in scheme: Thésaurus de la désignation des objets mobiliers
narrower: T69-5687
broader: machine à usiner par outil de coupe
alternative label: tour frontal
alternative label: tour vertical
alternative label: tour en l'air
alternative label: tour parallèle
alternative label: tour revolver
created: 2012-05-16T00:00:00+02:00
definition: Machine à usiner par outil de coupe fixe, pour façonner une pièce en lui imprimant un mouvement de rotation.
status: 1
narrow match: http://vocab.getty.edu/aat/300023793
narrow match: Tour
narrow match: cb11937521h

machine à usiner
type: Concept
modified: 2015-10-14T14:05:36+02:00
in scheme: Thésaurus de la désignation des objets mobiliers
narrower: machine à usiner par outil de coupe
narrower: machine à usiner par copiage
narrower: machine à usiner par abrasion
broader: machine à façonner
alternative label: machine à usiner par électroérosion
created: 2012-05-16T00:00:00+02:00
definition: Machine à façonner un produit solide par enlèvement progressif de matière (copeaux, limaille, etc).
status: 1
broad match: Usinage

machine à usiner par outil de coupe
type: PreferredTerm
modified: 2015-08-31T15:36:52+02:00
created: 2014-01-15T14:54:24+01:00
status: 1

loquet
type: PreferredTerm
modified: 2015-01-29T12:50:35+01:00
created: 2014-01-15T14:54:24+01:00
status: 1

organe de sécurité
type: Concept
modified: 2014-10-15T15:17:16+02:00
in scheme: Thésaurus de la désignation des objets mobiliers
preferred label: securing devices @en-us
narrower: loquet
narrower: espagnolette
narrower: T69-549
narrower: T69-570
narrower: T69-573
narrower: T69-543
narrower: T69-547
broader: élément de serrurerie
created: 2012-05-16T00:00:00+02:00
definition: Dispositif commandant l'ouverture et la fermeture d'une porte, d'un meuble.
status: 1
broad match: Serrurerie

contrevent
type: Concept
modified: 2014-12-09T16:01:30+01:00
in scheme: Thésaurus de la désignation des objets mobiliers
preferred label: shutters (opening components) @en-us
broader: fermeture de baie
alternative label: persienne
created: 2012-05-16T00:00:00+02:00
definition: Panneau pivotant sur un de ses bords verticaux, servant à doubler extérieurement un châssis vitré.
status: 1

contrevent
type: PreferredTerm
modified: 2014-12-09T16:01:30+01:00
created: 2014-01-15T14:54:24+01:00
status: 1

persienne
type: SimpleNonPreferredTerm
modified: 2014-12-09T16:01:30+01:00
created: 2014-01-15T14:54:24+01:00
status: 1

meuble à châtaignes
type: Concept
modified: 2014-10-10T16:44:50+02:00
in scheme: Thésaurus de la désignation des objets mobiliers
broader: meuble de préparation culinaire
alternative label: cuve à châtaignes
alternative label: panier à blanchir les châtaignes
alternative label: billot à châtaignes
alternative label: auge à châtaignes
alternative label: machine à décortiquer les châtaignes
created: 2012-05-16T00:00:00+02:00
definition: Meuble servant à décortiquer ou blanchir les châtaignes.
status: 1

meuble de préparation culinaire
type: PreferredTerm
modified: 2014-10-10T16:43:30+02:00
created: 2014-01-15T14:54:24+01:00
status: 1

meuble pour préparer le cochon
type: Concept
modified: 2014-12-04T15:10:58+01:00
in scheme: Thésaurus de la désignation des objets mobiliers
broader: meuble de préparation culinaire
alternative label: auge à ébouillanter le cochon
alternative label: treuil à cochon
alternative label: auge à boudin
alternative label: échelle à vider le cochon
alternative label: table à égoutter le cochon
alternative label: table à tuer le cochon
created: 2012-05-16T00:00:00+02:00
definition: Meuble servant à abattre le cochon ou à en apprêter la chair.
status: 1
broad match: http://vocab.getty.edu/aat/300199765

avion de transport militaire
type: Concept
modified: 2014-10-14T15:46:35+02:00
in scheme: Thésaurus de la désignation des objets mobiliers
preferred label: military transport aircraft @en-us
broader: avion militaire
alternative label: avion de largage parachutiste
alternative label: avion ambulance
alternative label: avion de liaison
created: 2013-11-06T00:00:00+01:00
definition: Avion destiné au transport des troupes ou des matériels militaires.
status: 1

avion de transport militaire
type: PreferredTerm
modified: 2014-10-14T15:46:35+02:00
created: 2014-01-15T14:54:24+01:00
status: 1

avion de liaison
type: SimpleNonPreferredTerm
modified: 2014-10-14T15:46:35+02:00
created: 2014-01-15T14:54:24+01:00
status: 1

avion ambulance
type: SimpleNonPreferredTerm
modified: 2014-10-14T15:46:35+02:00
created: 2014-01-15T14:54:24+01:00
status: 1

avion de largage parachutiste
type: SimpleNonPreferredTerm
modified: 2014-10-14T15:46:35+02:00
created: 2014-01-15T14:54:24+01:00
status: 1

assiette montée
type: Concept
modified: 2014-12-08T16:27:35+01:00
in scheme: Thésaurus de la désignation des objets mobiliers
preferred label: pedestal plates @en-us
broader: récipient pour le service ou la consommation des aliments
alternative label: serviteur muet
alternative label: assiette montée double
alternative label: guéridon
created: 2012-05-16T00:00:00+02:00
related: surtout de table
related: plateau
related: pot à crème
related: tasse à glace
definition: Assiette de service plus ou moins creuse ou plateau sans marli, en céramique, métal ou verre, montée sur un pied, pour la présentation d'aliments sucrés ou de tasses à glaces. L’assiette montée peut être constituée d’un ou plusieurs plateaux ou corbeilles superposés et peut fonctionner par paire.
TermeAssocie: surtout de table
TermeAssocie: plateau
TermeAssocie: pot à crème
TermeAssocie: tasse à glace
status: 1
broad match: http://data.bnf.fr/ark:/12148/cb150560668

serviteur muet
type: SimpleNonPreferredTerm
modified: 2014-12-08T16:27:35+01:00
created: 2014-01-15T14:54:24+01:00
status: 1

pot à crème
type: Concept
modified: 2014-12-08T16:58:21+01:00
in scheme: Thésaurus de la désignation des objets mobiliers
preferred label: custard cups @en-us
broader: récipient pour le service ou la consommation des aliments
alternative label: pot à jus
created: 2012-05-16T00:00:00+02:00
related: plateau
related: assiette montée
definition: Petit récipient circulaire généralement couvert, en céramique, à fond plat ou sur pied bas, muni d'une anse latérale, contenant une portion individuelle de crème. Les pots à crème sont toujours en série, parfois disposés sur un plateau ou une assiette montée assortis ou encastrés dans une monture métallique.
TermeAssocie: plateau
TermeAssocie: assiette montée
status: 1

assiette montée double
type: SimpleNonPreferredTerm
modified: 2014-12-08T16:27:35+01:00
created: 2014-01-15T14:54:24+01:00
status: 1

guéridon
type: SimpleNonPreferredTerm
modified: 2014-12-08T16:27:35+01:00
created: 2014-01-15T14:54:24+01:00
status: 1

tasse à glace
type: Concept
modified: 2014-12-10T13:38:12+01:00
in scheme: Thésaurus de la désignation des objets mobiliers
broader: récipient pour le service ou la consommation des aliments
alternative label: tasse à sorbet
created: 2012-05-16T00:00:00+02:00
related: plateau
related: assiette montée
definition: Petite tasse en porcelaine pour le service et la consommation d'un dessert glacé. Elle fait toujours partie d'une série, souvent posée sur un plateau ou une assiette montée.
TermeAssocie: plateau
TermeAssocie: assiette montée
status: 1
broad match: http://vocab.getty.edu/aat/300201864

assiette montée
type: PreferredTerm
modified: 2014-12-08T16:27:35+01:00
created: 2014-01-15T14:54:24+01:00
status: 1

crochet
type: Concept
modified: 2014-12-10T14:21:38+01:00
in scheme: Thésaurus de la désignation des objets mobiliers
preferred label: crochet hooks @en-us
broader: objet ou matériel pour les ouvrages textiles
alternative label: crochet tunisien
alternative label: crochet triboulet
created: 2012-05-16T00:00:00+02:00
definition: Tige dont une extrémité est recourbée pour accrocher le fil, le nouer et ainsi former les mailles de l’ouvrage.
status: 1
broad match: cb11933707j

crochet
type: PreferredTerm
modified: 2014-12-10T14:21:38+01:00
created: 2014-01-15T14:54:24+01:00
status: 1

crochet triboulet
type: SimpleNonPreferredTerm
modified: 2014-12-10T14:21:38+01:00
created: 2014-01-15T14:54:24+01:00
status: 1

crochet tunisien
type: SimpleNonPreferredTerm
modified: 2014-12-10T14:21:38+01:00
created: 2014-01-15T14:54:24+01:00
status: 1

wagon couvert
type: Concept
modified: 2014-12-18T10:26:37+01:00
in scheme: Thésaurus de la désignation des objets mobiliers
preferred label: boxcars @en-us
broader: matériel remorqué pour le transport ferroviaire des marchandises
created: 2013-11-04T00:00:00+01:00
definition: Véhicule ferroviaire fermé constitué d'une caisse, généralement en bois, recouverte d'un matériau étanche permettant de transporter des marchandises fragiles ou craignant les intempéries. Il comporte une ou deux portes de grande largeur par côté afin de permettre chargements et déchargements.
status: 1
broad match: cb11931174j

wagon couvert
type: PreferredTerm
modified: 2014-12-18T10:26:38+01:00
created: 2014-01-15T14:54:24+01:00
status: 1

balance de précision
type: Concept
modified: 2014-12-15T15:16:39+01:00
in scheme: Thésaurus de la désignation des objets mobiliers
preferred label: balances (scales) @en-us
broader: instrument de mesure des masses
alternative label: balance accélérée
alternative label: trébuchet (balance)
created: 2012-05-16T00:00:00+02:00
related: balance
definition: Appareil qui sert à faire connaître la masse d'un corps et qui se compose essentiellement d'un levier dont un bras porte le poids et l'autre l'objet que l'on veut peser.
TermeAssocie: balance
status: 1

instrument de mesure des masses
type: Concept
modified: 2014-12-15T15:15:03+01:00
in scheme: Thésaurus de la désignation des objets mobiliers
narrower: balance de précision
broader: instrument de mesure
created: 2012-05-16T00:00:00+02:00
related: machine à peser
definition: Instrument de mesure des masses, servant à peser, au moyen d'un fléau mobile et de plateaux dont l'un porte la chose à peser, l'autre des masses marquées, ou avec une masse constante et mobile par rapport à son point de suspension. Les mesures sont exprimées en multiples et fractions de grammes, ou en unités d'Ancien Régime.
TermeAssocie: machine à peser
status: 1

balance de précision
type: PreferredTerm
modified: 2014-12-15T15:16:39+01:00
created: 2014-01-15T14:54:24+01:00
status: 1

trébuchet (balance)
type: SimpleNonPreferredTerm
modified: 2014-12-15T15:16:39+01:00
created: 2014-01-15T14:54:24+01:00
status: 1

balance accélérée
type: SimpleNonPreferredTerm
modified: 2014-12-15T15:16:39+01:00
created: 2014-01-15T14:54:24+01:00
status: 1

jarre
type: Concept
modified: 2014-12-08T11:50:53+01:00
in scheme: Thésaurus de la désignation des objets mobiliers
preferred label: jars @en-us
broader: récipient pour la conservation des aliments ou des boissons
alternative label: réserve à grains
created: 2012-05-16T00:00:00+02:00
definition: Grand récipient en grès, en poterie plombifère ou en vannerie, pour la conservation d'aliments et de boissons. Elle est de section circulaire à profil galbé, à fond plat et large ouverture supérieure bordée d'un gros bourrelet permettant de la fermer. La jarre, où l'on puise directement, est dépourvue d'éléments verseurs et de prise. Elle est parfois fixe et encastrée dans le sol.
status: 1

jarre
type: PreferredTerm
modified: 2014-12-08T11:50:53+01:00
created: 2014-01-15T14:54:24+01:00
status: 1

réserve à grains
type: SimpleNonPreferredTerm
modified: 2014-12-08T11:50:53+01:00
created: 2014-01-15T14:54:24+01:00
status: 1

napperon liturgique
type: Concept
modified: 2014-01-10T00:00:00+01:00
in scheme: Thésaurus de la désignation des objets mobiliers
broader: linge et garniture liés aux fêtes liturgiques et au culte domestique
created: 2012-05-16T00:00:00+02:00
definition: Napperon destiné aux fêtes du Nouvel An (Rosh ha-Shanah), de Grand Pardon (Yom Kippour), des Cabanes (Soukkot), de Pâque (Pessah) ou de la Pentecôte (Shavou'ot), etc. Ces napperons sont blancs car ils sont utilisés pour des jours de Jugement, de contours irréguliers et leurs broderies centrales présentent les symboles de ces fêtes, shofar, branches de saule, etc.
status: 1

napperon liturgique
type: PreferredTerm
modified: 2014-01-10T00:00:00+01:00
created: 2014-01-15T14:54:24+01:00
status: 1

tronc de synagogue
type: Concept
modified: 2014-01-10T00:00:00+01:00
in scheme: Thésaurus de la désignation des objets mobiliers
broader: meuble du culte synagogal
created: 2012-05-16T00:00:00+02:00
definition: Tronc que l'on trouve parfois accroché ou scellé au mur du vestibule d'une synagogue. Certains sont surmontés d'une main tendue. Ne pas confondre avec le tronc à quêter de la religion juive.
status: 1

tronc de synagogue
type: PreferredTerm
modified: 2014-01-10T00:00:00+01:00
created: 2014-01-15T14:54:24+01:00
status: 1

convertisseur de pression
type: Concept
modified: 2015-10-07T14:09:44+02:00
in scheme: Thésaurus de la désignation des objets mobiliers
broader: convertisseur
alternative label: surpresseur
created: 2012-05-16T00:00:00+02:00
definition: Convertisseur permettant une adaptation débit/pression d'un fluide ou d'un gaz.
status: 1

convertisseur de pression
type: PreferredTerm
modified: 2015-10-07T14:09:44+02:00
created: 2014-01-15T14:54:24+01:00
status: 1

surpresseur
type: SimpleNonPreferredTerm
modified: 2015-10-07T14:09:44+02:00
created: 2014-01-15T14:54:24+01:00
status: 1

guitare électrique
type: Concept
modified: 2014-12-15T11:39:54+01:00
in scheme: Thésaurus de la désignation des objets mobiliers
preferred label: electric guitars @en-us
broader: guitare
alternative label: guitare basse
created: 2012-05-16T00:00:00+02:00
definition: Guitare sans caisse de résonance, dont le son est amplifié électriquement.
status: 1

guitare basse
type: SimpleNonPreferredTerm
modified: 2014-12-15T11:39:54+01:00
created: 2014-01-15T14:54:24+01:00
status: 1

guitare
type: Concept
modified: 2014-12-15T11:38:46+01:00
in scheme: Thésaurus de la désignation des objets mobiliers
preferred label: guitars @en-us
narrower: guitare électrique
narrower: guitare-lyre
broader: cordophone composite à manche et cordes pincées
created: 2012-05-16T00:00:00+02:00
definition: Instrument à caisse plate ou bombée à quatre ou cinq chœurs de cordes jusqu'au XVIIIe siècle ; les chœurs deviennent six cordes simples vers 1800 et la rose se transforme en bouche.
status: 1

guitare électrique
type: PreferredTerm
modified: 2014-12-15T11:39:54+01:00
created: 2014-01-15T14:54:24+01:00
status: 1

pot à filtrer l'eau-de-vie
type: SimpleNonPreferredTerm
modified: 2014-12-08T12:55:39+01:00
created: 2014-01-15T14:54:24+01:00
status: 1

pot à filtrer
type: PreferredTerm
modified: 2014-12-08T12:55:39+01:00
created: 2014-01-15T14:54:24+01:00
status: 1

pot à filtrer les macérations
type: SimpleNonPreferredTerm
modified: 2014-12-08T12:55:39+01:00
created: 2014-01-15T14:54:24+01:00
status: 1

pot à tisane
type: SimpleNonPreferredTerm
modified: 2014-12-08T12:55:39+01:00
created: 2014-01-15T14:54:24+01:00
status: 1

générateur thermoélectrique
type: Concept
modified: 2015-10-07T16:30:16+02:00
in scheme: Thésaurus de la désignation des objets mobiliers
broader: générateur électrique continu
created: 2012-05-16T00:00:00+02:00
related: instrument de mesure des phénomènes d'induction magnétique
definition: Générateur produisant, à partir d’une source de chaleur, un courant électrique continu.
TermeAssocie: instrument de mesure des phénomènes d'induction magnétique
status: 1
narrow match: Générateur thermoélectrique à radioisotope

générateur thermoélectrique
type: PreferredTerm
modified: 2015-10-07T16:30:16+02:00
created: 2014-01-15T14:54:24+01:00
status: 1

instrument de mesure des phénomènes d'induction magnétique
type: Concept
modified: 2014-12-15T15:02:17+01:00
in scheme: Thésaurus de la désignation des objets mobiliers
broader: T69-5249
alternative label: boussole des sinus
alternative label: boussole des tangentes
created: 2012-05-16T00:00:00+02:00
related: générateur thermoélectrique
definition: En électrodynamique, instrument de mesure et/ou de repérage des angles formés par la déviation d'un mobile aimanté sous les effets d'un courant électrique (phénomènes d'induction magnétique).
TermeAssocie: générateur thermoélectrique
status: 1
broad match: http://data.bnf.fr/ark:/12148/cb119324889
broad match: http://vocab.getty.edu/aat/300195806

générateur électrique continu
type: Concept
modified: 2015-10-07T16:15:53+02:00
in scheme: Thésaurus de la désignation des objets mobiliers
narrower: générateur électrochimique
narrower: générateur thermoélectrique
narrower: T69-6096
narrower: T69-6098
broader: générateur électrique
created: 2012-05-16T00:00:00+02:00
definition: Générateur électrique produisant un courant électrique continu.
status: 1
broad match: Générateur électrique

couverture de lit
type: Concept
modified: 2014-12-12T12:27:14+01:00
in scheme: Thésaurus de la désignation des objets mobiliers
preferred label: bed coverings @en-us
broader: garniture de lit
alternative label: couverture
created: 2012-05-16T00:00:00+02:00
definition: Pièce d'étoffe que l'on étend sur le lit pour garantir les dormeurs du froid. Elle peut être en fourrure, en laine tissée ou en tissu précieux bridé et enrichi, souvent ouaté.
status: 1

couverture
type: SimpleNonPreferredTerm
modified: 2014-12-12T12:27:14+01:00
created: 2014-01-15T14:54:24+01:00
status: 1

couverture de lit
type: PreferredTerm
modified: 2014-12-12T12:27:14+01:00
created: 2014-01-15T14:54:24+01:00
status: 1

table à pâtisserie
type: SimpleNonPreferredTerm
modified: 2014-10-10T16:54:25+02:00
created: 2014-01-15T14:54:24+01:00
status: 1

blutoir domestique
type: Concept
modified: 2014-10-10T16:55:30+02:00
in scheme: Thésaurus de la désignation des objets mobiliers
preferred label: flour sifters @en-us
broader: meuble pour farine ou pain
created: 2012-05-16T00:00:00+02:00
definition: Instrument servant à séparer le son de la farine. Il est généralement intégré dans un meuble en forme de bas d'armoire ou de coffre.
status: 1
broad match: http://data.bnf.fr/ark:/12148/cb131630461

pétrin
type: Concept
modified: 2014-12-04T12:46:01+01:00
in scheme: Thésaurus de la désignation des objets mobiliers
preferred label: dough troughs @en-us
broader: meuble pour farine ou pain
created: 2012-05-16T00:00:00+02:00
related: machine à pétrir
definition: Caisse ouverte ou fermée peu haute, souvent montée sur pieds, servant à fabriquer la pâte à pain. Elle servait en outre, à conserver le pain ou d'autres aliments, à ranger des récipients ou de la vaisselle, etc.
TermeAssocie: machine à pétrir
status: 1

table à porter le pain
type: SimpleNonPreferredTerm
modified: 2014-10-10T16:54:25+02:00
created: 2014-01-15T14:54:24+01:00
status: 1

broyeur à pâte
type: SimpleNonPreferredTerm
modified: 2014-10-10T16:54:25+02:00
created: 2014-01-15T14:54:24+01:00
status: 1

pile-mil
type: SimpleNonPreferredTerm
modified: 2014-10-10T16:54:25+02:00
created: 2014-01-15T14:54:24+01:00
status: 1

meuble pour farine ou pain
type: PreferredTerm
modified: 2014-10-10T16:54:25+02:00
created: 2014-01-15T14:54:24+01:00
status: 1

chaise à prie-Dieu
type: Concept
modified: 2014-12-02T14:39:29+01:00
in scheme: Thésaurus de la désignation des objets mobiliers
preferred label: sedia con inginocchiatoio @it
preferred label: prie-dieu with chair @en-us
preferred label: genuflexório com cadeira @pt
broader: chaise d'église
created: 2012-05-16T00:00:00+02:00
definition: Chaise comportant un agenouilloir au revers et souvent un accoudoir au sommet du dossier.
status: 1

chaise à prie-Dieu
type: PreferredTerm
modified: 2014-12-02T14:39:29+01:00
created: 2014-01-15T14:54:24+01:00
status: 1

chandelier d'autel orthodoxe
type: Concept
modified: 2014-01-10T00:00:00+01:00
in scheme: Thésaurus de la désignation des objets mobiliers
broader: objet du culte orthodoxe
created: 2012-05-16T00:00:00+02:00
scope note: Chandelier utilisé en nombre variable, posé par terre ou placé sur l'autel dans le cas où il n'y a pas de chandelier à sept branches.
status: 1

chandelier d'autel orthodoxe
type: PreferredTerm
modified: 2014-01-10T00:00:00+01:00
created: 2014-01-15T14:54:24+01:00
status: 1

bougeoir d'église
type: Concept
modified: 2014-10-21T15:38:27+02:00
in scheme: Thésaurus de la désignation des objets mobiliers
broader: objet pour l'éclairage
created: 2012-09-17T00:00:00+02:00
definition: Support pour une seule bougie qui se distingue généralement de l’objet civil par ses inscriptions ou son décor.
status: 1

bougeoir pontifical
type: Concept
modified: 2014-12-01T11:28:33+01:00
in scheme: Thésaurus de la désignation des objets mobiliers
preferred label: palmatoria @it
preferred label: bugias (pontifical) @en-us
preferred label: candela @pt
broader: objet pour l'éclairage
alternative label: bougeoir d'évêque
alternative label: bougeoir porte-cire
created: 2012-05-16T00:00:00+02:00
related: chapelle de messe
related: voile huméral
related: bougeoir
definition: Bougeoir, souvent à manche réserve, généralement en argent. Réservé aux prélats de haut rang dont il peut porter les armoiries, il est utilisé lors des messes pontificales.
TermeAssocie: chapelle de messe
TermeAssocie: voile huméral
TermeAssocie: bougeoir
status: 1

allumoir-éteignoir d'église
type: SimpleNonPreferredTerm
modified: 2014-12-01T11:25:07+01:00
created: 2014-01-15T14:54:24+01:00
status: 1

objet pour l'éclairage
type: PreferredTerm
modified: 2014-12-01T11:25:07+01:00
created: 2014-01-15T14:54:24+01:00
status: 1

cabane de Soukkot
type: Concept
modified: 2014-01-10T00:00:00+01:00
in scheme: Thésaurus de la désignation des objets mobiliers
broader: meuble du culte synagogal
alternative label: soukkah
created: 2012-05-16T00:00:00+02:00
scope note: Cabane éphémère, au toit de palmes ou de roseaux, construite au moment de la fête des Cabanes (ou des Tabernacles) ou de Soukkot dans la cour intérieure de la synagogue ; certains éléments décorés, piquets, planches peintes simulant le mur et le toit, portes, etc. peuvent être réutilisés et sont durables. Cette cabane peut également être dressée dans la maison ou le jardin des particuliers. Les cabanes rappelant l'expérience des Juifs dans le désert sont des constructions éphémères mais, dans le domaine civil ou public, certains éléments peuvent en être retrouvés.
status: 1

cabane de Soukkot
type: PreferredTerm
modified: 2014-01-10T00:00:00+01:00
created: 2014-01-15T14:54:24+01:00
status: 1

soukkah
type: SimpleNonPreferredTerm
modified: 2014-01-10T00:00:00+01:00
created: 2014-01-15T14:54:24+01:00
status: 1

heurtoir
type: Concept
modified: 2015-01-23T17:08:46+01:00
in scheme: Thésaurus de la désignation des objets mobiliers
preferred label: door knockers @en-us
broader: élément de serrurerie
alternative label: marteau de porte
created: 2012-05-16T00:00:00+02:00
definition: Marteau fixé à la porte d'entrée d'une demeure dont on se sert pour frapper en le faisant retomber, sur le contre-heurtoir ou enclume. La porte sert alors de caisse de résonance.
status: 1

marteau de porte
type: SimpleNonPreferredTerm
modified: 2015-01-23T17:08:46+01:00
created: 2014-01-15T14:54:24+01:00
status: 1

heurtoir
type: PreferredTerm
modified: 2015-01-23T17:08:46+01:00
created: 2014-01-15T14:54:24+01:00
status: 1

tabouret d'église
type: PreferredTerm
modified: 2014-12-02T15:19:22+01:00
created: 2014-01-15T14:54:24+01:00
status: 1

peinture
type: Concept
modified: 2014-10-17T16:00:42+02:00
in scheme: Thésaurus de la désignation des objets mobiliers
preferred label: paintings (visual works) @en-us
narrower: tableau
narrower: peinture monumentale
narrower: enluminure
broader: peinture, arts graphiques et des média
alternative label: panneau peint
created: 2012-05-16T00:00:00+02:00
related: dessus-de-baie
related: trumeau de cheminée
related: dessus-de-fenêtre
related: dessus-de-porte
definition: Œuvre résultant de l'art de peindre. La peinture est constituée d'un support et d'une couche picturale, même si celle-ci, notamment dans l'art contemporain, ne comporte pas forcément de peinture stricto sensu.
TermeAssocie: dessus-de-baie
TermeAssocie: trumeau de cheminée
TermeAssocie: dessus-de-fenêtre
TermeAssocie: dessus-de-porte
status: 1

dessus-de-fenêtre
type: Concept
modified: 2015-01-07T17:07:57+01:00
in scheme: Thésaurus de la désignation des objets mobiliers
broader: dessus-de-baie
created: 2012-05-16T00:00:00+02:00
related: sculpture
related: peinture
definition: Couronnement (élément décoratif, tableau, relief) placé au-dessus d'une fenêtre.
TermeAssocie: sculpture
TermeAssocie: peinture
status: 1
broad match: http://data.bnf.fr/ark:/12148/cb119470878
broad match: Fenêtre

panneau peint
type: SimpleNonPreferredTerm
modified: 2014-10-17T16:00:42+02:00
created: 2014-01-15T14:54:24+01:00
status: 1

dessus-de-porte
type: Concept
modified: 2015-01-07T16:42:12+01:00
in scheme: Thésaurus de la désignation des objets mobiliers
preferred label: overdoors @en-us
broader: dessus-de-baie
created: 2012-05-16T00:00:00+02:00
related: sculpture
related: peinture
definition: Couronnement (élément décoratif, tableau, relief) placé au-dessus d'une porte.
TermeAssocie: sculpture
TermeAssocie: peinture
status: 1
broad match: cb11948204j

peinture
type: PreferredTerm
modified: 2014-10-17T16:00:42+02:00
created: 2014-01-15T14:54:24+01:00
status: 1

enluminure
type: Concept
modified: 2014-12-03T16:04:56+01:00
in scheme: Thésaurus de la désignation des objets mobiliers
preferred label: illuminations (visual works) @en-us
broader: peinture
created: 2012-05-16T00:00:00+02:00
definition: Peinture ou dessin réalisé pour constituer l'illustration ou le décor d'un livre, d'un document d'archives, d'une charte, d'un diplôme, d'une table canons, etc.
status: 1

reliquaire
type: Concept
modified: 2014-11-26T16:54:24+01:00
in scheme: Thésaurus de la désignation des objets mobiliers
preferred label: reliquiario @it
preferred label: reliquaries @en-us
preferred label: relicàrio @pt
narrower: reliquaire morphologique
narrower: croix-reliquaire
narrower: reliquaire-ostensoir
narrower: reliquaire-monstrance
narrower: tableau-reliquaire
narrower: statue-reliquaire
narrower: T69-1715
narrower: T69-1732
narrower: T69-1717
narrower: T69-1728
narrower: T69-1724
broader: objet de dévotion
created: 2012-05-16T00:00:00+02:00
related: capsella
related: voile huméral
related: armoire à reliquaires
related: boîte de reliquaire
related: T69-4570
definition: Objet destiné à conserver ou à exposer des reliques. Il existe deux grandes catégories de reliquaires : les reliquaires de grande taille, souvent exposés sur des autels (châsse, reliquaire morphologique, croix-reliquaire, tableau-reliquaire, etc.) et les reliquaires portatifs (encolpion, etc.). De petites châsses contenant des reliques ou divers objets sacrés peuvent en outre être placées dans les autels (capsella). Les reliquaires contiennent souvent des attestations d'authenticité des reliques appelées authentiques. Certains meubles ou objets des églises peuvent contenir des reliques et devenir ainsi des reliquaires (gradin-reliquaire, tabernacle-reliquaire, ostensoir-reliquaire, etc.).
TermeAssocie: capsella
TermeAssocie: voile huméral
TermeAssocie: armoire à reliquaires
TermeAssocie: boîte de reliquaire
TermeAssocie: T69-4570
status: 1

coffret à reliques d'autel
type: SimpleNonPreferredTerm
modified: 2014-11-27T12:52:27+01:00
created: 2014-01-15T14:54:24+01:00
status: 1

capsella
type: PreferredTerm
modified: 2014-11-27T12:52:27+01:00
created: 2014-01-15T14:54:24+01:00
status: 1

boîte à reliques d'autel
type: SimpleNonPreferredTerm
modified: 2014-11-27T12:52:27+01:00
created: 2014-01-15T14:54:24+01:00
status: 1

garde-feu
type: SimpleNonPreferredTerm
modified: 2014-10-10T17:12:20+02:00
created: 2014-01-15T14:54:24+01:00
status: 1

écran pare-étincelles
type: PreferredTerm
modified: 2014-10-10T17:12:20+02:00
created: 2014-01-15T14:54:24+01:00
status: 1

pare-feu
type: SimpleNonPreferredTerm
modified: 2014-10-10T17:12:20+02:00
created: 2014-01-15T14:54:24+01:00
status: 1

armure ou élément d'armure
type: PreferredTerm
modified: 2014-12-12T12:39:21+01:00
created: 2014-01-15T14:54:24+01:00
status: 1

harnois
type: SimpleNonPreferredTerm
modified: 2014-12-12T12:39:21+01:00
created: 2014-01-15T14:54:24+01:00
status: 1

plastron d'armure
type: SimpleNonPreferredTerm
modified: 2014-12-12T12:39:21+01:00
created: 2014-01-15T14:54:24+01:00
status: 1

soleret
type: SimpleNonPreferredTerm
modified: 2014-12-12T12:39:21+01:00
created: 2014-01-15T14:54:24+01:00
status: 1

jambière d'armure
type: SimpleNonPreferredTerm
modified: 2014-12-12T12:39:21+01:00
created: 2014-01-15T14:54:24+01:00
status: 1

cubitière
type: SimpleNonPreferredTerm
modified: 2014-12-12T12:39:21+01:00
created: 2014-01-15T14:54:24+01:00
status: 1

grève
type: SimpleNonPreferredTerm
modified: 2014-12-12T12:39:21+01:00
created: 2014-01-15T14:54:24+01:00
status: 1

hausse-col
type: SimpleNonPreferredTerm
modified: 2014-12-12T12:39:21+01:00
created: 2014-01-15T14:54:24+01:00
status: 1

locomotive diesel de ligne
type: SimpleNonPreferredTerm
modified: 2014-12-18T10:13:39+01:00
created: 2014-01-15T14:54:24+01:00
status: 1

locotracteur
type: SimpleNonPreferredTerm
modified: 2014-12-18T10:13:39+01:00
created: 2014-01-15T14:54:24+01:00
status: 1

locomotive diesel-électrique
type: SimpleNonPreferredTerm
modified: 2014-12-18T10:13:39+01:00
created: 2014-01-15T14:54:24+01:00
status: 1

locomoteur
type: SimpleNonPreferredTerm
modified: 2014-12-18T10:13:39+01:00
created: 2014-01-15T14:54:24+01:00
status: 1

locomotive thermique
type: PreferredTerm
modified: 2014-12-18T10:13:39+01:00
created: 2014-01-15T14:54:24+01:00
status: 1

culot
type: Concept
modified: 2015-02-05T17:31:25+01:00
in scheme: Thésaurus de la désignation des objets mobiliers
broader: support en surplomb
created: 2012-05-16T00:00:00+02:00
definition: Organe en surplomb portant une charge, formé d'un seul élément taillé en cône, en pyramide renversée ou en quart de sphère.
status: 1

culot
type: PreferredTerm
modified: 2015-02-05T17:31:25+01:00
created: 2014-01-15T14:54:24+01:00
status: 1

bât ou ses accessoires
type: Concept
modified: 2014-12-30T11:18:44+01:00
in scheme: Thésaurus de la désignation des objets mobiliers
preferred label: packsaddles @en-us
broader: harnachement ou attelage
alternative label: panier de bât
alternative label: échelette de bât
created: 2013-11-05T00:00:00+01:00
definition: Dispositif et tous ses accessoires que l'on attache sur le dos de certains animaux pour leur faire porter une charge.
status: 1
broad match: http://data.bnf.fr/ark:/12148/cb11990462c

bât ou ses accessoires
type: PreferredTerm
modified: 2014-12-30T11:18:44+01:00
created: 2014-01-15T14:54:24+01:00
status: 1

panier de bât
type: SimpleNonPreferredTerm
modified: 2014-12-30T11:18:44+01:00
created: 2014-01-15T14:54:24+01:00
status: 1

échelette de bât
type: SimpleNonPreferredTerm
modified: 2014-12-30T11:18:44+01:00
created: 2014-01-15T14:54:24+01:00
status: 1

rose d'or
type: Concept
modified: 2014-11-27T10:40:41+01:00
in scheme: Thésaurus de la désignation des objets mobiliers
preferred label: golden roses @en-us
preferred label: rosa d'oro @it
preferred label: rosa de ouro @pt
broader: objet de dévotion
created: 2012-05-16T00:00:00+02:00
definition: Objet précieux symbolique, offert chaque année par le pape à une église ou à une personnalité, pour l'honorer. La rose d'or se présente comme une branche de rosier, en or ou en argent doré, parfois montée sur un support. La fleur centrale comporte au sein de ses pétales une petite boîte contenant du saint Chrême et du baume parfumé.
status: 1
broad match: http://vocab.getty.edu/aat/300234144

rose d'or
type: PreferredTerm
modified: 2014-11-27T10:40:41+01:00
created: 2014-01-15T14:54:24+01:00
status: 1

calvaire
type: Concept
modified: 2014-11-26T15:55:35+01:00
in scheme: Thésaurus de la désignation des objets mobiliers
preferred label: calvario @it
preferred label: Calvaries @en-us
preferred label: calvário @pt
broader: croix
alternative label: calvaire de jubé
alternative label: calvaire de poutre de gloire
created: 2012-09-13T00:00:00+02:00
related: poutre de gloire
related: jubé
definition: Ensemble sculpté représentant le Christ en croix entouré de la Vierge et de saint Jean que l’on trouve en particulier au sommet d'un jubé ou sur une poutre de gloire.
TermeAssocie: poutre de gloire
TermeAssocie: jubé
status: 1

jubé
type: Concept
modified: 2014-12-01T14:45:30+01:00
in scheme: Thésaurus de la désignation des objets mobiliers
preferred label: pontile @it
preferred label: rood screens @en-us
preferred label: jubéu @pt
broader: clôture de choeur
created: 2012-05-16T00:00:00+02:00
related: croix
related: calvaire
definition: Clôture monumentale séparant le chœur liturgique de la nef et servant aussi à lire l'Evangile. Le jubé comporte souvent deux petits autels de part et d'autre de l'entrée, une plate-forme et une coursière généralement surmontée d'une croix ou d'un calvaire.
TermeAssocie: croix
TermeAssocie: calvaire
status: 1

calvaire de jubé
type: SimpleNonPreferredTerm
modified: 2014-11-26T15:55:35+01:00
created: 2014-01-15T14:54:24+01:00
status: 1

calvaire de poutre de gloire
type: SimpleNonPreferredTerm
modified: 2014-11-26T15:55:35+01:00
created: 2014-01-15T14:54:24+01:00
status: 1

calvaire
type: PreferredTerm
modified: 2014-11-26T15:55:35+01:00
created: 2014-01-15T14:54:24+01:00
status: 1

wagon citerne
type: Concept
modified: 2014-12-18T10:25:29+01:00
in scheme: Thésaurus de la désignation des objets mobiliers
preferred label: tank cars @en-us
broader: matériel remorqué pour le transport ferroviaire des marchandises
created: 2013-11-04T00:00:00+01:00
definition: Véhicule ferroviaire comprenant un réservoir étanche, généralement métallique, pour le transport des liquides.
status: 1

wagon citerne
type: PreferredTerm
modified: 2014-12-18T10:25:29+01:00
created: 2014-01-15T14:54:24+01:00
status: 1

bombardier
type: Concept
modified: 2014-12-17T14:07:16+01:00
in scheme: Thésaurus de la désignation des objets mobiliers
preferred label: bombers @en-us
broader: avion militaire
alternative label: avion d'assaut
alternative label: bombardier en piqué
alternative label: avion d'attaque au sol
alternative label: bombardier horizontal
created: 2013-11-06T00:00:00+01:00
definition: Avion embarquant des charges offensives et effectuant des missions de bombardement.
status: 1

bombardier horizontal
type: SimpleNonPreferredTerm
modified: 2014-12-17T14:07:16+01:00
created: 2014-01-15T14:54:24+01:00
status: 1

avion d'attaque au sol
type: SimpleNonPreferredTerm
modified: 2014-12-17T14:07:16+01:00
created: 2014-01-15T14:54:24+01:00
status: 1

bombardier en piqué
type: SimpleNonPreferredTerm
modified: 2014-12-17T14:07:16+01:00
created: 2014-01-15T14:54:24+01:00
status: 1

avion d'assaut
type: SimpleNonPreferredTerm
modified: 2014-12-17T14:07:16+01:00
created: 2014-01-15T14:54:24+01:00
status: 1

bombardier
type: PreferredTerm
modified: 2014-12-17T14:07:16+01:00
created: 2014-01-15T14:54:24+01:00
status: 1

chope
type: PreferredTerm
modified: 2014-12-08T15:53:25+01:00
created: 2014-01-15T14:54:24+01:00
status: 1

machine à démêler
type: Concept
modified: 2015-10-15T14:48:46+02:00
in scheme: Thésaurus de la désignation des objets mobiliers
broader: machine à arranger
alternative label: carde
alternative label: carde briseuse
alternative label: carde nappeuse
alternative label: carde fileuse
alternative label: cardeuse
created: 2012-05-16T00:00:00+02:00
definition: Machine à arranger des fibres textiles enchevêtrées en les séparant les unes des autres et en les disposant parallèlement de manière à former un ruban prêt à être filé.
status: 1
narrow match: Carde
narrow match: http://vocab.getty.edu/aat/300400775

carde nappeuse
type: SimpleNonPreferredTerm
modified: 2015-10-15T14:48:46+02:00
created: 2014-01-15T14:54:24+01:00
status: 1

machine à démêler
type: PreferredTerm
modified: 2015-10-15T14:48:46+02:00
created: 2014-01-15T14:54:24+01:00
status: 1

carde fileuse
type: SimpleNonPreferredTerm
modified: 2015-10-15T14:48:46+02:00
created: 2014-01-15T14:54:24+01:00
status: 1

machine à arranger
type: Concept
modified: 2015-10-15T14:44:24+02:00
in scheme: Thésaurus de la désignation des objets mobiliers
narrower: machine à démêler
narrower: machine à pelotonner
broader: machine à organiser
alternative label: dévideuse à pots
alternative label: ourdissoir
alternative label: ourdissoir sectionnel
alternative label: dévidoir
alternative label: détordeuse
created: 2012-05-16T00:00:00+02:00
definition: Machine à organiser des produits en vue de répondre aux exigences de commercialisation ou de fabrication.
status: 1
narrow match: http://vocab.getty.edu/aat/300403949
narrow match: Dévidoir

cardeuse
type: SimpleNonPreferredTerm
modified: 2015-10-15T14:48:46+02:00
created: 2014-01-15T14:54:24+01:00
status: 1

carde
type: SimpleNonPreferredTerm
modified: 2015-10-15T14:48:46+02:00
created: 2014-01-15T14:54:24+01:00
status: 1

carde briseuse
type: SimpleNonPreferredTerm
modified: 2015-10-15T14:48:46+02:00
created: 2014-01-15T14:54:24+01:00
status: 1

console
type: Concept
modified: 2014-12-05T10:29:05+01:00
in scheme: Thésaurus de la désignation des objets mobiliers
preferred label: consoles (brackets) @en-us
broader: support pour le bureau ou les loisirs
created: 2012-05-16T00:00:00+02:00
definition: Etagère suspendue plus haut que l'appui, à une seule tablette, servant à exposer une statue, une horloge, un vase, etc. Elle peut être d'encoignure.
status: 1

support pour le bureau ou les loisirs
type: Concept
modified: 2014-09-11T16:00:27+02:00
in scheme: Thésaurus de la désignation des objets mobiliers
narrower: console
narrower: compteur de billard
narrower: porte-globe
narrower: présentoir à documents
narrower: porte-fusils
narrower: piédestal
narrower: porte-papiers
narrower: porte-cannes de billard
broader: meuble de rangement et d'exposition
created: 2012-05-16T00:00:00+02:00
definition: Elément servant à poser ou ranger divers objets liés aux activités de bureau ou de divertissement.
status: 1
broad match: http://vocab.getty.edu/aat/300039337

console
type: PreferredTerm
modified: 2014-12-05T10:29:05+01:00
created: 2014-01-15T14:54:24+01:00
status: 1

instrument de mesure des forces des poids ou des pressions
type: Concept
modified: 2014-12-15T15:08:02+01:00
in scheme: Thésaurus de la désignation des objets mobiliers
narrower: baromètre
narrower: instrument de mesure de vitesse
broader: instrument de mesure
alternative label: peson
alternative label: piézomètre
alternative label: dynamomètre
alternative label: manomètre
created: 2012-05-16T00:00:00+02:00
related: instrument de démonstration en statique des fluides
related: machine à mesurer des paramètres mécaniques
definition: Instrument de mesure de la déformation ou torsion de ressorts, membranes ou capsules, de la compression de fluides sous l'effet de tensions, tractions ou pressions. Mesures exprimées en multiples et sous-multiples du newton, ou en unités de masses.
TermeAssocie: instrument de démonstration en statique des fluides
TermeAssocie: machine à mesurer des paramètres mécaniques
status: 1
narrow match: http://vocab.getty.edu/aat/300195709
narrow match: Manomètre

balance hydrostatique
type: SimpleNonPreferredTerm
modified: 2014-12-15T14:17:27+01:00
created: 2014-01-15T14:54:24+01:00
status: 1

vases communicants
type: SimpleNonPreferredTerm
modified: 2014-12-15T14:17:27+01:00
created: 2014-01-15T14:54:24+01:00
status: 1

tube capillaire
type: SimpleNonPreferredTerm
modified: 2014-12-15T14:17:27+01:00
created: 2014-01-15T14:54:24+01:00
status: 1

tourniquet hydraulique
type: SimpleNonPreferredTerm
modified: 2014-12-15T14:17:27+01:00
created: 2014-01-15T14:54:24+01:00
status: 1

ludion
type: SimpleNonPreferredTerm
modified: 2014-12-15T14:17:27+01:00
created: 2014-01-15T14:54:24+01:00
status: 1

instrument de démonstration en statique des fluides
type: PreferredTerm
modified: 2014-12-15T14:17:27+01:00
created: 2014-01-15T14:54:24+01:00
status: 1

blutoir domestique
type: PreferredTerm
modified: 2014-10-10T16:55:30+02:00
created: 2014-01-15T14:54:24+01:00
status: 1

armoire-lavabo
type: Concept
modified: 2014-10-10T16:12:16+02:00
in scheme: Thésaurus de la désignation des objets mobiliers
preferred label: washstands @en-us
broader: lavabo domestique
created: 2012-05-16T00:00:00+02:00
definition: Table à lavabo dissimulée dans une armoire haute.
status: 1

lavabo domestique
type: Concept
modified: 2014-12-04T12:29:38+01:00
in scheme: Thésaurus de la désignation des objets mobiliers
preferred label: lavatories (sinks) @en-us
narrower: porte-fontaine lavabo
narrower: armoire-lavabo
narrower: table-lavabo
broader: meuble d'hygiène
created: 2012-05-16T00:00:00+02:00
definition: Meuble d'applique constitué d'une cuvette fixe, suspendue ou sur pied(s), servant à se laver. Le lavabo est alimenté par un réservoir ou par l'eau courante.
status: 1
broad match: http://data.bnf.fr/ark:/12148/cb119415458

armoire-lavabo
type: PreferredTerm
modified: 2014-10-10T16:12:16+02:00
created: 2014-01-15T14:54:24+01:00
status: 1

ébrasement
type: Concept
modified: 2014-12-09T15:53:48+01:00
in scheme: Thésaurus de la désignation des objets mobiliers
preferred label: embrasures (openings) @en-us
broader: élément de baie
created: 2012-05-16T00:00:00+02:00
definition: Disposition convergente des côtés d'une embrasure. Par extension, le mot désigne le côté oblique de la baie ébrasée.
status: 1
broad match: http://data.bnf.fr/ark:/12148/cb125704047

élément de baie
type: Concept
modified: 2014-10-15T13:10:20+02:00
in scheme: Thésaurus de la désignation des objets mobiliers
preferred label: opening components @en-us
narrower: fermeture de baie
narrower: ébrasement
broader: baie
created: 2012-05-16T00:00:00+02:00
definition: Partie d’une baie, rapportée ou non, qui la clôt, la réduit, la divise ou l’élargit.
status: 1
broad match: http://data.bnf.fr/ark:/12148/cb125704047
broad match: Baie (architecture)

ébrasement
type: PreferredTerm
modified: 2014-12-09T15:53:48+01:00
created: 2014-01-15T14:54:24+01:00
status: 1

toueur
type: PreferredTerm
modified: 2014-12-19T12:25:48+01:00
created: 2014-01-15T14:54:24+01:00
status: 1

fusil à affûter
type: SimpleNonPreferredTerm
modified: 2014-12-05T16:00:35+01:00
created: 2014-01-15T14:54:24+01:00
status: 1

affûtoir
type: PreferredTerm
modified: 2014-12-05T16:00:35+01:00
created: 2014-01-15T14:54:24+01:00
status: 1

aiguiseur à couteau
type: SimpleNonPreferredTerm
modified: 2014-12-05T16:00:35+01:00
created: 2014-01-15T14:54:24+01:00
status: 1

beurrier
type: Concept
modified: 2014-10-17T10:57:29+02:00
in scheme: Thésaurus de la désignation des objets mobiliers
preferred label: butter dishes (serving dishes) @en-us
broader: récipient pour le service ou la consommation des aliments
alternative label: cloche à beurre
alternative label: beurrier-conservateur
alternative label: coquille à beurre
alternative label: beurrier-rafraîchisseur
created: 2012-05-16T00:00:00+02:00
definition: Récipient en céramique ou en verre pour le service du beurre. Généralement couvert et souvent porté par un plateau assorti, il peut adopter la forme d'une coquille ou d'une assiette accompagnée d’une cloche.
status: 1

beurrier-conservateur
type: SimpleNonPreferredTerm
modified: 2014-10-17T10:57:29+02:00
created: 2014-01-15T14:54:24+01:00
status: 1

cloche à beurre
type: SimpleNonPreferredTerm
modified: 2014-10-17T10:57:29+02:00
created: 2014-01-15T14:54:24+01:00
status: 1

beurrier-rafraîchisseur
type: SimpleNonPreferredTerm
modified: 2014-10-17T10:57:29+02:00
created: 2014-01-15T14:54:24+01:00
status: 1

beurrier
type: PreferredTerm
modified: 2014-10-17T10:57:29+02:00
created: 2014-01-15T14:54:24+01:00
status: 1

coquille à beurre
type: SimpleNonPreferredTerm
modified: 2014-10-17T10:57:29+02:00
created: 2014-01-15T14:54:24+01:00
status: 1

boîte à cédrat
type: Concept
modified: 2014-01-10T00:00:00+01:00
in scheme: Thésaurus de la désignation des objets mobiliers
broader: objet lié à la fête des Cabanes
alternative label: boîte à etrog
created: 2012-05-16T00:00:00+02:00
definition: Récipient couvert, en argent le plus souvent, en forme de gros citron (le cédrat), dans lequel on place ce fruit lors de la fête des Cabanes.
status: 1

objet lié à Soukkot
type: SimpleNonPreferredTerm
modified: 2014-01-10T00:00:00+01:00
created: 2014-01-15T14:54:24+01:00
status: 1

objet lié à la fête des Cabanes
type: PreferredTerm
modified: 2014-01-10T00:00:00+01:00
created: 2014-01-15T14:54:24+01:00
status: 1

objet lié à la fête des Tabernacles
type: SimpleNonPreferredTerm
modified: 2014-01-10T00:00:00+01:00
created: 2014-01-15T14:54:24+01:00
status: 1

jeu d'échecs
type: Concept
modified: 2014-12-30T13:10:07+01:00
in scheme: Thésaurus de la désignation des objets mobiliers
preferred label: chess sets @en-us
broader: jeu de cartes ou de société
alternative label: échiquier
created: 2013-11-29T00:00:00+01:00
definition: Éléments nécessaires à la pratique du jeu d'échecs : un plateau ou échiquier, formé de soixante-quatre cases de deux couleurs alternées (claire et sombre) et de trente-deux pièces de l'une ou l'autre couleur (deux rois, deux dames, quatre tours, quatre fous, quatre cavaliers et seize pions), que se répartissent les deux joueurs.
status: 1

échiquier
type: SimpleNonPreferredTerm
modified: 2014-12-30T13:10:07+01:00
created: 2014-01-15T14:54:24+01:00
status: 1

jeu d'échecs
type: PreferredTerm
modified: 2014-12-30T13:10:07+01:00
created: 2014-01-15T14:54:24+01:00
status: 1

accessoire de guidage
type: Concept
modified: 2015-02-24T11:07:13+01:00
in scheme: Thésaurus de la désignation des objets mobiliers
broader: édicule ou mobilier de l'espace public ou du génie civil
alternative label: chasse-roue
alternative label: passe-corde
created: 2012-06-27T00:00:00+02:00
definition: Poulie, borne, arc etc. facilitant le remorquage, la manœuvre ou l’orientation d’un véhicule.
status: 1
broad match: http://vocab.getty.edu/aat/300135024

passe-corde
type: SimpleNonPreferredTerm
modified: 2015-02-24T11:07:13+01:00
created: 2014-01-15T14:54:24+01:00
status: 1

chasse-roue
type: SimpleNonPreferredTerm
modified: 2015-02-24T11:07:13+01:00
created: 2014-01-15T14:54:24+01:00
status: 1

accessoire de guidage
type: PreferredTerm
modified: 2015-02-24T11:07:13+01:00
created: 2014-01-15T14:54:24+01:00
status: 1

garniture liée au mariage
type: Concept
modified: 2014-01-10T00:00:00+01:00
in scheme: Thésaurus de la désignation des objets mobiliers
narrower: dais de mariage
broader: linge et garniture liés aux cycles de la vie
created: 2012-05-16T00:00:00+02:00
status: 1

dais de mariage
type: Concept
modified: 2014-01-10T00:00:00+01:00
in scheme: Thésaurus de la désignation des objets mobiliers
broader: garniture liée au mariage
alternative label: houppah
alternative label: dais nuptial
created: 2012-05-16T00:00:00+02:00
related: baldaquin de mariage
definition: Dais de soie ou de satin blanc, parfois brodé de citations bibliques que l'on dresse dans la synagogue au-dessus de la bimah et qui abrite les mariés durant la cérémonie du mariage. Les perches en bois qui le soutiennent sont tenues par les parents mâles du couple, quand il n'est pas fixé à un baldaquin.
TermeAssocie: baldaquin de mariage
status: 1

garniture liée au mariage
type: PreferredTerm
modified: 2014-01-10T00:00:00+01:00
created: 2014-01-15T14:54:24+01:00
status: 1

découpure
type: Concept
modified: 2014-10-17T15:58:12+02:00
in scheme: Thésaurus de la désignation des objets mobiliers
preferred label: cutouts @en-us
broader: peinture, arts graphiques et des média
created: 2013-07-22T00:00:00+02:00
definition: Fragment de métal ou de papier obtenu par découpage dans une feuille de ce matériau et formant des motifs décoratifs ou des silhouettes.
status: 1

cadre
type: Concept
modified: 2014-12-03T16:01:54+01:00
in scheme: Thésaurus de la désignation des objets mobiliers
preferred label: frames (furnishings) @en-us
broader: peinture, arts graphiques et des média
alternative label: encadrement
alternative label: cadre de lambris
alternative label: moulure d'encadrement
alternative label: baguette d'encadrement
alternative label: cadre-présentoir
created: 2012-05-16T00:00:00+02:00
definition: Objet destiné à entourer uneœuvre ou un autre objet (miroir, diplôme, etc.). Il a un rôle esthétique de présentation et un rôle technique structurel qui est de supporter, maintenir et protéger.
status: 1

peinture, arts graphiques et des média
type: PreferredTerm
modified: 2014-10-17T15:37:28+02:00
created: 2014-01-15T14:54:24+01:00
status: 1

collage
type: Concept
modified: 2014-12-03T16:02:34+01:00
in scheme: Thésaurus de la désignation des objets mobiliers
preferred label: collages (visual works) @en-us
broader: peinture, arts graphiques et des média
created: 2013-07-22T00:00:00+02:00
definition: Peinture ou dessin principalement constitué d'objets plats collés sur un support plat.
status: 1

oeuvre multimédia
type: Concept
modified: 2015-03-09T11:05:16+01:00
in scheme: Thésaurus de la désignation des objets mobiliers
preferred label: multimedia works @en-us
broader: peinture, arts graphiques et des média
alternative label: œuvre multimédia
alternative label: œuvre audiovisuelle
created: 2013-07-22T00:00:00+02:00
related: installation
related: T69-8076
TermeAssocie: installation
TermeAssocie: T69-8076
status: 1

tournebout
type: SimpleNonPreferredTerm
modified: 2014-10-10T11:42:07+02:00
created: 2014-01-15T14:54:24+01:00
status: 1

cromorne
type: PreferredTerm
modified: 2014-10-10T11:42:07+02:00
created: 2014-01-15T14:54:24+01:00
status: 1

crucifix
type: SimpleNonPreferredTerm
modified: 2014-11-26T15:46:50+01:00
created: 2014-01-15T14:54:24+01:00
status: 1

croix encadrée
type: Concept
modified: 2014-11-26T16:03:54+01:00
in scheme: Thésaurus de la désignation des objets mobiliers
preferred label: croce incorniciata @it
preferred label: enframed crosses @en-us
preferred label: cruz emoldurada @pt
broader: croix
created: 2012-05-16T00:00:00+02:00
definition: Croix ou Calvaire, placé sur un fond souvent en tissu précieux et encadré, accroché au mur d'une sacristie ou d'une demeure pour la dévotion privée.
status: 1

croix de poutre de gloire
type: SimpleNonPreferredTerm
modified: 2014-11-26T15:46:50+01:00
created: 2014-01-15T14:54:24+01:00
status: 1

croix de procession
type: Concept
modified: 2014-11-28T12:35:47+01:00
in scheme: Thésaurus de la désignation des objets mobiliers
preferred label: croce processionale @it
preferred label: processional crosses @en-us
preferred label: cruz processional @pt
broader: objet lié à la procession
created: 2012-05-16T00:00:00+02:00
related: pied de croix d'autel
related: croix
related: bâton pastoral
definition: Croix utilisée lors des processions ou des enterrements portant généralement le Christ sur la face et parfois la Vierge ou un saint au revers. La croix s'emboîte habituellement sur une hampe. Elle peut comporter des représentations de saint Jean et de la Vierge sur des supports particuliers, des clochettes et un nœud à la base. Fichée sur un pied, elle peut aussi, servir de croix d'autel.
TermeAssocie: pied de croix d'autel
TermeAssocie: croix
TermeAssocie: bâton pastoral
status: 1

croix de confessionnal
type: SimpleNonPreferredTerm
modified: 2014-11-26T15:46:50+01:00
created: 2014-01-15T14:54:24+01:00
status: 1

croix
type: PreferredTerm
modified: 2014-11-26T15:46:50+01:00
created: 2014-01-15T14:54:24+01:00
status: 1

croix de la Passion
type: Concept
modified: 2014-11-28T12:25:15+01:00
in scheme: Thésaurus de la désignation des objets mobiliers
preferred label: Passion crosses @en-us
preferred label: croce della Passione @it
preferred label: cruz de Paixão @pt
broader: objet lié à la procession
created: 2012-05-16T00:00:00+02:00
related: croix
related: instruments de la Passion
definition: Croix portant la représentation des instruments de la Passion utilisée par une confrérie de pénitents pour ouvrir les processions de la Semaine sainte.
TermeAssocie: croix
TermeAssocie: instruments de la Passion
status: 1
broad match: http://vocab.getty.edu/aat/300235443

croix de tempérance
type: SimpleNonPreferredTerm
modified: 2014-11-26T15:46:50+01:00
created: 2014-01-15T14:54:24+01:00
status: 1

croix de sacristie
type: Concept
modified: 2014-11-26T15:59:47+01:00
in scheme: Thésaurus de la désignation des objets mobiliers
preferred label: sacristy crosses @en-us
preferred label: croce di sacrestia @it
preferred label: cruz de sacristia @pt
broader: croix
created: 2012-05-16T00:00:00+02:00
definition: Croix, généralement placée sur un meuble de la sacristie, munie d'un pied ou fixée au meuble et devant laquelle le clergé s'incline en entrant et en quittant la pièce.
status: 1

croix de jubé
type: SimpleNonPreferredTerm
modified: 2014-11-26T15:46:50+01:00
created: 2014-01-15T14:54:24+01:00
status: 1

croix de baptême
type: SimpleNonPreferredTerm
modified: 2014-11-26T15:46:50+01:00
created: 2014-01-15T14:54:24+01:00
status: 1

croix de chaire à prêcher
type: SimpleNonPreferredTerm
modified: 2014-11-26T15:46:50+01:00
created: 2014-01-15T14:54:24+01:00
status: 1

locomotive à vapeur à tender séparé
type: Concept
modified: 2014-12-18T10:06:50+01:00
in scheme: Thésaurus de la désignation des objets mobiliers
broader: locomotive à vapeur
created: 2013-11-04T00:00:00+01:00
scope note: Si la locomotive et son tender séparé sont encore liés, il n'est pas nécessaire d'utiliser une double indexation. Si le tender manque, le préciser dans le champ PDEN.
definition: Véhicule à moteur à vapeur qui est accouplé, pour être alimenté en permanence, avec un second élément roulant lui-même doté de soutes à eau et à combustibles (charbon ou fuel).
status: 1
broad match: http://vocab.getty.edu/aat/300228422
broad match: cb11932302g

locomotive à vapeur à tender séparé
type: PreferredTerm
modified: 2014-12-18T10:06:50+01:00
created: 2014-01-15T14:54:24+01:00
status: 1

cruche
type: Concept
modified: 2014-12-08T11:48:41+01:00
in scheme: Thésaurus de la désignation des objets mobiliers
preferred label: jugs (vessels) @en-us
broader: récipient pour la conservation des aliments ou des boissons
alternative label: cruche de barque
alternative label: cruche de tête
alternative label: cruche à eau
alternative label: cruche à huile
alternative label: cruche à vin
created: 2012-05-16T00:00:00+02:00
definition: Récipient parfois couvert, pour transporter et conserver un liquide. La cruche est souvent désignée par son contenu. Elle est de forme cylindrique plus ou moins pansue, à fond plat, à large ouverture supérieure, munie d'un goulot latéral, d'une ou plusieurs anses.
status: 1

cruche à vin
type: SimpleNonPreferredTerm
modified: 2014-12-08T11:48:41+01:00
created: 2014-01-15T14:54:24+01:00
status: 1

cruche
type: PreferredTerm
modified: 2014-12-08T11:48:41+01:00
created: 2014-01-15T14:54:24+01:00
status: 1

cruche de tête
type: SimpleNonPreferredTerm
modified: 2014-12-08T11:48:41+01:00
created: 2014-01-15T14:54:24+01:00
status: 1

cruche à huile
type: SimpleNonPreferredTerm
modified: 2014-12-08T11:48:41+01:00
created: 2014-01-15T14:54:24+01:00
status: 1

cruche de barque
type: SimpleNonPreferredTerm
modified: 2014-12-08T11:48:41+01:00
created: 2014-01-15T14:54:24+01:00
status: 1

cruche à eau
type: SimpleNonPreferredTerm
modified: 2014-12-08T11:48:41+01:00
created: 2014-01-15T14:54:24+01:00
status: 1

linge et garniture liés aux cycles de la vie
type: PreferredTerm
modified: 2014-01-10T00:00:00+01:00
created: 2014-01-15T14:54:24+01:00
status: 1

siège de circoncision
type: Concept
modified: 2014-01-10T00:00:00+01:00
in scheme: Thésaurus de la désignation des objets mobiliers
broader: siège de synagogue
created: 2012-05-16T00:00:00+02:00
definition: Siège sur lequel s'assoit le parrain (sandaq) chargé de présenter l'enfant au circonciseur (mohèl). Ce siège peut être double, la deuxième place, symbolique, étant celle d'Elie, prophète présidant à la cérémonie et protecteur des nourrissons. Le dossier peut être orné de représentations des instruments du mohèl.
status: 1

siège de synagogue
type: Concept
modified: 2014-01-10T00:00:00+01:00
in scheme: Thésaurus de la désignation des objets mobiliers
narrower: siège de circoncision
narrower: T69-1064
narrower: T69-1062
narrower: T69-1059
narrower: T69-1057
broader: meuble du culte synagogal
created: 2012-05-16T00:00:00+02:00
scope note: On peut en préciser la forme exacte (banc, chaise, fauteuil, tabouret) dans le champ PDEN.
definition: Siège placé dans la synagogue et destiné aux fidèles ou au rabin, qui peut avoir la forme d'un banc, d'une chaise, d'un fauteuil ou d'un tabouret.
status: 1

siège de circoncision
type: PreferredTerm
modified: 2014-01-10T00:00:00+01:00
created: 2014-01-15T14:54:24+01:00
status: 1

harnais ou ses accessoires
type: Concept
modified: 2014-12-30T11:23:02+01:00
in scheme: Thésaurus de la désignation des objets mobiliers
preferred label: harnesses @en-us
broader: harnachement ou attelage
alternative label: joug
alternative label: licou
alternative label: plaque muletière
alternative label: mors
alternative label: guide-rênes
alternative label: collier d'attelage
alternative label: bride d'attelage
alternative label: licol
created: 2013-11-05T00:00:00+01:00
definition: Ensemble des éléments, en cuir, en bois et/ou métal, composant l'équipement d'un animal de selle ou d'attelage.
status: 1

joug
type: SimpleNonPreferredTerm
modified: 2014-12-30T11:23:02+01:00
created: 2014-01-15T14:54:24+01:00
status: 1

harnais ou ses accessoires
type: PreferredTerm
modified: 2014-12-30T11:23:02+01:00
created: 2014-01-15T14:54:24+01:00
status: 1

licol
type: SimpleNonPreferredTerm
modified: 2014-12-30T11:23:02+01:00
created: 2014-01-15T14:54:24+01:00
status: 1

mors
type: SimpleNonPreferredTerm
modified: 2014-12-30T11:23:02+01:00
created: 2014-01-15T14:54:24+01:00
status: 1

plaque muletière
type: SimpleNonPreferredTerm
modified: 2014-12-30T11:23:02+01:00
created: 2014-01-15T14:54:24+01:00
status: 1

guide-rênes
type: SimpleNonPreferredTerm
modified: 2014-12-30T11:23:02+01:00
created: 2014-01-15T14:54:24+01:00
status: 1

licou
type: SimpleNonPreferredTerm
modified: 2014-12-30T11:23:02+01:00
created: 2014-01-15T14:54:24+01:00
status: 1

collier d'attelage
type: SimpleNonPreferredTerm
modified: 2014-12-30T11:23:02+01:00
created: 2014-01-15T14:54:24+01:00
status: 1

bride d'attelage
type: SimpleNonPreferredTerm
modified: 2014-12-30T11:23:02+01:00
created: 2014-01-15T14:54:24+01:00
status: 1

jeu de dames
type: Concept
modified: 2014-12-30T13:11:26+01:00
in scheme: Thésaurus de la désignation des objets mobiliers
preferred label: checker sets @en-us
broader: jeu de cartes ou de société
alternative label: damier
created: 2013-11-29T00:00:00+01:00
definition: Éléments nécessaires à la pratique du jeu de dames : un plateau ou damier, le plus souvent constitué de cent cases de deux couleurs alternées (noir et blanc) et de quarante pions, de l'une ou l'autre couleur, que se répartissent les joueurs.
status: 1

damier
type: SimpleNonPreferredTerm
modified: 2014-12-30T13:11:26+01:00
created: 2014-01-15T14:54:24+01:00
status: 1

jeu de dames
type: PreferredTerm
modified: 2014-12-30T13:11:26+01:00
created: 2014-01-15T14:54:24+01:00
status: 1

colombe d'autel
type: SimpleNonPreferredTerm
modified: 2014-11-27T14:56:44+01:00
created: 2014-01-15T14:54:24+01:00
status: 1

suspension eucharistique
type: Concept
modified: 2014-12-01T16:45:06+01:00
in scheme: Thésaurus de la désignation des objets mobiliers
preferred label: dispositivo di sospensione eucaristica @it
preferred label: hanging pyxes @en-us
preferred label: suspensão eucarística @pt
broader: meuble lié à l'Eucharistie
alternative label: suspense eucharistique
alternative label: support de réserve eucharistique
alternative label: crosse eucharistique
created: 2012-05-16T00:00:00+02:00
related: ciboire
related: colombe eucharistique
definition: Support servant à maintenir suspendue au-dessus d’un autel la réserve eucharistique, directement ou par l'intermédiaire d'un tabernacle lui-même suspendu.
TermeAssocie: ciboire
TermeAssocie: colombe eucharistique
status: 1
broad match: http://data.bnf.fr/ark:/12148/cb119489917
broad match: Mobilier liturgique

colombe eucharistique
type: PreferredTerm
modified: 2014-11-27T14:56:44+01:00
created: 2014-01-15T14:54:24+01:00
status: 1

brancard de procession
type: Concept
modified: 2014-12-02T10:09:34+01:00
in scheme: Thésaurus de la désignation des objets mobiliers
preferred label: base processionale @it
preferred label: processional stretchers @en-us
preferred label: andor @pt
broader: meuble lié à la procession et à la dévotion
created: 2012-05-16T00:00:00+02:00
related: draperie de brancard de procession
definition: Brancard utilisé lors des processions pour porter le saint sacrement, des reliques, des statues ou, le Jeudi saint, les saintes huiles. Le brancard de procession peut être surmonté d'un dais, d'un socle ou parfois des deux. Une statue de procession, un reliquaire ou son support spécifique peuvent être fixés au brancard.
TermeAssocie: draperie de brancard de procession
status: 1

draperie de brancard de procession
type: Concept
modified: 2014-12-03T10:30:45+01:00
in scheme: Thésaurus de la désignation des objets mobiliers
preferred label: processional stretcher falls @en-us
preferred label: drappo per la base processionale @it
preferred label: cobertura de andor @pt
broader: linge ou garniture liés à la procession
alternative label: garniture de brancard de procession
alternative label: draperie de brancard
created: 2012-05-16T00:00:00+02:00
related: brancard de procession
definition: Étoffe souvent en drap d'or ou d'argent qui recouvre un brancard de procession
TermeAssocie: brancard de procession
status: 1
broad match: http://vocab.getty.edu/aat/300298963

brancard de procession
type: PreferredTerm
modified: 2014-12-02T10:09:34+01:00
created: 2014-01-15T14:54:24+01:00
status: 1

chasseur
type: Concept
modified: 2014-12-17T14:25:28+01:00
in scheme: Thésaurus de la désignation des objets mobiliers
preferred label: fighters @en-us
broader: avion militaire
alternative label: avion de chasse
alternative label: chasseur embarqué
alternative label: chasseur terrestre
created: 2013-11-06T00:00:00+01:00
definition: Appareil dont le rôle est d'intercepter, de poursuivre et d'attaquer l'aviation ennemie en temps de guerre.
status: 1

chasseur terrestre
type: SimpleNonPreferredTerm
modified: 2014-12-17T14:25:28+01:00
created: 2014-01-15T14:54:24+01:00
status: 1

chasseur
type: PreferredTerm
modified: 2014-12-17T14:25:28+01:00
created: 2014-01-15T14:54:24+01:00
status: 1

chasseur embarqué
type: SimpleNonPreferredTerm
modified: 2014-12-17T14:25:28+01:00
created: 2014-01-15T14:54:24+01:00
status: 1

avion de chasse
type: SimpleNonPreferredTerm
modified: 2014-12-17T14:25:28+01:00
created: 2014-01-15T14:54:24+01:00
status: 1

générateur électrostatique
type: Concept
modified: 2015-08-05T15:29:19+02:00
in scheme: Thésaurus de la désignation des objets mobiliers
broader: générateur électrique
alternative label: bouteille de Leyde
alternative label: machine de Whimshurt
alternative label: générateur de haute tension
created: 2012-05-16T00:00:00+02:00
related: instrument de démonstration en électrostatique
definition: Générateur produisant une énergie potentielle électrostatique.
TermeAssocie: instrument de démonstration en électrostatique
status: 1

générateur électrique
type: Concept
modified: 2015-10-07T15:57:21+02:00
in scheme: Thésaurus de la désignation des objets mobiliers
narrower: générateur électrique continu
narrower: générateur électrostatique
narrower: générateur électrique alternatif
broader: générateur
created: 2012-05-16T00:00:00+02:00
definition: Générateur produisant un courant électrique.
status: 1

instrument de démonstration en électrostatique
type: Concept
modified: 2014-12-15T14:12:12+01:00
in scheme: Thésaurus de la désignation des objets mobiliers
broader: instrument de démonstration de phénomènes physiques
alternative label: paratonnerre de Franklin
alternative label: électroscope
alternative label: cage de Faraday
alternative label: tube étincelant
alternative label: pistolet de Volta
alternative label: perce-carte
alternative label: carreau étincelant
created: 2012-05-16T00:00:00+02:00
related: générateur électrostatique
definition: Instrument de mise en évidence des phénomènes électrostatiques et de leurs effets lumineux ou mécaniques.
TermeAssocie: générateur électrostatique
status: 1
narrow match: Cage de Faraday
broad match: http://vocab.getty.edu/aat/300122283

générateur de haute tension
type: SimpleNonPreferredTerm
modified: 2015-08-05T15:29:19+02:00
created: 2014-01-15T14:54:24+01:00
status: 1

générateur électrostatique
type: PreferredTerm
modified: 2015-08-05T15:29:19+02:00
created: 2014-01-15T14:54:24+01:00
status: 1

machine de Whimshurt
type: SimpleNonPreferredTerm
modified: 2015-08-05T15:29:19+02:00
created: 2014-01-15T14:54:24+01:00
status: 1

bouteille de Leyde
type: SimpleNonPreferredTerm
modified: 2015-08-05T15:29:19+02:00
created: 2014-01-15T14:54:24+01:00
status: 1

chaise prie-Dieu
type: Concept
modified: 2014-12-02T14:41:57+01:00
in scheme: Thésaurus de la désignation des objets mobiliers
preferred label: sedia-inginocchiatoio @it
preferred label: prie-dieu chairs @en-us
preferred label: cadeira genuflexório @pt
broader: chaise d'église
created: 2012-05-16T00:00:00+02:00
definition: Chaise d'église à fond bas mais plus élevé qu'un prie-Dieu, servant alternativement de siège et d'agenouilloir. Le dossier comporte souvent un accoudoir.
status: 1

chaise prie-Dieu
type: PreferredTerm
modified: 2014-12-02T14:41:57+01:00
created: 2014-01-15T14:54:24+01:00
status: 1

luth
type: Concept
modified: 2014-12-15T11:43:59+01:00
in scheme: Thésaurus de la désignation des objets mobiliers
preferred label: lutes (chordophones) @en-us
broader: cordophone composite à manche et cordes pincées
created: 2012-05-16T00:00:00+02:00
definition: Instrument constitué d'une caisse bombée faite de côtes séparées et d'un manche fretté dont le chevillier est presque à angle droit. Les cordes sont doubles (mais il y a toujours une corde aiguë simple, chanterelle). La rose offre le plus souvent un décor mauresque.
status: 1

luth
type: PreferredTerm
modified: 2014-12-15T11:43:59+01:00
created: 2014-01-15T14:54:24+01:00
status: 1

générateur électrique
type: PreferredTerm
modified: 2015-10-07T15:57:21+02:00
created: 2014-01-15T14:54:24+01:00
status: 1

générateur électrique alternatif
type: Concept
modified: 2015-10-07T16:01:58+02:00
in scheme: Thésaurus de la désignation des objets mobiliers
narrower: alternateur monophasé
narrower: alternateur triphasé
broader: générateur électrique
alternative label: alternateur
created: 2012-05-16T00:00:00+02:00
definition: Générateur électrique produisant, à partir d'une source d'énergie mécanique, un courant électrique alternatif.
status: 1

verre
type: Concept
modified: 2014-12-08T16:19:42+01:00
in scheme: Thésaurus de la désignation des objets mobiliers
preferred label: drinking glasses @en-us
broader: récipient pour le service et la consommation des boissons
alternative label: passglass
alternative label: boit-tout
alternative label: verre à liqueur
alternative label: verre de santé
alternative label: verre de monstrance
alternative label: verre-gobelet
alternative label: verre trompeur
alternative label: coupe à champagne
alternative label: impossible
alternative label: verre inversable
alternative label: verre à punch
alternative label: verre de mariage
alternative label: flûte à champagne
alternative label: verre-coupe
alternative label: vidrecome
alternative label: roemer
alternative label: verre à pied
alternative label: verre d'amitié
alternative label: verre d'accouchée
alternative label: verre pour fruits à l'eau-de-vie
created: 2012-05-16T00:00:00+02:00
related: gobelet
definition: Récipient individuel, le plus souvent en verre, de formes et de capacités variées, pour boire des liquides généralement froids.Sa désignation peut être liée à son utilisation ou sa forme.
TermeAssocie: gobelet
status: 1

verre de mariage
type: SimpleNonPreferredTerm
modified: 2014-12-08T16:19:42+01:00
created: 2014-01-15T14:54:24+01:00
status: 1

roemer
type: SimpleNonPreferredTerm
modified: 2014-12-08T16:19:42+01:00
created: 2014-01-15T14:54:24+01:00
status: 1

gobelet
type: Concept
modified: 2014-12-08T16:01:47+01:00
in scheme: Thésaurus de la désignation des objets mobiliers
preferred label: beakers (drinking vessels) @en-us
broader: récipient pour le service et la consommation des boissons
alternative label: hanap
alternative label: gobelet de chasse
alternative label: timbale
alternative label: gobelet à liqueur
alternative label: skyphos
alternative label: gobelet de corporation
alternative label: mazagran
alternative label: gobelet instable
alternative label: godet
alternative label: gobelet trembleur
created: 2012-05-16T00:00:00+02:00
related: soucoupe
related: verre
related: gobelet de baptême
definition: Récipient individuel pour boire, de forme cylindrique, parfois légèrement évasé, à fond plat ou arrondi et porté ou non sur un pied bas. Il peut être muni de deux anses latérales verticales et d'un couvercle et complété par une soucoupe assortie comportant un réceptacle central très creux.
TermeAssocie: soucoupe
TermeAssocie: verre
TermeAssocie: gobelet de baptême
status: 1

verre trompeur
type: SimpleNonPreferredTerm
modified: 2014-12-08T16:19:42+01:00
created: 2014-01-15T14:54:24+01:00
status: 1

vidrecome
type: SimpleNonPreferredTerm
modified: 2014-12-08T16:19:42+01:00
created: 2014-01-15T14:54:24+01:00
status: 1

verre d'amitié
type: SimpleNonPreferredTerm
modified: 2014-12-08T16:19:42+01:00
created: 2014-01-15T14:54:24+01:00
status: 1

verre-coupe
type: SimpleNonPreferredTerm
modified: 2014-12-08T16:19:42+01:00
created: 2014-01-15T14:54:24+01:00
status: 1

verre à punch
type: SimpleNonPreferredTerm
modified: 2014-12-08T16:19:42+01:00
created: 2014-01-15T14:54:24+01:00
status: 1

verre pour fruits à l'eau-de-vie
type: SimpleNonPreferredTerm
modified: 2014-12-08T16:19:42+01:00
created: 2014-01-15T14:54:24+01:00
status: 1

passglass
type: SimpleNonPreferredTerm
modified: 2014-12-08T16:19:42+01:00
created: 2014-01-15T14:54:24+01:00
status: 1

boit-tout
type: SimpleNonPreferredTerm
modified: 2014-12-08T16:19:42+01:00
created: 2014-01-15T14:54:24+01:00
status: 1

coupe à champagne
type: SimpleNonPreferredTerm
modified: 2014-12-08T16:19:42+01:00
created: 2014-01-15T14:54:24+01:00
status: 1

flûte à champagne
type: SimpleNonPreferredTerm
modified: 2014-12-08T16:19:42+01:00
created: 2014-01-15T14:54:24+01:00
status: 1

verre inversable
type: SimpleNonPreferredTerm
modified: 2014-12-08T16:19:42+01:00
created: 2014-01-15T14:54:24+01:00
status: 1

verre de monstrance
type: SimpleNonPreferredTerm
modified: 2014-12-08T16:19:42+01:00
created: 2014-01-15T14:54:24+01:00
status: 1

verre
type: PreferredTerm
modified: 2014-12-08T16:19:42+01:00
created: 2014-01-15T14:54:24+01:00
status: 1

verre d'accouchée
type: SimpleNonPreferredTerm
modified: 2014-12-08T16:19:42+01:00
created: 2014-01-15T14:54:24+01:00
status: 1

verre à liqueur
type: SimpleNonPreferredTerm
modified: 2014-12-08T16:19:42+01:00
created: 2014-01-15T14:54:24+01:00
status: 1

verre de santé
type: SimpleNonPreferredTerm
modified: 2014-12-08T16:19:42+01:00
created: 2014-01-15T14:54:24+01:00
status: 1

verre-gobelet
type: SimpleNonPreferredTerm
modified: 2014-12-08T16:19:42+01:00
created: 2014-01-15T14:54:24+01:00
status: 1

verre à pied
type: SimpleNonPreferredTerm
modified: 2014-12-08T16:19:42+01:00
created: 2014-01-15T14:54:24+01:00
status: 1

impossible
type: SimpleNonPreferredTerm
modified: 2014-12-08T16:19:42+01:00
created: 2014-01-15T14:54:24+01:00
status: 1

enluminure
type: PreferredTerm
modified: 2014-12-03T16:04:56+01:00
created: 2014-01-15T14:54:24+01:00
status: 1

houppah
type: SimpleNonPreferredTerm
modified: 2014-01-10T00:00:00+01:00
created: 2014-01-15T14:54:24+01:00
status: 1

baldaquin de mariage
type: Concept
modified: 2014-01-10T00:00:00+01:00
in scheme: Thésaurus de la désignation des objets mobiliers
broader: meuble du culte synagogal
alternative label: baldaquin nuptial
alternative label: baldaquin pour pupitre de Torah
created: 2012-05-16T00:00:00+02:00
scope note: Quand il s'agit d'éléments textiles, employer dais de mariage dans le champ PDEN.
related: dais de mariage
definition: Baldaquin dressé au-dessus de l'estrade pour pupitre de Torah lors des cérémonies du mariage et sous lequel se tiennent les mariés. Dans certaines synagogues, il peut être permanent. Le baldaquin est en matériau solide, du bois par exemple.
TermeAssocie: dais de mariage
status: 1

dais de mariage
type: PreferredTerm
modified: 2014-01-10T00:00:00+01:00
created: 2014-01-15T14:54:24+01:00
status: 1

dais nuptial
type: SimpleNonPreferredTerm
modified: 2014-01-10T00:00:00+01:00
created: 2014-01-15T14:54:24+01:00
status: 1

machine à haver
type: Concept
modified: 2015-10-08T16:26:46+02:00
in scheme: Thésaurus de la désignation des objets mobiliers
broader: machine à creuser
alternative label: mineur continu
alternative label: haveuse
alternative label: rabot de mine
created: 2012-05-16T00:00:00+02:00
definition: Dans les mines et les carrières, machine à creuser équipée d'un outil mécanique (disque, chaîne, tambour, etc.)..
status: 1
narrow match: Haveuse

haveuse
type: SimpleNonPreferredTerm
modified: 2015-10-08T16:26:46+02:00
created: 2014-01-15T14:54:24+01:00
status: 1

rabot de mine
type: SimpleNonPreferredTerm
modified: 2015-10-08T16:26:46+02:00
created: 2014-01-15T14:54:24+01:00
status: 1

machine à haver
type: PreferredTerm
modified: 2015-10-08T16:26:46+02:00
created: 2014-01-15T14:54:24+01:00
status: 1

machine à creuser
type: Concept
modified: 2015-10-08T16:22:42+02:00
in scheme: Thésaurus de la désignation des objets mobiliers
narrower: machine à haver
narrower: machine à pelleter
narrower: machine à trépaner
broader: machine à dissocier
created: 2012-05-16T00:00:00+02:00
definition: Machine à dissocier, par extraction, des matériaux du milieu naturel ou des produits d'un stock, en formant une cavité.
status: 1

mineur continu
type: SimpleNonPreferredTerm
modified: 2015-10-08T16:26:46+02:00
created: 2014-01-15T14:54:24+01:00
status: 1

ébarbeuse
type: SimpleNonPreferredTerm
modified: 2015-10-15T12:08:20+02:00
created: 2014-01-15T14:54:24+01:00
status: 1

machine à ébarber
type: PreferredTerm
modified: 2015-10-15T12:08:20+02:00
created: 2014-01-15T14:54:24+01:00
status: 1

boîte à agnus-Dei
type: SimpleNonPreferredTerm
modified: 2014-11-26T14:16:42+01:00
created: 2014-01-15T14:54:24+01:00
status: 1

reliquaire à agnus-Dei
type: SimpleNonPreferredTerm
modified: 2014-11-26T14:16:42+01:00
created: 2014-01-15T14:54:24+01:00
status: 1

médaillon à agnus-Dei
type: SimpleNonPreferredTerm
modified: 2014-11-26T14:16:42+01:00
created: 2014-01-15T14:54:24+01:00
status: 1

agnus Dei
type: PreferredTerm
modified: 2014-11-26T14:16:42+01:00
created: 2014-01-15T14:54:24+01:00
status: 1

seau à verres
type: SimpleNonPreferredTerm
modified: 2014-12-05T15:54:35+01:00
created: 2014-01-15T14:54:24+01:00
status: 1

rafraîchissoir à verre
type: PreferredTerm
modified: 2014-12-05T15:54:35+01:00
created: 2014-01-15T14:54:24+01:00
status: 1

rafraîchissoir à verres
type: SimpleNonPreferredTerm
modified: 2014-12-05T15:54:35+01:00
created: 2014-01-15T14:54:24+01:00
status: 1

couteau pour le Shabbat
type: Concept
modified: 2014-01-10T00:00:00+01:00
in scheme: Thésaurus de la désignation des objets mobiliers
broader: objet lié au Shabbat
created: 2012-05-16T00:00:00+02:00
definition: Couteau servant à couper les pains consommés le vendredi soir. Ces couteaux portent souvent des inscriptions, telles que les mots Shabbat ou Berchès.
status: 1

bougeoir pour la clôture du Shabbat
type: Concept
modified: 2014-01-10T00:00:00+01:00
in scheme: Thésaurus de la désignation des objets mobiliers
broader: objet lié au Shabbat
alternative label: bougeoir de Havdalah
alternative label: chandelier pour la clôture du Shabbat
created: 2012-05-16T00:00:00+02:00
scope note: Havdalah est la cérémonie qui clôture le Shabbat le samedi soir. Le bougeoir de Havdalah est parfois combiné avec la boîte à aromates : employer la double dénomination et indiquer fonctions combinées dans le champ STRU. Utiliser bougeoir de Havdalah dans le champ APPL.
definition: Bougeoir dont le pied supporte quatre tiges verticales entre lesquelles on place la bougie tressée, allumée lors de la cérémonie de fin de Shabbat (Havdalah = séparation ou différenciation entre le temps sacré du Shabbat et le temps profane). Le pied peut comporter un tiroir pour les aromates.
status: 1

objet lié au Shabbat
type: PreferredTerm
modified: 2014-01-10T00:00:00+01:00
created: 2014-01-15T14:54:24+01:00
status: 1

boîte à aromates
type: Concept
modified: 2014-01-10T00:00:00+01:00
in scheme: Thésaurus de la désignation des objets mobiliers
broader: objet lié au Shabbat
alternative label: boîte à bessamin
alternative label: boîte à haddassim
created: 2012-05-16T00:00:00+02:00
definition: Récipient en argent, généralement ajouré, souvent divisé en quatre compartiments et de formes très variées (architecturales ou animalières : oiseaux, poissons, ou végétales : fleurs, fruits, etc.) contenant des aromates (clous de girofle, poivre, fruits, fleurs) que l'assistance se passe et respire lors de la cérémonie de fin de Shabbat ou cérémonie de la séparation (Havdalah) à la synagogue et dans les maisons.
status: 1

cafetière
type: PreferredTerm
modified: 2014-12-08T15:48:26+01:00
created: 2014-01-15T14:54:24+01:00
status: 1

cafetière-filtre
type: SimpleNonPreferredTerm
modified: 2014-12-08T15:48:26+01:00
created: 2014-01-15T14:54:24+01:00
status: 1

pot à café
type: SimpleNonPreferredTerm
modified: 2014-12-08T15:48:26+01:00
created: 2014-01-15T14:54:24+01:00
status: 1

cafetière égoïste
type: SimpleNonPreferredTerm
modified: 2014-12-08T15:48:26+01:00
created: 2014-01-15T14:54:24+01:00
status: 1

cafetière bain-marie
type: SimpleNonPreferredTerm
modified: 2014-12-08T15:48:26+01:00
created: 2014-01-15T14:54:24+01:00
status: 1

cafetière marabout
type: SimpleNonPreferredTerm
modified: 2014-12-08T15:48:26+01:00
created: 2014-01-15T14:54:24+01:00
status: 1

compteur de billard
type: Concept
modified: 2014-12-05T10:23:45+01:00
in scheme: Thésaurus de la désignation des objets mobiliers
broader: support pour le bureau ou les loisirs
created: 2012-05-16T00:00:00+02:00
definition: Tableau servant, à l’aide de divers systèmes (plaquettes coulissantes, bouliers, etc.), à comptabiliser les points obtenus au billard. Il peut être d'applique ou posé.
status: 1
broad match: cb11960062n
broad match: Billard

compteur de billard
type: PreferredTerm
modified: 2014-12-05T10:23:45+01:00
created: 2014-01-15T14:54:24+01:00
status: 1

locomotive électrique
type: PreferredTerm
modified: 2014-12-18T10:11:44+01:00
created: 2014-01-15T14:54:24+01:00
status: 1

locomotive électrique de ligne
type: SimpleNonPreferredTerm
modified: 2014-12-18T10:11:44+01:00
created: 2014-01-15T14:54:24+01:00
status: 1

locomotive électrique de manœuvre
type: SimpleNonPreferredTerm
modified: 2014-12-18T10:11:44+01:00
created: 2014-01-15T14:54:24+01:00
status: 1

corbeau
type: Concept
modified: 2015-02-03T17:01:24+01:00
in scheme: Thésaurus de la désignation des objets mobiliers
preferred label: corbels @en-us
broader: support en surplomb
created: 2012-05-16T00:00:00+02:00
definition: Pierre, pièce de bois ou de métal, de section verticale carrée ou rectangulaire, partiellement engagée dans un mur et portant une charge par sa partie saillante. L'extrémité du corbeau peut être galbée.
status: 1

corbeau
type: PreferredTerm
modified: 2015-02-03T17:01:24+01:00
created: 2014-01-15T14:54:24+01:00
status: 1

machine à usiner par copiage
type: Concept
modified: 2015-09-02T16:47:08+02:00
in scheme: Thésaurus de la désignation des objets mobiliers
broader: machine à usiner
alternative label: tour à copier
created: 2012-05-16T00:00:00+02:00
definition: Machine à usiner un produit dans le but de reproduire le modèle de référence.
status: 1

machine à usiner par copiage
type: PreferredTerm
modified: 2015-09-02T16:47:08+02:00
created: 2014-01-15T14:54:24+01:00
status: 1

tour à copier
type: SimpleNonPreferredTerm
modified: 2015-09-02T16:47:08+02:00
created: 2014-01-15T14:54:24+01:00
status: 1

saloir à saler
type: Concept
modified: 2014-12-04T16:15:52+01:00
in scheme: Thésaurus de la désignation des objets mobiliers
broader: coffre-réserve
created: 2012-05-16T00:00:00+02:00
definition: Meuble servant à conserver dans le sel non moulu certaines denrées spécifiques. Il se présente sous forme de coffre en bois ou en pierre ou de cavité dans le mur.
status: 1

coffre-réserve
type: Concept
modified: 2014-12-04T16:08:16+01:00
in scheme: Thésaurus de la désignation des objets mobiliers
narrower: saloir à saler
narrower: saloir à sel
narrower: T69-2936
narrower: T69-2932
narrower: T69-2930
narrower: T69-2926
broader: coffre
created: 2012-05-16T00:00:00+02:00
definition: Coffre rectangulaire, circulaire ou elliptique, servant à conserver une denrée spécifique destinée à l'alimentation humaine ou animale. Une forme n'est caractéristique que pour une région donnée.
status: 1
broad match: http://vocab.getty.edu/aat/300038992
broad match: cb13162914n
broad match: Coffre

saloir à saler
type: PreferredTerm
modified: 2014-12-04T16:15:52+01:00
created: 2014-01-15T14:54:24+01:00
status: 1

aérophone à anche vibrante simple
type: Concept
modified: 2014-10-10T11:43:56+02:00
in scheme: Thésaurus de la désignation des objets mobiliers
preferred label: reedpipes with simple reed @en-us
narrower: clarinette
narrower: chalumeau
narrower: saxophone
broader: aérophone à anche
created: 2012-05-16T00:00:00+02:00
definition: Instrument à vent utilisant un système d'anche (en roseau ou matériau composite) où l'air met en vibration une seule languette.
status: 1
broad match: http://data.bnf.fr/ark:/12148/cb16686981f
broad match: http://vocab.getty.edu/aat/300042558

clarinette
type: Concept
modified: 2014-10-10T11:45:37+02:00
in scheme: Thésaurus de la désignation des objets mobiliers
preferred label: clarinets @en-us
broader: aérophone à anche vibrante simple
alternative label: cor de basset
alternative label: clarinette d'amour
alternative label: clarinette basse
created: 2012-05-16T00:00:00+02:00
definition: Instrument en bois, à clés, à perce cylindrique se terminant par un pavillon légèrement conique. Formée de cinq parties assemblées par des viroles métalliques, la clarinette peut avoir différentes tailles et un nombre de trous variable.
status: 1

chalumeau
type: Concept
modified: 2014-10-10T11:44:58+02:00
in scheme: Thésaurus de la désignation des objets mobiliers
preferred label: chalumeaux @en-us
broader: aérophone à anche vibrante simple
created: 2012-05-16T00:00:00+02:00
definition: Ancêtre de la clarinette, cet instrument sans pavillon est difficile à reconnaître car extérieurement proche de la flûte à bec, bien qu'il possède une anche.
status: 1

aérophone à anche vibrante simple
type: PreferredTerm
modified: 2014-10-10T11:43:56+02:00
created: 2014-01-15T14:54:24+01:00
status: 1

saxophone
type: Concept
modified: 2014-10-10T11:46:26+02:00
in scheme: Thésaurus de la désignation des objets mobiliers
preferred label: saxophones @en-us
broader: aérophone à anche vibrante simple
created: 2012-05-16T00:00:00+02:00
definition: Instrument en laiton ou en cuivre, à perce conique, muni d'un bec semblable à celui de la clarinette. Le tuyau est recourbé, terminé par un pavillon, les trous (entre 18 et 21) sont contrôlés par des clés.
status: 1

machine à allonger
type: PreferredTerm
modified: 2014-01-10T00:00:00+01:00
created: 2014-01-15T14:54:24+01:00
status: 1

bouclier
type: Concept
modified: 2014-12-12T14:08:36+01:00
in scheme: Thésaurus de la désignation des objets mobiliers
preferred label: shields (armor) @en-us
broader: arme défensive
alternative label: rondache
created: 2012-05-16T00:00:00+02:00
definition: Pièce tenue par le combattant qui la place devant lui pour se protéger du coup de l'adversaire. Sa forme bombée fait ricocher l'arme de l'attaquant.
status: 1

bouclier
type: PreferredTerm
modified: 2014-12-12T14:08:36+01:00
created: 2014-01-15T14:54:24+01:00
status: 1

rondache
type: SimpleNonPreferredTerm
modified: 2014-12-12T14:08:36+01:00
created: 2014-01-15T14:54:24+01:00
status: 1

coupe de communion
type: Concept
modified: 2014-01-10T00:00:00+01:00
in scheme: Thésaurus de la désignation des objets mobiliers
broader: objet du culte protestant
alternative label: coupe de la Sainte Cène
alternative label: calice protestant
alternative label: coupe de Cène
created: 2012-05-16T00:00:00+02:00
definition: Coupe en forme de calice ou grande coupe plate sur pied bas destinée à mettre le vin nécessaire à la communion. Les coupes vont souvent par paire, voire par groupe. Elles ont parfois été démontables afin d'être facilement dissimulées. Elles peuvent former avec les autres objets nécessaires à la communion le service de Sainte Cène ou service de communion.
status: 1

boîte pour le pain de la communion
type: Concept
modified: 2014-01-07T00:00:00+01:00
in scheme: Thésaurus de la désignation des objets mobiliers
broader: objet du culte protestant
alternative label: boîte à hosties luthérienne
alternative label: boîte à hosties protestante
created: 2012-05-16T00:00:00+02:00
definition: Boîte à couvercle plat destinée à la conservation des hosties ou du pain utilisé dans le culte protestant.
status: 1

plat de communion
type: Concept
modified: 2014-01-10T00:00:00+01:00
in scheme: Thésaurus de la désignation des objets mobiliers
broader: objet du culte protestant
created: 2012-05-16T00:00:00+02:00
definition: Grand plat circulaire ou ovale destiné au pain nécessaire pour la communion sous les deux espèces.
status: 1

objet du culte protestant
type: PreferredTerm
modified: 2014-01-10T00:00:00+01:00
created: 2014-01-15T14:54:24+01:00
status: 1

aiguière de baptême
type: Concept
modified: 2014-01-10T00:00:00+01:00
in scheme: Thésaurus de la désignation des objets mobiliers
broader: objet du culte protestant
alternative label: fiole de baptême
created: 2012-05-16T00:00:00+02:00
related: aiguière
definition: Aiguière de petites dimensions (environ 15 cm de haut) destinée à contenir l'eau nécessaire pour le baptême.
TermeAssocie: aiguière
status: 1

aiguière de communion
type: Concept
modified: 2014-01-10T00:00:00+01:00
in scheme: Thésaurus de la désignation des objets mobiliers
broader: objet du culte protestant
alternative label: gueux
created: 2012-05-16T00:00:00+02:00
scope note: La "channe bernoise" est l'appellation particulière d'une forme fréquente d'aiguière de communion en étain comportant une tige horizontale reliant le goulot latéral au haut du corps.
related: aiguière
definition: Récipient en forme d'aiguière, généralement couvert et de grandes dimensions, destiné à contenir le vin nécessaire pour la communion.
TermeAssocie: aiguière
status: 1

gobelet de baptême
type: Concept
modified: 2014-01-10T00:00:00+01:00
in scheme: Thésaurus de la désignation des objets mobiliers
broader: objet du culte protestant
alternative label: godet de baptême
created: 2012-05-16T00:00:00+02:00
related: gobelet
definition: Gobelet ou godet muni parfois d'une anse mobile horizontale sur le dessus. Le gobelet de baptême peut aussi avoir la forme d'une bouteille. L'usage est identique à celui de l'aiguière de baptême.
TermeAssocie: gobelet
status: 1

patène protestante
type: Concept
modified: 2014-01-10T00:00:00+01:00
in scheme: Thésaurus de la désignation des objets mobiliers
broader: objet du culte protestant
created: 2012-05-16T00:00:00+02:00
scope note: Les objets servant à la communion forment un service de communion ou un service de sainte Cène : utiliser ce terme dans le champ PDEN.
definition: Nom donné chez les luthériens au plat de communion ou plat de Cène sur lequel est présenté le pain de l'Eucharistie. On utilise dans le culte luthérien des hosties et non du pain pour la communion ; il peut s'agir alors d'une patène du culte catholique utilisée par les protestants.
status: 1

bassin de baptême
type: Concept
modified: 2014-01-10T00:00:00+01:00
in scheme: Thésaurus de la désignation des objets mobiliers
broader: objet du culte protestant
created: 2012-05-16T00:00:00+02:00
definition: Bassin associé à l'aiguière de baptême et qui permet de recueillir l'eau du baptême par effusion.
status: 1

traîneau
type: Concept
modified: 2014-12-30T11:31:12+01:00
in scheme: Thésaurus de la désignation des objets mobiliers
preferred label: sleighs @en-us
broader: véhicule à énergie animale
created: 2013-11-05T00:00:00+01:00
definition: Véhicule sans roues mais muni de patins recourbés à l'avant, utilisé comme moyen de transport sur la neige et la glace.
status: 1

véhicule à énergie animale
type: Concept
modified: 2014-12-30T11:42:50+01:00
in scheme: Thésaurus de la désignation des objets mobiliers
preferred label: horse-drawn vehicles @en-us
narrower: harnachement ou attelage
narrower: traîneau
narrower: voiture utilitaire à énergie animale
narrower: véhicule à énergie animale pour le transport des personnes
broader: T69-8850
alternative label: voiture hippomobile
created: 2013-11-05T00:00:00+01:00
definition: Véhicule terrestre faisant appel aux forces des énergies animales, principalement des équidés.
status: 1

traîneau
type: PreferredTerm
modified: 2014-12-30T11:31:12+01:00
created: 2014-01-15T14:54:24+01:00
status: 1

porte-fontaine lavabo
type: PreferredTerm
modified: 2014-12-04T12:31:17+01:00
created: 2014-01-15T14:54:24+01:00
status: 1

plat pour le rachat du premier né
type: Concept
modified: 2014-01-10T00:00:00+01:00
in scheme: Thésaurus de la désignation des objets mobiliers
broader: objet lié à la naissance et à la circoncision
alternative label: plat de pidiyon ha-ben
created: 2012-05-16T00:00:00+02:00
definition: Plat à aumônes utilisé lors de la fête donnée à la fin du premier mois suivant la naissance d'un premier né.
status: 1

plat de pidiyon ha-ben
type: SimpleNonPreferredTerm
modified: 2014-01-10T00:00:00+01:00
created: 2014-01-15T14:54:24+01:00
status: 1

plat pour le rachat du premier né
type: PreferredTerm
modified: 2014-01-10T00:00:00+01:00
created: 2014-01-15T14:54:24+01:00
status: 1

objet lié à la naissance et à la circoncision
type: Concept
modified: 2014-01-10T00:00:00+01:00
in scheme: Thésaurus de la désignation des objets mobiliers
narrower: plat pour le rachat du premier né
narrower: nécessaire de circoncision
narrower: T69-2036
narrower: T69-2032
narrower: T69-2034
broader: objet lié aux cycles de la vie
created: 2012-05-16T00:00:00+02:00
status: 1

globe terrestre
type: Concept
modified: 2014-12-15T16:22:45+01:00
in scheme: Thésaurus de la désignation des objets mobiliers
preferred label: terrestrial globes @en-us
broader: objet de représentation de corps célestes
created: 2012-05-16T00:00:00+02:00
related: porte-globe
definition: Globe géographique fixe ou mobile autour d'un axe vertical ou légèrement incliné, proposant une représentation de la surface terrestre. Le globe terrestre peut être porté par un porte-globe et il forme parfois une paire avec le globe céleste.
TermeAssocie: porte-globe
status: 1

porte-globe
type: Concept
modified: 2014-10-13T12:56:41+02:00
in scheme: Thésaurus de la désignation des objets mobiliers
preferred label: globe stands @en-us
broader: support pour le bureau ou les loisirs
created: 2012-05-16T00:00:00+02:00
related: globe terrestre
related: T69-5388
definition: Support servant à exposer un globe géographique fixe ou mobile autour d'un axe vertical ou légèrement incliné.
TermeAssocie: globe terrestre
TermeAssocie: T69-5388
status: 1
narrow match: http://data.bnf.fr/ark:/12148/cb122238155

globe terrestre
type: PreferredTerm
modified: 2014-12-15T16:22:45+01:00
created: 2014-01-15T14:54:24+01:00
status: 1

chandelier d'acolyte
type: PreferredTerm
modified: 2014-11-27T12:54:53+01:00
created: 2014-01-15T14:54:24+01:00
status: 1

pupitre à musique
type: Concept
modified: 2014-12-05T11:24:35+01:00
in scheme: Thésaurus de la désignation des objets mobiliers
preferred label: music stands @en-us
broader: pupitre
created: 2012-05-16T00:00:00+02:00
definition: Pupitre servant à poser des partitions musicales. Il se reconnaît éventuellement par son décor.
status: 1
broad match: cb13574964k

pupitre à musique
type: PreferredTerm
modified: 2014-12-05T11:24:35+01:00
created: 2014-01-15T14:54:24+01:00
status: 1

voûte
type: Concept
modified: 2015-01-07T12:57:39+01:00
in scheme: Thésaurus de la désignation des objets mobiliers
preferred label: vaults (structural elements) @en-us
narrower: voussure
broader: couvrement
alternative label: voûte en berceau
alternative label: voûte à cantons
alternative label: cul-de-four
created: 2012-05-16T00:00:00+02:00
scope note: Voir aussi le Thesaurus de la désignation des œuvres architecturales et des espaces aménagés.
definition: Ouvrage, nécessairement maçonné, construit entre des appuis, couvrant un espace et présentant un intrados.
status: 1

voûte
type: PreferredTerm
modified: 2015-01-07T12:57:39+01:00
created: 2014-01-15T14:54:24+01:00
status: 1

cul-de-four
type: SimpleNonPreferredTerm
modified: 2015-01-07T12:57:39+01:00
created: 2014-01-15T14:54:24+01:00
status: 1

voûte en berceau
type: SimpleNonPreferredTerm
modified: 2015-01-07T12:57:39+01:00
created: 2014-01-15T14:54:24+01:00
status: 1

coupole
type: Concept
modified: 2015-01-07T14:28:04+01:00
in scheme: Thésaurus de la désignation des objets mobiliers
preferred label: domes (architectural elements) @en-us
broader: voûte
created: 2014-05-27T11:57:18+02:00
definition: Voûte de plan circulaire, ovale ou polygonal, dont l'intrados est théoriquement une concavité de révolution : il est tracé par la rotation d'un arc générateur sur un axe vertical.
status: 1

trompe d'architecture
type: Concept
modified: 2015-01-07T14:38:25+01:00
in scheme: Thésaurus de la désignation des objets mobiliers
preferred label: squinches & trompes @en-us
broader: voûte
created: 2014-05-27T11:59:25+02:00
definition: Petite voûte formant support sous un ouvrage ou sous un pan de mur en surplomb et permettant un changement de plan à un niveau quelconque de la construction. Toute voûte ayant fonction de support plus que de couvrement est une trompe.
status: 1

voûte à cantons
type: SimpleNonPreferredTerm
modified: 2015-01-07T12:57:39+01:00
created: 2014-01-15T14:54:24+01:00
status: 1

voussure
type: Concept
modified: 2015-01-07T15:03:12+01:00
in scheme: Thésaurus de la désignation des objets mobiliers
preferred label: splayed arches & voussoirs @en-us
broader: voûte
created: 2012-05-16T00:00:00+02:00
scope note: Voir aussi le Thesaurus de la désignation des œuvres architecturales et des espaces aménagés.
definition: Voûte couvrant l'embrasure profonde d'une baie ébrasée.
status: 1

machine à empaqueter
type: PreferredTerm
modified: 2015-10-14T16:01:50+02:00
created: 2014-01-15T14:54:24+01:00
status: 1

wagon-fourgon d'accompagnement
type: Concept
modified: 2014-10-14T16:36:19+02:00
in scheme: Thésaurus de la désignation des objets mobiliers
preferred label: cabooses @en-us
broader: matériel remorqué pour le transport ferroviaire des marchandises
created: 2013-11-04T00:00:00+01:00
definition: Véhicule ferroviaire destiné à accueillir le personnel de gestion des convois de marchandise.
status: 1
broad match: cb11931174j

wagon-fourgon d'accompagnement
type: PreferredTerm
modified: 2014-10-14T16:36:19+02:00
created: 2014-01-15T14:54:24+01:00
status: 1

bandage
type: SimpleNonPreferredTerm
modified: 2014-01-10T00:00:00+01:00
created: 2014-01-15T14:54:24+01:00
status: 1

instrument ou matériel de pharmacie
type: PreferredTerm
modified: 2014-01-10T00:00:00+01:00
created: 2014-01-15T14:54:24+01:00
status: 1

pot à sangsues
type: Concept
modified: 2014-01-10T00:00:00+01:00
in scheme: Thésaurus de la désignation des objets mobiliers
broader: instrument ou matériel de pharmacie
alternative label: bocal à sangsues
alternative label: verre à sangsues
created: 2012-05-16T00:00:00+02:00
status: 1

filtre de pharmacie
type: SimpleNonPreferredTerm
modified: 2014-01-10T00:00:00+01:00
created: 2014-01-15T14:54:24+01:00
status: 1

mâche-bouchon
type: Concept
modified: 2014-01-10T00:00:00+01:00
in scheme: Thésaurus de la désignation des objets mobiliers
broader: instrument ou matériel de pharmacie
created: 2013-12-10T00:00:00+01:00
status: 1

cuiller à médicament
type: Concept
modified: 2014-01-10T00:00:00+01:00
in scheme: Thésaurus de la désignation des objets mobiliers
broader: instrument ou matériel de pharmacie
alternative label: cuillère à médicament
created: 2012-05-16T00:00:00+02:00
status: 1

pansement
type: SimpleNonPreferredTerm
modified: 2014-01-10T00:00:00+01:00
created: 2014-01-15T14:54:24+01:00
status: 1

boîte à pansements
type: Concept
modified: 2014-01-10T00:00:00+01:00
in scheme: Thésaurus de la désignation des objets mobiliers
broader: instrument ou matériel de pharmacie
created: 2013-12-10T00:00:00+01:00
status: 1

objet lié au culte domestique
type: PreferredTerm
modified: 2014-01-10T00:00:00+01:00
created: 2014-01-15T14:54:24+01:00
status: 1

objet lié à la vie communautaire
type: Concept
modified: 2014-01-10T00:00:00+01:00
in scheme: Thésaurus de la désignation des objets mobiliers
narrower: objet pour le pain azyme
narrower: T69-2072
broader: objet lié au culte domestique
created: 2012-05-16T00:00:00+02:00
status: 1

boîte à savonnette
type: SimpleNonPreferredTerm
modified: 2014-12-10T16:42:25+01:00
created: 2014-01-15T14:54:24+01:00
status: 1

porte-savon
type: SimpleNonPreferredTerm
modified: 2014-12-10T16:42:25+01:00
created: 2014-01-15T14:54:24+01:00
status: 1

grille à savon
type: SimpleNonPreferredTerm
modified: 2014-12-10T16:42:25+01:00
created: 2014-01-15T14:54:24+01:00
status: 1

boîte à savon
type: PreferredTerm
modified: 2014-12-10T16:42:25+01:00
created: 2014-01-15T14:54:24+01:00
status: 1

bol à savon à barbe
type: SimpleNonPreferredTerm
modified: 2014-12-10T16:42:25+01:00
created: 2014-01-15T14:54:24+01:00
status: 1

boîte à savon à barbe
type: SimpleNonPreferredTerm
modified: 2014-12-10T16:42:25+01:00
created: 2014-01-15T14:54:24+01:00
status: 1

boule à savon
type: SimpleNonPreferredTerm
modified: 2014-12-10T16:42:25+01:00
created: 2014-01-15T14:54:24+01:00
status: 1

machine à découper par poinçon
type: Concept
modified: 2015-08-12T16:38:38+02:00
in scheme: Thésaurus de la désignation des objets mobiliers
broader: machine à découper
alternative label: poinçonneuse
alternative label: presse à excentrique
alternative label: presse à balancier
created: 2012-05-16T00:00:00+02:00
definition: Machine à découper un produit à l'aide d'un poinçon.
status: 1
narrow match: cb11982579n
narrow match: http://vocab.getty.edu/aat/300023178
broad match: Poinçonneuse

presse à excentrique
type: SimpleNonPreferredTerm
modified: 2015-08-12T16:38:38+02:00
created: 2014-01-15T14:54:24+01:00
status: 1

presse à balancier
type: SimpleNonPreferredTerm
modified: 2015-08-12T16:38:38+02:00
created: 2014-01-15T14:54:24+01:00
status: 1

machine à découper par poinçon
type: PreferredTerm
modified: 2015-08-12T16:38:38+02:00
created: 2014-01-15T14:54:24+01:00
status: 1

machine à découper
type: Concept
modified: 2015-10-14T10:40:39+02:00
in scheme: Thésaurus de la désignation des objets mobiliers
narrower: machine à découper par poinçon
narrower: machine à découper par molette
narrower: machine à découper par tranchoir
narrower: machine à découper par scie
narrower: T69-5587
narrower: T69-5589
broader: machine à façonner
created: 2012-05-16T00:00:00+02:00
definition: Machine à façonner par taille un produit solide, en suivant un contour prédéfini, pour en obtenir des éléments de dimensions ou de forme données.
status: 1

poinçonneuse
type: SimpleNonPreferredTerm
modified: 2015-08-12T16:38:38+02:00
created: 2014-01-15T14:54:24+01:00
status: 1

machine à dissoudre
type: Concept
modified: 2015-09-25T13:42:51+02:00
in scheme: Thésaurus de la désignation des objets mobiliers
broader: machine à changer d'état
alternative label: délayeur
created: 2012-05-16T00:00:00+02:00
definition: Machine à changer d'état un produit en le faisant passer à l'état de solution.
status: 1
narrow match: http://vocab.getty.edu/aat/300022786

délayeur
type: SimpleNonPreferredTerm
modified: 2015-09-25T13:42:51+02:00
created: 2014-01-15T14:54:24+01:00
status: 1

machine à dissoudre
type: PreferredTerm
modified: 2015-09-25T13:42:51+02:00
created: 2014-01-15T14:54:24+01:00
status: 1

locomotive articulée
type: PreferredTerm
modified: 2014-10-14T16:19:11+02:00
created: 2014-01-15T14:54:24+01:00
status: 1

machine à polir
type: Concept
modified: 2015-09-03T16:33:22+02:00
in scheme: Thésaurus de la désignation des objets mobiliers
broader: machine à lisser
alternative label: tonneau à polir
alternative label: tonneau à poncer
alternative label: tonneau de polissage
alternative label: ponceuse à plateau
alternative label: tour à polir
alternative label: émeriseuse
created: 2012-05-16T00:00:00+02:00
definition: Machine à lisser un produit ou un matériau (marbre, verre optique, nacre, matière plastique, etc.) en le frottant à l'aide d'un abrasif.
status: 1
broad match: Polissage
broad match: http://data.bnf.fr/ark:/12148/cb125365509

tour à polir
type: SimpleNonPreferredTerm
modified: 2015-09-03T16:33:22+02:00
created: 2014-01-15T14:54:24+01:00
status: 1

tonneau de polissage
type: SimpleNonPreferredTerm
modified: 2015-09-03T16:33:22+02:00
created: 2014-01-15T14:54:24+01:00
status: 1

émeriseuse
type: SimpleNonPreferredTerm
modified: 2015-09-03T16:33:22+02:00
created: 2014-01-15T14:54:24+01:00
status: 1

machine à polir
type: PreferredTerm
modified: 2015-09-03T16:33:22+02:00
created: 2014-01-15T14:54:24+01:00
status: 1

tonneau à polir
type: SimpleNonPreferredTerm
modified: 2015-09-03T16:33:22+02:00
created: 2014-01-15T14:54:24+01:00
status: 1

ponceuse à plateau
type: SimpleNonPreferredTerm
modified: 2015-09-03T16:33:22+02:00
created: 2014-01-15T14:54:24+01:00
status: 1

machine à lisser
type: Concept
modified: 2015-10-14T17:04:11+02:00
in scheme: Thésaurus de la désignation des objets mobiliers
narrower: machine à polir
broader: machine à surfacer
alternative label: calandre
created: 2012-05-16T00:00:00+02:00
definition: Machine à surfacer un produit (papier, étoffe, cuir, etc.) en lui donnant un aspect uni, lisse et brillant.
status: 1
narrow match: http://vocab.getty.edu/aat/300023389
narrow match: Calandre

tonneau à poncer
type: SimpleNonPreferredTerm
modified: 2015-09-03T16:33:22+02:00
created: 2014-01-15T14:54:24+01:00
status: 1

fermeture de baie
type: PreferredTerm
modified: 2015-02-06T12:53:00+01:00
created: 2014-01-15T14:54:24+01:00
status: 1

volet intérieur
type: Concept
modified: 2014-12-09T17:27:08+01:00
in scheme: Thésaurus de la désignation des objets mobiliers
preferred label: interior shutters @en-us
broader: fermeture de baie
created: 2012-05-16T00:00:00+02:00
definition: Panneau plein, en bois le plus souvent, pivotant sur un de ses bords verticaux et servant à doubler intérieurement un châssis vitré.
status: 1
broad match: cb11982871q

vantail
type: Concept
modified: 2014-12-09T17:03:00+01:00
in scheme: Thésaurus de la désignation des objets mobiliers
preferred label: sashes (window components) @en-us
broader: fermeture de baie
alternative label: châssis vitré
created: 2012-05-16T00:00:00+02:00
definition: Panneau plein, châssis vitré ou grille de fermeture pivotant sur un de ses bords verticaux.
status: 1

tintinnabule
type: SimpleNonPreferredTerm
modified: 2014-12-02T10:11:28+01:00
created: 2014-01-15T14:54:24+01:00
status: 1

clochette de basilique
type: PreferredTerm
modified: 2014-12-02T10:11:28+01:00
created: 2014-01-15T14:54:24+01:00
status: 1

convertisseur de fréquence
type: Concept
modified: 2015-08-03T16:16:06+02:00
in scheme: Thésaurus de la désignation des objets mobiliers
broader: convertisseur électrique
created: 2012-05-16T00:00:00+02:00
definition: Convertisseur électrique modifiant la fréquence d'un courant électrique.
status: 1

convertisseur électrique
type: Concept
modified: 2015-08-03T16:07:23+02:00
in scheme: Thésaurus de la désignation des objets mobiliers
narrower: convertisseur de fréquence
narrower: onduleur
narrower: redresseur
narrower: transformateur
broader: convertisseur
created: 2012-05-16T00:00:00+02:00
definition: Convertisseur d'énergie électrique adaptant le courant, la tension ou la fréquence.
status: 1

convertisseur de fréquence
type: PreferredTerm
modified: 2015-08-03T16:16:07+02:00
created: 2014-01-15T14:54:24+01:00
status: 1

guitare-lyre
type: Concept
modified: 2014-10-10T12:52:26+02:00
in scheme: Thésaurus de la désignation des objets mobiliers
preferred label: lyre-guitars @en-us
broader: guitare
alternative label: lyre guitare
created: 2012-05-16T00:00:00+02:00
definition: Guitare dont le manche est encadré de deux bras incurvés et dont la forme générale rappelle celle de la lyre.
status: 1
broad match: cb11938184j

guitare
type: PreferredTerm
modified: 2014-12-15T11:38:46+01:00
created: 2014-01-15T14:54:24+01:00
status: 1

armoire-bibliothèque
type: PreferredTerm
modified: 2014-12-04T15:32:09+01:00
created: 2014-01-15T14:54:24+01:00
status: 1

poêle à châtaignes
type: SimpleNonPreferredTerm
modified: 2014-12-08T12:32:12+01:00
created: 2014-01-15T14:54:24+01:00
status: 1

poêle à griller
type: SimpleNonPreferredTerm
modified: 2014-12-08T12:32:12+01:00
created: 2014-01-15T14:54:24+01:00
status: 1

poêle à four
type: SimpleNonPreferredTerm
modified: 2014-12-08T12:32:12+01:00
created: 2014-01-15T14:54:24+01:00
status: 1

poêle-casserole
type: SimpleNonPreferredTerm
modified: 2014-12-08T12:32:12+01:00
created: 2014-01-15T14:54:24+01:00
status: 1

poêle à cuire
type: PreferredTerm
modified: 2014-12-08T12:32:12+01:00
created: 2014-01-15T14:54:24+01:00
status: 1

poêlon
type: SimpleNonPreferredTerm
modified: 2014-12-08T12:32:12+01:00
created: 2014-01-15T14:54:24+01:00
status: 1

poêle à frire
type: SimpleNonPreferredTerm
modified: 2014-12-08T12:32:12+01:00
created: 2014-01-15T14:54:24+01:00
status: 1

selle de cavalier ou ses accessoires
type: Concept
modified: 2014-12-30T11:27:46+01:00
in scheme: Thésaurus de la désignation des objets mobiliers
preferred label: saddles (seats) @en-us
broader: harnachement ou attelage
alternative label: étrivière
alternative label: étrier
alternative label: arçon
created: 2013-11-05T00:00:00+01:00
definition: Pièce incurvée, principalement en cuir, qui, placée sur le dos de la monture, sert de siège au cavalier.
status: 1

fouet
type: Concept
modified: 2014-12-30T11:20:43+01:00
in scheme: Thésaurus de la désignation des objets mobiliers
preferred label: whips (animal equipment) @en-us
broader: harnachement ou attelage
alternative label: cravache
created: 2013-11-05T00:00:00+01:00
definition: Instrument fait d'une corde ou d'une lanière de cuir attachée à un manche servant à conduire et stimuler les chevaux et autres animaux de trait ou d'attelage.
status: 1

harnachement ou attelage
type: PreferredTerm
modified: 2014-12-30T11:29:06+01:00
created: 2014-01-15T14:54:24+01:00
status: 1

palonnier
type: SimpleNonPreferredTerm
modified: 2014-12-30T11:29:06+01:00
created: 2014-01-15T14:54:24+01:00
status: 1

pistolet mitrailleur
type: SimpleNonPreferredTerm
modified: 2014-12-12T14:36:52+01:00
created: 2014-01-15T14:54:24+01:00
status: 1

arme à feu
type: Concept
modified: 2014-12-12T14:34:26+01:00
in scheme: Thésaurus de la désignation des objets mobiliers
preferred label: firearms @en-us
narrower: arme d'épaule
narrower: arme de poing
narrower: T69-9111
broader: arme offensive
alternative label: tube lance-torpilles
alternative label: lance-roquettes
alternative label: lance-grenades
created: 2012-05-16T00:00:00+02:00
definition: Arme envoyant un projectile au moyen d'une déflagration ou d'une combustion d'un composé chimique.
status: 1

pétrinal
type: SimpleNonPreferredTerm
modified: 2014-12-12T14:36:52+01:00
created: 2014-01-15T14:54:24+01:00
status: 1

mousquet
type: SimpleNonPreferredTerm
modified: 2014-12-12T14:36:52+01:00
created: 2014-01-15T14:54:24+01:00
status: 1

espingole
type: SimpleNonPreferredTerm
modified: 2014-12-12T14:36:52+01:00
created: 2014-01-15T14:54:24+01:00
status: 1

mitraillette
type: SimpleNonPreferredTerm
modified: 2014-12-12T14:36:52+01:00
created: 2014-01-15T14:54:24+01:00
status: 1

carabine
type: Concept
modified: 2014-12-12T14:37:48+01:00
in scheme: Thésaurus de la désignation des objets mobiliers
preferred label: carbines @en-us
broader: arme d'épaule
created: 2012-05-16T00:00:00+02:00
definition: Arme à feu pourvu d'une crosse d'épaule et dont le canon long possède une âme rayée, imprimant un mouvement de rotation au projectile. Elle est généralement de dimension, de puissance et de portée plus réduite que le fusil.
status: 1

fusil mitrailleur
type: SimpleNonPreferredTerm
modified: 2014-12-12T14:36:52+01:00
created: 2014-01-15T14:54:24+01:00
status: 1

tromblon
type: SimpleNonPreferredTerm
modified: 2014-12-12T14:36:52+01:00
created: 2014-01-15T14:54:24+01:00
status: 1

arquebuse
type: SimpleNonPreferredTerm
modified: 2014-12-12T14:36:52+01:00
created: 2014-01-15T14:54:24+01:00
status: 1

arme d'épaule
type: PreferredTerm
modified: 2014-12-12T14:36:52+01:00
created: 2014-01-15T14:54:24+01:00
status: 1

mousqueton (arme)
type: SimpleNonPreferredTerm
modified: 2014-12-12T14:36:52+01:00
created: 2014-01-15T14:54:24+01:00
status: 1

porte-crémaillère
type: Concept
modified: 2014-12-05T14:57:59+01:00
in scheme: Thésaurus de la désignation des objets mobiliers
broader: objet d'âtre pour la cuisson
created: 2012-05-16T00:00:00+02:00
related: potence d'âtre
definition: Barre suspendue dans le fond de la cheminée pour y accrocher un nombre variable de crémaillères.
TermeAssocie: potence d'âtre
status: 1
broad match: cb11931172v
broad match: http://vocab.getty.edu/aat/300200422
broad match: Crémaillère

potence d'âtre
type: Concept
modified: 2014-12-05T10:53:41+01:00
in scheme: Thésaurus de la désignation des objets mobiliers
preferred label: gallows @en-us
broader: meuble pour le feu ou le réchauffage
created: 2012-05-16T00:00:00+02:00
related: porte-crémaillère
related: T69-4497
definition: Montant mobile en bois ou en fer, placé dans un âtre, auquel est assemblé un bras horizontal à l'extrémité duquel s'accroche la crémaillère portant le récipient pour la cuisson des aliments.
TermeAssocie: porte-crémaillère
TermeAssocie: T69-4497
status: 1
broad match: cb13337214n

porte-crémaillère
type: PreferredTerm
modified: 2014-12-05T14:57:59+01:00
created: 2014-01-15T14:54:24+01:00
status: 1

boîte à cédrat
type: PreferredTerm
modified: 2014-01-10T00:00:00+01:00
created: 2014-01-15T14:54:24+01:00
status: 1

boîte à etrog
type: SimpleNonPreferredTerm
modified: 2014-01-10T00:00:00+01:00
created: 2014-01-15T14:54:24+01:00
status: 1

hautbois de chasse
type: SimpleNonPreferredTerm
modified: 2014-10-10T11:42:51+02:00
created: 2014-01-15T14:54:24+01:00
status: 1

cor anglais
type: SimpleNonPreferredTerm
modified: 2014-10-10T11:42:51+02:00
created: 2014-01-15T14:54:24+01:00
status: 1

hautbois
type: PreferredTerm
modified: 2014-10-10T11:42:51+02:00
created: 2014-01-15T14:54:24+01:00
status: 1

hautbois d'amour
type: SimpleNonPreferredTerm
modified: 2014-10-10T11:42:51+02:00
created: 2014-01-15T14:54:24+01:00
status: 1

mobilier médical
type: Concept
modified: 2014-01-10T00:00:00+01:00
in scheme: Thésaurus de la désignation des objets mobiliers
narrower: meuble de pharmacie
broader: matériel médical
alternative label: civière
alternative label: table d'opération
alternative label: lit médicalisé
alternative label: lit d'hôpital
alternative label: chaise d'accouchement
alternative label: fauteuil de dentiste
created: 2013-12-10T00:00:00+01:00
related: véhicule d'aide à la mobilité
TermeAssocie: véhicule d'aide à la mobilité
status: 1

véhicule d'aide à la mobilité
type: Concept
modified: 2014-12-30T11:54:57+01:00
in scheme: Thésaurus de la désignation des objets mobiliers
broader: T69-8851
alternative label: fauteuil roulant
created: 2013-11-05T00:00:00+01:00
related: mobilier médical
related: T69-9551
definition: Equipement à roues permettant à une personne assise, blessée ou handicapée, de se déplacer seule.
TermeAssocie: mobilier médical
TermeAssocie: T69-9551
status: 1
narrow match: http://vocab.getty.edu/aat/300038243
narrow match: Fauteuil roulant

chaise d'accouchement
type: SimpleNonPreferredTerm
modified: 2014-01-10T00:00:00+01:00
created: 2014-01-15T14:54:24+01:00
status: 1

table d'opération
type: SimpleNonPreferredTerm
modified: 2014-01-10T00:00:00+01:00
created: 2014-01-15T14:54:24+01:00
status: 1

lit médicalisé
type: SimpleNonPreferredTerm
modified: 2014-01-10T00:00:00+01:00
created: 2014-01-15T14:54:24+01:00
status: 1

lit d'hôpital
type: SimpleNonPreferredTerm
modified: 2014-01-10T00:00:00+01:00
created: 2014-01-15T14:54:24+01:00
status: 1

fauteuil de dentiste
type: SimpleNonPreferredTerm
modified: 2014-01-10T00:00:00+01:00
created: 2014-01-15T14:54:24+01:00
status: 1

mobilier médical
type: PreferredTerm
modified: 2014-01-10T00:00:00+01:00
created: 2014-01-15T14:54:24+01:00
status: 1

meuble de pharmacie
type: Concept
modified: 2014-01-10T00:00:00+01:00
in scheme: Thésaurus de la désignation des objets mobiliers
broader: mobilier médical
created: 2013-12-16T00:00:00+01:00
status: 1

civière
type: SimpleNonPreferredTerm
modified: 2014-01-10T00:00:00+01:00
created: 2014-01-15T14:54:24+01:00
status: 1

aiguière de baptême
type: PreferredTerm
modified: 2014-01-10T00:00:00+01:00
created: 2014-01-15T14:54:24+01:00
status: 1

fiole de baptême
type: SimpleNonPreferredTerm
modified: 2014-01-10T00:00:00+01:00
created: 2014-01-15T14:54:24+01:00
status: 1

accumulation
type: Concept
modified: 2014-10-17T16:10:21+02:00
in scheme: Thésaurus de la désignation des objets mobiliers
broader: sculpture
created: 2013-07-19T00:00:00+02:00
definition: Œuvre obtenue par la juxtaposition d'objets manufacturés.
status: 1
broad match: http://data.bnf.fr/ark:/12148/cb11933241b

accumulation
type: PreferredTerm
modified: 2014-10-17T16:10:21+02:00
created: 2014-01-15T14:54:24+01:00
status: 1

théière
type: Concept
modified: 2014-12-08T16:14:29+01:00
in scheme: Thésaurus de la désignation des objets mobiliers
preferred label: teapots @en-us
broader: récipient pour le service et la consommation des boissons
alternative label: pot à thé
created: 2012-05-16T00:00:00+02:00
definition: Récipient verseur couvert, en métal ou en céramique, à goulot et anse latérale, servant à faire infuser le thé et à le servir. La théière, de forme pansue, comporte en général une petite plaque perforée formant filtre au départ intérieur du goulot.
status: 1

théière
type: PreferredTerm
modified: 2014-12-08T16:14:29+01:00
created: 2014-01-15T14:54:24+01:00
status: 1

pot à thé
type: SimpleNonPreferredTerm
modified: 2014-12-08T16:14:29+01:00
created: 2014-01-15T14:54:24+01:00
status: 1

porte-cierge de procession
type: Concept
modified: 2014-11-28T12:56:50+01:00
in scheme: Thésaurus de la désignation des objets mobiliers
preferred label: processional candleholders @en-us
preferred label: candelabro portatile @it
preferred label: cirial @pt
broader: objet lié à la procession
created: 2012-05-16T00:00:00+02:00
definition: Chandelier à bobèche monté sur une hampe, sans base, destiné à porter un cierge lors des processions, pour accompagner le saint sacrement ou, lors des messes solennelles, depuis le Sanctus jusqu'à la communion.
status: 1
broad match: http://data.bnf.fr/ark:/12148/cb119367105
broad match: Procession religieuse

porte-cierge de procession
type: PreferredTerm
modified: 2014-11-28T12:56:50+01:00
created: 2014-01-15T14:54:24+01:00
status: 1

balance Roberval
type: SimpleNonPreferredTerm
modified: 2014-01-10T00:00:00+01:00
created: 2014-01-15T14:54:24+01:00
status: 1

machine à peser
type: Concept
modified: 2015-10-08T15:21:19+02:00
in scheme: Thésaurus de la désignation des objets mobiliers
broader: T69-5475
alternative label: balance à pont-bascule
alternative label: balance industrielle
alternative label: bascule
created: 2012-05-16T00:00:00+02:00
related: balance
related: instrument de mesure des masses
related: T69-5291
definition: Machine à contrôler des quantités massives.
TermeAssocie: balance
TermeAssocie: instrument de mesure des masses
TermeAssocie: T69-5291
status: 1
narrow match: cb11983022j
narrow match: Bascule

balance
type: PreferredTerm
modified: 2014-01-10T00:00:00+01:00
created: 2014-01-15T14:54:24+01:00
status: 1

bascule romaine
type: SimpleNonPreferredTerm
modified: 2014-01-10T00:00:00+01:00
created: 2014-01-15T14:54:24+01:00
status: 1

balance romaine
type: SimpleNonPreferredTerm
modified: 2014-01-10T00:00:00+01:00
created: 2014-01-15T14:54:24+01:00
status: 1

ciseaux à ouvrage
type: Concept
modified: 2014-12-10T14:20:14+01:00
in scheme: Thésaurus de la désignation des objets mobiliers
broader: objet ou matériel pour les ouvrages textiles
alternative label: ciseaux à coudre
alternative label: ciseaux à broder
alternative label: ciseaux à tulle
alternative label: ciseaux de coupe
alternative label: ciseaux à boutonnière
created: 2012-05-16T00:00:00+02:00
definition: Instrument coupant constitué de deux lames d'acier articulées autour d'un pivot, aux formes et dimensions adaptées aux travaux de couture.
status: 1
broad match: http://vocab.getty.edu/aat/300023459

ciseaux à coudre
type: SimpleNonPreferredTerm
modified: 2014-12-10T14:20:14+01:00
created: 2014-01-15T14:54:24+01:00
status: 1

ciseaux à tulle
type: SimpleNonPreferredTerm
modified: 2014-12-10T14:20:14+01:00
created: 2014-01-15T14:54:24+01:00
status: 1

ciseaux à boutonnière
type: SimpleNonPreferredTerm
modified: 2014-12-10T14:20:14+01:00
created: 2014-01-15T14:54:24+01:00
status: 1

ciseaux à ouvrage
type: PreferredTerm
modified: 2014-12-10T14:20:14+01:00
created: 2014-01-15T14:54:24+01:00
status: 1

ciseaux de coupe
type: SimpleNonPreferredTerm
modified: 2014-12-10T14:20:14+01:00
created: 2014-01-15T14:54:24+01:00
status: 1

ciseaux à broder
type: SimpleNonPreferredTerm
modified: 2014-12-10T14:20:14+01:00
created: 2014-01-15T14:54:24+01:00
status: 1

miniature
type: Concept
modified: 2014-12-03T16:33:58+01:00
in scheme: Thésaurus de la désignation des objets mobiliers
preferred label: miniatures @en-us
broader: tableau
created: 2012-05-16T00:00:00+02:00
definition: Tableau de petit format, représentant une figure, une scène ou un paysage à échelle très réduite et de façon très détaillée. Son support, souvent l'ivoire, est mince et il comporte un cadre spécifique.
status: 1

miniature
type: PreferredTerm
modified: 2014-12-03T16:33:58+01:00
created: 2014-01-15T14:54:24+01:00
status: 1

parasol
type: PreferredTerm
modified: 2014-12-04T15:17:27+01:00
created: 2014-01-15T14:54:24+01:00
status: 1

espagnolette
type: Concept
modified: 2015-01-23T17:31:35+01:00
in scheme: Thésaurus de la désignation des objets mobiliers
preferred label: espagnolette bolts @en-us
broader: organe de sécurité
created: 2012-05-16T00:00:00+02:00
definition: Organe de sécurité permettant la fermeture simultanée de deux vantaux. L'espagnolette comporte, fixée sur un des vantaux, une tringle unique maintenue par des guides ou lacets, tournant sur eux-mêmes, ce qui permet à ses extrémités, en forme de crochets, de pénétrer dans une gâche fixée sur le bâti.
status: 1
broad match: http://data.bnf.fr/ark:/12148/cb12122640d

espagnolette
type: PreferredTerm
modified: 2015-01-23T17:31:35+01:00
created: 2014-01-15T14:54:24+01:00
status: 1

machine à pelleter
type: Concept
modified: 2015-10-08T17:02:39+02:00
in scheme: Thésaurus de la désignation des objets mobiliers
broader: machine à creuser
alternative label: drague
alternative label: dragline
created: 2012-05-16T00:00:00+02:00
definition: Machine à creuser à l'aide de godets racleurs articulés.
status: 1
narrow match: cb12555431x
narrow match: Dragline
narrow match: http://vocab.getty.edu/aat/300022296

drague
type: SimpleNonPreferredTerm
modified: 2015-10-08T17:02:39+02:00
created: 2014-01-15T14:54:24+01:00
status: 1

machine à pelleter
type: PreferredTerm
modified: 2015-10-08T17:02:39+02:00
created: 2014-01-15T14:54:24+01:00
status: 1

dragline
type: SimpleNonPreferredTerm
modified: 2015-10-08T17:02:39+02:00
created: 2014-01-15T14:54:24+01:00
status: 1

machine à écharner
type: PreferredTerm
modified: 2015-10-15T12:11:54+02:00
created: 2014-01-15T14:54:24+01:00
status: 1

écharneuse
type: SimpleNonPreferredTerm
modified: 2015-10-15T12:11:54+02:00
created: 2014-01-15T14:54:24+01:00
status: 1

mortier à encens
type: Concept
modified: 2014-11-27T11:38:30+01:00
in scheme: Thésaurus de la désignation des objets mobiliers
preferred label: mortaio per incenso @it
preferred label: incense mortars @en-us
preferred label: almofariz de incenso @pt
broader: objet lié à l'ablution, à l'aspersion et à l'encensement
alternative label: pilon à encens
created: 2012-05-16T00:00:00+02:00
definition: Récipient, généralement en bronze, présentant parfois un motif religieux, utilisé pour écraser l'encens avec un pilon à encens.
status: 1

pilon à encens
type: SimpleNonPreferredTerm
modified: 2014-11-27T11:38:30+01:00
created: 2014-01-15T14:54:24+01:00
status: 1

mortier à encens
type: PreferredTerm
modified: 2014-11-27T11:38:30+01:00
created: 2014-01-15T14:54:24+01:00
status: 1

sucrier
type: Concept
modified: 2014-12-10T13:23:48+01:00
in scheme: Thésaurus de la désignation des objets mobiliers
preferred label: sugar bowls @en-us
narrower: T69-3885
broader: récipient pour le service ou la consommation des aliments
alternative label: sucrier à sucre en poudre
alternative label: pot à sucre
created: 2012-05-16T00:00:00+02:00
related: verre d'eau
related: cuiller
definition: Récipient couvert, en terre cuite, métal ou verre, circulaire ou ovale, comportant deux anses latérales, posé sur un ou plusieurs pieds bas et contenant le sucre en morceaux ou en poudre.
TermeAssocie: verre d'eau
TermeAssocie: cuiller
status: 1
broad match: http://data.bnf.fr/ark:/12148/cb137554066

table d'en-cas
type: Concept
modified: 2014-12-05T13:41:39+01:00
in scheme: Thésaurus de la désignation des objets mobiliers
preferred label: snack tables @en-us
broader: table pour l'hygiène ou le repos
created: 2012-05-16T00:00:00+02:00
related: verre d'eau
definition: Table rectangulaire ou ovale, servant de table de nuit et de garde-manger pour la nuit ou plutôt de porte-plateau de boisson et nourriture. De taille légèrement plus importante que la table de nuit ordinaire, elle est à deux niveaux de rangement fermés.
TermeAssocie: verre d'eau
status: 1
broad match: http://data.bnf.fr/ark:/12148/cb131630926
broad match: Table

verre d'eau
type: PreferredTerm
modified: 2014-12-08T16:20:57+01:00
created: 2014-01-15T14:54:24+01:00
status: 1

machine à pelucher
type: Concept
modified: 2014-01-10T00:00:00+01:00
in scheme: Thésaurus de la désignation des objets mobiliers
broader: machine à surfacer
alternative label: laineuse
created: 2012-05-16T00:00:00+02:00
definition: Machine à surfacer un tissu de laine ou de coton afin de lui donner, par grattage, un aspect pelucheux et doux.
status: 1

laineuse
type: SimpleNonPreferredTerm
modified: 2014-01-10T00:00:00+01:00
created: 2014-01-15T14:54:24+01:00
status: 1

machine à pelucher
type: PreferredTerm
modified: 2014-01-10T00:00:00+01:00
created: 2014-01-15T14:54:24+01:00
status: 1

tronc d'église
type: SimpleNonPreferredTerm
modified: 2014-12-01T17:14:43+01:00
created: 2014-01-15T14:54:24+01:00
status: 1

tronc à aumônes
type: SimpleNonPreferredTerm
modified: 2014-12-01T17:14:43+01:00
created: 2014-01-15T14:54:24+01:00
status: 1

tronc
type: PreferredTerm
modified: 2014-12-01T17:14:43+01:00
created: 2014-01-15T14:54:24+01:00
status: 1

meuble lié à l'offrande
type: Concept
modified: 2014-12-01T17:02:46+01:00
in scheme: Thésaurus de la désignation des objets mobiliers
preferred label: furniture and furnishings for offerings @en-us
preferred label: arredi per l'offerta @it
preferred label: mobiliário relacionado com oferendas @pt
narrower: tronc
narrower: table à pains bénits
narrower: T69-770
narrower: T69-767
broader: meuble du culte catholique
created: 2012-05-16T00:00:00+02:00
definition: Mobilier destiné à la collecte, au transport ou à la distributrion des offrandes.
status: 1
broad match: http://data.bnf.fr/ark:/12148/cb131627054

miséricorde
type: SimpleNonPreferredTerm
modified: 2014-12-02T15:18:05+01:00
created: 2014-01-15T14:54:24+01:00
status: 1

jouée de stalles
type: SimpleNonPreferredTerm
modified: 2014-12-02T15:18:05+01:00
created: 2014-01-15T14:54:24+01:00
status: 1

stalle
type: PreferredTerm
modified: 2014-12-02T15:18:05+01:00
created: 2014-01-15T14:54:24+01:00
status: 1

parclose
type: SimpleNonPreferredTerm
modified: 2014-12-02T15:18:05+01:00
created: 2014-01-15T14:54:24+01:00
status: 1

stalles
type: SimpleNonPreferredTerm
modified: 2014-12-02T15:18:05+01:00
created: 2014-01-15T14:54:24+01:00
status: 1

ombellino de basilique
type: Concept
modified: 2014-12-02T10:16:39+01:00
in scheme: Thésaurus de la désignation des objets mobiliers
preferred label: basilica ombellino @en-us
preferred label: padiglione basilicale @it
preferred label: umbela basilical @pt
broader: meuble lié à la procession et à la dévotion
alternative label: ombrellino de basilique
alternative label: pavillon de basilique
created: 2012-05-16T00:00:00+02:00
definition: Signe distinctif d'une basilique en forme de parasol et aux couleurs papales, pouvant être porté en procession.
status: 1
broad match: http://data.bnf.fr/ark:/12148/cb131627054
broad match: http://vocab.getty.edu/aat/300298963

ombellino de basilique
type: PreferredTerm
modified: 2014-12-02T10:16:39+01:00
created: 2014-01-15T14:54:24+01:00
status: 1

ombrellino de basilique
type: SimpleNonPreferredTerm
modified: 2014-12-02T10:16:39+01:00
created: 2014-01-15T14:54:24+01:00
status: 1

pavillon de basilique
type: SimpleNonPreferredTerm
modified: 2014-12-02T10:16:39+01:00
created: 2014-01-15T14:54:24+01:00
status: 1

chocolatière
type: PreferredTerm
modified: 2014-12-08T15:51:03+01:00
created: 2014-01-15T14:54:24+01:00
status: 1

tramway
type: Concept
modified: 2014-12-17T17:35:16+01:00
in scheme: Thésaurus de la désignation des objets mobiliers
preferred label: streetcars @en-us
broader: automoteur ferroviaire
alternative label: tramway à accumulateurs
alternative label: tramway à air comprimé
alternative label: tramway électrique
created: 2013-11-04T00:00:00+01:00
definition: Véhicule autonome destiné aux transports urbains et suburbains dont le réseau ferré s'insère dans la voirie publique.
status: 1

autorail
type: Concept
modified: 2014-12-17T17:19:29+01:00
in scheme: Thésaurus de la désignation des objets mobiliers
preferred label: railbuses @en-us
broader: automoteur ferroviaire
created: 2013-11-04T00:00:00+01:00
definition: Véhicule ferroviaire autonome à traction thermique, diesel ou essence.
status: 1
broad match: http://vocab.getty.edu/aat/300228410

automotrice à vapeur
type: Concept
modified: 2014-10-14T16:10:47+02:00
in scheme: Thésaurus de la désignation des objets mobiliers
broader: automoteur ferroviaire
created: 2013-11-04T00:00:00+01:00
definition: Véhicule ferroviaire autonome à traction à vapeur.
status: 1

draisine
type: Concept
modified: 2014-12-17T17:20:41+01:00
in scheme: Thésaurus de la désignation des objets mobiliers
preferred label: draisines @en-us
broader: automoteur ferroviaire
created: 2013-11-04T00:00:00+01:00
definition: Véhicule autonome destiné au transport sur site des personnels chargé de la maintenance des installations ferroviaires.
status: 1
broad match: cb11938431s

automotrice électrique
type: Concept
modified: 2014-12-17T17:13:57+01:00
in scheme: Thésaurus de la désignation des objets mobiliers
broader: automoteur ferroviaire
created: 2013-11-04T00:00:00+01:00
definition: Véhicule ou matériel destiné au transport sur rail.
status: 1

automoteur ferroviaire
type: PreferredTerm
modified: 2014-10-14T16:09:43+02:00
created: 2014-01-15T14:54:24+01:00
status: 1

automotrice de chemin de fer métropolitain
type: Concept
modified: 2014-09-16T16:38:34+02:00
in scheme: Thésaurus de la désignation des objets mobiliers
broader: automoteur ferroviaire
created: 2013-11-04T00:00:00+01:00
definition: Véhicule autonome à traction électrique destiné au service des lignes de métropolitain.
status: 1

porte-montre
type: Concept
modified: 2014-10-16T14:47:48+02:00
in scheme: Thésaurus de la désignation des objets mobiliers
preferred label: watch stands @en-us
broader: objet décoratif ou de rangement ou pour les plantes et les fleurs
alternative label: crochet de montres
created: 2012-05-16T00:00:00+02:00
related: baguier
definition: Support servant à présenter (encastrée ou suspendue) une montre de poche lorsqu’elle n’est pas portée.
TermeAssocie: baguier
status: 1
broad match: http://data.bnf.fr/ark:/12148/cb119384444
broad match: Montre (horlogerie)

baguier
type: PreferredTerm
modified: 2014-10-17T14:24:22+02:00
created: 2014-01-15T14:54:24+01:00
status: 1

chaise de fidèle
type: SimpleNonPreferredTerm
modified: 2014-12-02T14:37:40+01:00
created: 2014-01-15T14:54:24+01:00
status: 1

chaise d'église
type: PreferredTerm
modified: 2014-12-02T14:37:40+01:00
created: 2014-01-15T14:54:24+01:00
status: 1

machine à envelopper
type: PreferredTerm
modified: 2015-10-14T16:06:05+02:00
created: 2014-01-15T14:54:24+01:00
status: 1

coussinet
type: Concept
modified: 2015-02-05T16:54:38+01:00
in scheme: Thésaurus de la désignation des objets mobiliers
preferred label: springers @en-us
broader: support en surplomb
created: 2012-05-16T00:00:00+02:00
definition: Organe en surplomb au-dessus du tableau de certains piédroits et portant un linteau, une plate-bande ou un arc en réduisant la portée de ce couvrement.
status: 1
broad match: cb11977661v

coussinet
type: PreferredTerm
modified: 2015-02-05T16:54:38+01:00
created: 2014-01-15T14:54:24+01:00
status: 1

saloir à sel
type: Concept
modified: 2014-10-13T11:00:20+02:00
in scheme: Thésaurus de la désignation des objets mobiliers
broader: coffre-réserve
alternative label: coffre à sel
created: 2012-05-16T00:00:00+02:00
related: boîte à sel
definition: Coffre de petite taille servant à conserver le sel. Il peut être creusé dans la masse.
TermeAssocie: boîte à sel
status: 1

boîte à sel
type: Concept
modified: 2014-12-08T11:42:04+01:00
in scheme: Thésaurus de la désignation des objets mobiliers
preferred label: salt boxes (containers) @en-us
broader: récipient pour la conservation des aliments ou des boissons
alternative label: panier à sel
alternative label: boîte à sel d'applique
created: 2012-05-16T00:00:00+02:00
related: saloir à sel
definition: Boîte servant à conserver le sel d'usage courant. Elle est souvent d'applique.
TermeAssocie: saloir à sel
status: 1

coffre à sel
type: SimpleNonPreferredTerm
modified: 2014-10-13T11:00:20+02:00
created: 2014-01-15T14:54:24+01:00
status: 1

saloir à sel
type: PreferredTerm
modified: 2014-10-13T11:00:20+02:00
created: 2014-01-15T14:54:24+01:00
status: 1

baiser de paix
type: Concept
modified: 2015-01-27T11:15:39+01:00
in scheme: Thésaurus de la désignation des objets mobiliers
preferred label: paxes @en-us
preferred label: pace @it
preferred label: porta-paz @pt
broader: objet de dévotion
alternative label: osculatoire
alternative label: instrument de paix
created: 2012-05-16T00:00:00+02:00
definition: Plaque habituellement en métal, portant une représentation religieuse, que les fidèles et parfois le célébrant embrassent en signe de paix pendant la messe. Elle porte au dos une petite poignée qui permet de l'exposer verticalement.
status: 1
broad match: cb12233110q

image de commémoration
type: Concept
modified: 2014-11-26T16:13:55+01:00
in scheme: Thésaurus de la désignation des objets mobiliers
preferred label: santino @it
preferred label: devotional cards @en-us
preferred label: registo de santo @pt
broader: objet de dévotion
alternative label: image mortuaire
alternative label: canivet
alternative label: image de piété
alternative label: image de jubilé
alternative label: image d'ordination
alternative label: image de communion
alternative label: avis de messe
alternative label: image pieuse
created: 2012-05-16T00:00:00+02:00
definition: Image à sujet ou symbole religieux, donnée en commémoration d'un événement personnel à caractère religieux comportant un texte rappelant cet événement, sa date et parfois une prière ou un texte religieux.
status: 1

tableau de mission
type: Concept
modified: 2014-11-27T10:42:21+01:00
in scheme: Thésaurus de la désignation des objets mobiliers
preferred label: missionary panels @en-us
preferred label: tabella di missione @it
preferred label: quadro da missão @pt
broader: objet de dévotion
created: 2012-05-16T00:00:00+02:00
definition: Peinture ou estampe montée sur des baguettes sur ses bords inférieur et supérieur pour pouvoir être roulée et transportée. Le tableau de mission est utilisé pour l'enseignement missionnaire et porte souvent une représentation de l'enfer, du paradis ou des péchés capitaux.
status: 1
broad match: http://vocab.getty.edu/aat/300234144

clef de saint Pierre
type: SimpleNonPreferredTerm
modified: 2015-10-28T15:24:23+01:00
created: 2014-01-15T14:54:24+01:00
status: 1

panneau de dévotion
type: Concept
modified: 2014-11-26T16:41:35+01:00
in scheme: Thésaurus de la désignation des objets mobiliers
preferred label: devotional panels @en-us
preferred label: targa devozionale @it
preferred label: painel devocional @pt
broader: objet de dévotion
alternative label: tableau de dévotion
created: 2012-05-16T00:00:00+02:00
definition: Plaque généralement encadrée, parfois décorée de motifs, représentations ou symboles religieux, portant une prière, une inscription signalant aux fidèles la présence d'un lieu ou d'un objet de dévotion.
status: 1

estoc pontifical
type: SimpleNonPreferredTerm
modified: 2015-10-28T15:24:23+01:00
created: 2014-01-15T14:54:24+01:00
status: 1

instruments de la Passion
type: Concept
modified: 2014-11-26T16:16:54+01:00
in scheme: Thésaurus de la désignation des objets mobiliers
preferred label: instruments of the Passion @en-us
preferred label: strumenti simbolici dellla Passione @it
preferred label: instrumentos da Paixão @pt
broader: objet de dévotion
created: 2012-05-16T00:00:00+02:00
related: croix de la Passion
definition: Reproduction des objets liés à la Passion du Christ (croix, clous, tenailles, marteau, couronne d'épines, lance, colonne, roseau, fouet, éponge, échelle, dés à jouer, tunique, coq, soleil, lune, main, lanterne, etc.) exposés ou portés en procession durant la Semaine sainte.
TermeAssocie: croix de la Passion
status: 1

marque à pain bénit
type: Concept
modified: 2014-11-26T16:20:27+01:00
in scheme: Thésaurus de la désignation des objets mobiliers
preferred label: stampo per pane benedetto @it
preferred label: blessed bread presses @en-us
preferred label: marca de pão bento @pt
broader: objet de dévotion
created: 2012-05-16T00:00:00+02:00
definition: Poinçon utilisé pour marquer une image religieuse sur les pains bénits que l'on distribuait aux fidèles pendant la messe, parfois aux membres d'une confrérie ou aux pauvres à l'occasion de cérémonies particulières.
status: 1
broad match: http://vocab.getty.edu/aat/300380004

bénitier d'applique
type: Concept
modified: 2014-11-26T14:44:34+01:00
in scheme: Thésaurus de la désignation des objets mobiliers
preferred label: wall-stoups @en-us
preferred label: acquasanteria pensile @it
preferred label: piazinha de água benta @pt
broader: objet de dévotion
alternative label: bénitier de dévotion
alternative label: bénitier d'objet
alternative label: bénitier domestique
alternative label: bénitier de chevet
created: 2012-05-16T00:00:00+02:00
definition: Petite vasque appliquée et accrochée au mur ou à un meuble, utilisée dans une sacristie ou chez un particulier.
status: 1

chapelet
type: Concept
modified: 2014-11-26T14:51:14+01:00
in scheme: Thésaurus de la désignation des objets mobiliers
preferred label: corona del rosario @it
preferred label: chaplets (rosaries) @en-us
preferred label: terço @pt
broader: objet de dévotion
alternative label: rosaire
alternative label: dizainier
alternative label: bague chapelet
created: 2012-05-16T00:00:00+02:00
related: T69-1511
definition: Instrument de dévotion fait de grains disposés sur une chaîne ou un fil fermé, généralement organisés en cinq séries de dix petits grains (dizaines) séparées par un plus gros. A cette boucle, est suspendue une autre série de trois petits grains entourés de deux gros et terminée par une croix.
TermeAssocie: T69-1511
status: 1

objet de dévotion
type: PreferredTerm
modified: 2015-10-28T15:24:23+01:00
created: 2014-01-15T14:54:24+01:00
status: 1

oratoire portatif
type: Concept
modified: 2014-11-26T16:38:49+01:00
in scheme: Thésaurus de la désignation des objets mobiliers
preferred label: oratorio portatile @it
preferred label: portable oratories @en-us
preferred label: oratório portátil @pt
broader: objet de dévotion
alternative label: oratoire de voyage
alternative label: boîte de mendiant
created: 2012-05-16T00:00:00+02:00
definition: Petit oratoire domestique pouvant être déplacé.
status: 1

médaille de dévotion
type: Concept
modified: 2014-11-26T16:27:35+01:00
in scheme: Thésaurus de la désignation des objets mobiliers
preferred label: devotional medals @en-us
preferred label: medaglia devozionale @it
preferred label: medalha devocional @pt
broader: objet de dévotion
alternative label: médaille de pèlerinage
alternative label: médaille-scapulaire
alternative label: médaille de baptême
alternative label: médaille de communion
alternative label: médaille miraculeuse
alternative label: médaille pontificale
alternative label: médaille de jubilé
created: 2012-05-16T00:00:00+02:00
definition: Objet que l'on porte au cou ou épinglé sur les vêtements ou encore que l'on suspend à un meuble en témoignage de sa foi. La médaille de dévotion peut comporter des représentations religieuses et des inscriptions (médaille-scapulaire, médaille miraculeuse, médaille de pèlerinage, médaille de jubilé, médaille pontificale, etc.), ou encore se rapporter à un événement personnel à caractère religieux (médaille de baptême, médaille de communion, etc.).
status: 1

bouteille à eau bénite
type: Concept
modified: 2014-11-26T14:46:02+01:00
in scheme: Thésaurus de la désignation des objets mobiliers
preferred label: bottles for holy water @en-us
preferred label: bottiglia per l'acqua benedetta @it
preferred label: garrafa de água benta @pt
broader: objet de dévotion
alternative label: bouteille à eau de Pâques
created: 2012-05-16T00:00:00+02:00
definition: Bouteille servant de réserve à eau bénite pour un usage domestique. Lorsqu'il s'agit d'une simple bouteille remplie d'eau de source, le matin de Pâques à l'aube, en signe de renouveau, on l'appelle bouteille à eau de Pâques. Elle peut être décorée d'une croix.
status: 1

buis bénit
type: SimpleNonPreferredTerm
modified: 2015-10-28T15:24:23+01:00
created: 2014-01-15T14:54:24+01:00
status: 1

chemin de croix
type: Concept
modified: 2014-11-26T15:13:17+01:00
in scheme: Thésaurus de la désignation des objets mobiliers
preferred label: via crucis
preferred label: ways of the cross @en-us
preferred label: via sacra @pt
broader: objet de dévotion
alternative label: station de chemin de croix
alternative label: chemin de la croix
created: 2012-05-16T00:00:00+02:00
definition: Ensemble de tableaux, de reliefs ou de croix, comportant généralement 14 stations, présenté dans une église et illustrant les scènes du chemin parcouru par le Christ vers le Calvaire.
status: 1

rameau bénit
type: SimpleNonPreferredTerm
modified: 2015-10-28T15:24:23+01:00
created: 2014-01-15T14:54:24+01:00
status: 1

grain de chapelet
type: Concept
modified: 2014-11-26T16:11:42+01:00
in scheme: Thésaurus de la désignation des objets mobiliers
preferred label: prayer nuts @en-us
preferred label: grano devozionale @it
preferred label: conta de rezar @pt
broader: objet de dévotion
created: 2012-05-16T00:00:00+02:00
definition: Objet de dévotion sphérique, ouvrant, ayant la forme d'un gros grain de rosaire, généralement en ivoire ou en bois, décoré à l'extérieur et contenant à l'intérieur une scène religieuse, souvent le Calvaire.
status: 1

bouteille-calvaire
type: Concept
modified: 2014-11-26T14:48:30+01:00
in scheme: Thésaurus de la désignation des objets mobiliers
preferred label: bottles with enclosed Calvary @en-us
preferred label: bottiglia del Calvario @it
preferred label: garrafa-calvário @pt
broader: objet de dévotion
alternative label: bouteille de la Passion
alternative label: croix de marinier
created: 2012-05-16T00:00:00+02:00
definition: Bouteille en verre qui contient une représentation du Christ en croix, du Calvaire ou des instruments de la Passion.
status: 1

couronne votive
type: Concept
modified: 2014-11-26T15:22:37+01:00
in scheme: Thésaurus de la désignation des objets mobiliers
preferred label: votive crowns @en-us
preferred label: corona votiva @it
preferred label: coroa votiva @pt
broader: objet de dévotion
alternative label: couronne-reliquaire
alternative label: couronne ex-voto
alternative label: couronne suspendue
created: 2012-05-16T00:00:00+02:00
related: ex-voto
definition: Couronne offerte à une église, souvent par un souverain ou un pape, parfois comme ex-voto ou comme reliquaire. Elle est soit posée sur un autel, soit accrochée au-dessus. Dans ce cas, elle peut comporter une croix suspendue.
TermeAssocie: ex-voto
status: 1

meuble d'exposition
type: SimpleNonPreferredTerm
modified: 2014-10-13T10:16:05+02:00
created: 2014-01-15T14:54:24+01:00
status: 1

cabinet
type: Concept
modified: 2014-12-04T15:57:55+01:00
in scheme: Thésaurus de la désignation des objets mobiliers
preferred label: cabinets (case furniture) @en-us
broader: meuble de rangement et d'exposition
alternative label: porte-cabinet
created: 2012-05-16T00:00:00+02:00
definition: Meuble de rangement pour divers objets précieux, formé de nombreux tiroirs superposés et souvent aussi juxtaposés, accompagnés éventuellement d'un petit battant central dit tabernacle (théâtre), qui cache parfois des tiroirs superposés.
status: 1

rangement lié à l'alimentation
type: Concept
modified: 2014-09-11T15:29:13+02:00
in scheme: Thésaurus de la désignation des objets mobiliers
preferred label: culinary containers @en-us
narrower: porte-viandes
broader: meuble de rangement et d'exposition
alternative label: séchoir à champignons
alternative label: casier à bouteilles
created: 2012-07-19T00:00:00+02:00
definition: Meuble, en général casier ou support, destiné à entreposer des aliments ou des boissons.
status: 1

panier
type: Concept
modified: 2014-12-04T17:02:51+01:00
in scheme: Thésaurus de la désignation des objets mobiliers
broader: meuble de rangement et d'exposition
alternative label: panier-réserve
alternative label: panier-réserve à grains
alternative label: bannette
created: 2012-05-16T00:00:00+02:00
definition: Réceptacle fait d’une matière plus ou moins rigide (vannerie, matière plastique, métal) muni d’une anse ou de poignées servant à contenir ou transporter des marchandises, des aliments, animaux, etc.
status: 1

égouttoir
type: Concept
modified: 2014-12-04T16:39:35+01:00
in scheme: Thésaurus de la désignation des objets mobiliers
preferred label: dish racks @en-us
broader: meuble de rangement et d'exposition
created: 2012-05-16T00:00:00+02:00
definition: Meuble servant à entreposer un objet lavé et non essuyé : vaisselle, verres, couverts, etc. L'égouttoir peut être au sol, suspendu, mural ou à poser sur un évier.
status: 1
broad match: cb13562642r
broad match: http://vocab.getty.edu/aat/300079641

meuble-présentoir
type: SimpleNonPreferredTerm
modified: 2014-10-13T10:16:05+02:00
created: 2014-01-15T14:54:24+01:00
status: 1

commode
type: Concept
modified: 2014-12-04T16:33:41+01:00
in scheme: Thésaurus de la désignation des objets mobiliers
preferred label: chests of drawers @en-us
narrower: T69-2977
broader: meuble de rangement et d'exposition
created: 2012-05-16T00:00:00+02:00
definition: Meuble de rangement constitué d'un corps fermé portant au sol, comportant en général de 2 à 5 tiroirs le plus souvent de largeur.
status: 1

meuble de rangement et d'exposition
type: PreferredTerm
modified: 2014-10-13T10:16:05+02:00
created: 2014-01-15T14:54:24+01:00
status: 1

claie
type: Concept
modified: 2014-12-04T16:02:27+01:00
in scheme: Thésaurus de la désignation des objets mobiliers
preferred label: racks (supporting devices) @en-us
narrower: claie garde-manger
broader: meuble de rangement et d'exposition
alternative label: claie à fruits
alternative label: volette
created: 2012-05-16T00:00:00+02:00
definition: Ensemble d'éléments entrecroisés constituant un plan ajouré que l'on suspend ou pose sur des supports.
status: 1
broad match: cb13562642r

corbeille
type: Concept
modified: 2014-12-04T16:37:08+01:00
in scheme: Thésaurus de la désignation des objets mobiliers
preferred label: baskets (containers) @en-us
narrower: T69-2981
broader: meuble de rangement et d'exposition
created: 2012-05-16T00:00:00+02:00
definition: Récipient sans couvercle, parfois en forme de panier, qui peut recevoir linge et objets divers. Il est en bois, céramique, métal, osier ou paille tressée.
status: 1

vitrine
type: Concept
modified: 2014-12-05T10:40:56+01:00
in scheme: Thésaurus de la désignation des objets mobiliers
preferred label: vitrines (cabinets) @en-us
broader: meuble de rangement et d'exposition
alternative label: armoire vitrée
alternative label: table-vitrine
created: 2012-07-18T00:00:00+02:00
definition: Meuble largement vitré servant à exposer divers objets.
status: 1

table-lavabo
type: Concept
modified: 2014-12-04T12:32:25+01:00
in scheme: Thésaurus de la désignation des objets mobiliers
broader: lavabo domestique
created: 2012-05-16T00:00:00+02:00
related: plat à barbe
related: cuvette à laver
definition: Table comportant en son centre une cavité dans laquelle s'introduit une cuvette, éventuellement à écoulement servant à se laver. Elle est parfois accompagnée d'un porte-linge de toilette latéral et surmontée d'un miroir et de tablettes.
TermeAssocie: plat à barbe
TermeAssocie: cuvette à laver
status: 1

table-lavabo
type: PreferredTerm
modified: 2014-12-04T12:32:25+01:00
created: 2014-01-15T14:54:24+01:00
status: 1

sphère armillaire
type: Concept
modified: 2014-12-15T16:23:45+01:00
in scheme: Thésaurus de la désignation des objets mobiliers
preferred label: armillary spheres @en-us
broader: objet de représentation de corps célestes
created: 2012-05-16T00:00:00+02:00
definition: Globe formé d'anneaux ou de cercles représentant le ciel et les astres dans le système héliocentrique.
status: 1

sphère armillaire
type: PreferredTerm
modified: 2014-12-15T16:23:45+01:00
created: 2014-01-15T14:54:24+01:00
status: 1

couronne-reliquaire
type: SimpleNonPreferredTerm
modified: 2014-11-26T15:22:37+01:00
created: 2014-01-15T14:54:24+01:00
status: 1

couronne ex-voto
type: SimpleNonPreferredTerm
modified: 2014-11-26T15:22:37+01:00
created: 2014-01-15T14:54:24+01:00
status: 1

couronne votive
type: PreferredTerm
modified: 2014-11-26T15:22:37+01:00
created: 2014-01-15T14:54:24+01:00
status: 1

couronne suspendue
type: SimpleNonPreferredTerm
modified: 2014-11-26T15:22:37+01:00
created: 2014-01-15T14:54:24+01:00
status: 1

machine à découper par molette
type: Concept
modified: 2015-10-14T10:52:32+02:00
in scheme: Thésaurus de la désignation des objets mobiliers
broader: machine à découper
alternative label: cisaille à galets
created: 2012-05-16T00:00:00+02:00
definition: Machine à découper un produit à l'aide d'une molette.
status: 1
broad match: http://vocab.getty.edu/aat/300162791

machine à découper par molette
type: PreferredTerm
modified: 2015-10-14T10:52:32+02:00
created: 2014-01-15T14:54:24+01:00
status: 1

cisaille à galets
type: SimpleNonPreferredTerm
modified: 2015-10-14T10:52:32+02:00
created: 2014-01-15T14:54:24+01:00
status: 1

boîte à bessamin
type: SimpleNonPreferredTerm
modified: 2014-01-10T00:00:00+01:00
created: 2014-01-15T14:54:24+01:00
status: 1

boîte à aromates
type: PreferredTerm
modified: 2014-01-10T00:00:00+01:00
created: 2014-01-15T14:54:24+01:00
status: 1

boîte à haddassim
type: SimpleNonPreferredTerm
modified: 2014-01-10T00:00:00+01:00
created: 2014-01-15T14:54:24+01:00
status: 1

boîte à épices
type: Concept
modified: 2014-12-08T16:31:27+01:00
in scheme: Thésaurus de la désignation des objets mobiliers
preferred label: spice boxes @en-us
broader: récipient pour le service ou la consommation des aliments
alternative label: pot à épices
alternative label: plat à épices
alternative label: porte-épices
created: 2012-05-16T00:00:00+02:00
related: surtout de table
definition: Récipient en céramique, métal ou bois, à plus de deux compartiments juxtaposés ou superposés contenant les épices. La boîte à épices est circulaire, rectangulaire ou tréflée, à fond plat, avec ou sans petits pieds et munie d’un couvercle.
TermeAssocie: surtout de table
status: 1

plat à épices
type: SimpleNonPreferredTerm
modified: 2014-12-08T16:31:27+01:00
created: 2014-01-15T14:54:24+01:00
status: 1

boîte à épices
type: PreferredTerm
modified: 2014-12-08T16:31:27+01:00
created: 2014-01-15T14:54:24+01:00
status: 1

pot à épices
type: SimpleNonPreferredTerm
modified: 2014-12-08T16:31:27+01:00
created: 2014-01-15T14:54:24+01:00
status: 1

porte-épices
type: SimpleNonPreferredTerm
modified: 2014-12-08T16:31:27+01:00
created: 2014-01-15T14:54:24+01:00
status: 1

baratte-malaxeur
type: SimpleNonPreferredTerm
modified: 2015-10-15T16:17:28+02:00
created: 2014-01-15T14:54:24+01:00
status: 1

machine à émulsionner
type: PreferredTerm
modified: 2015-10-15T16:17:28+02:00
created: 2014-01-15T14:54:24+01:00
status: 1

baratte continue
type: SimpleNonPreferredTerm
modified: 2015-10-15T16:17:28+02:00
created: 2014-01-15T14:54:24+01:00
status: 1

baratte industrielle
type: SimpleNonPreferredTerm
modified: 2015-10-15T16:17:28+02:00
created: 2014-01-15T14:54:24+01:00
status: 1

onduleur
type: Concept
modified: 2015-10-07T14:19:27+02:00
in scheme: Thésaurus de la désignation des objets mobiliers
broader: convertisseur électrique
created: 2012-05-16T00:00:00+02:00
scope note: Ne pas confondre avec l’équipement qui permet d’obtenir une alimentation électrique stable et dépourvue de coupure, notamment pour les ordinateurs.
definition: Convertisseur électrique transformant un courant unidirectionnel en un système de courants alternatifs (fonction inverse d'un redresseur=.
status: 1

convertisseur électrique
type: PreferredTerm
modified: 2015-08-03T16:07:23+02:00
created: 2014-01-15T14:54:24+01:00
status: 1

redresseur
type: Concept
modified: 2015-08-03T16:31:49+02:00
in scheme: Thésaurus de la désignation des objets mobiliers
broader: convertisseur électrique
created: 2012-05-16T00:00:00+02:00
definition: Convertisseur électrique transformant un système de courants alternatifs en un courant unidirectionnel (fonction inverse d'un onduleur).
status: 1

transformateur
type: Concept
modified: 2015-08-04T11:44:28+02:00
in scheme: Thésaurus de la désignation des objets mobiliers
broader: convertisseur électrique
alternative label: rhéostat
created: 2012-05-16T00:00:00+02:00
definition: Convertisseur électrique servant à élever ou à abaisser la tension ou l’intensité d’un courant.
status: 1

guitare-lyre
type: PreferredTerm
modified: 2014-10-10T12:52:26+02:00
created: 2014-01-15T14:54:24+01:00
status: 1

lyre guitare
type: SimpleNonPreferredTerm
modified: 2014-10-10T12:52:26+02:00
created: 2014-01-15T14:54:24+01:00
status: 1

glace de trumeau
type: Concept
modified: 2014-12-04T11:00:34+01:00
in scheme: Thésaurus de la désignation des objets mobiliers
preferred label: overmantel mirrors @en-us
broader: glace
created: 2012-05-16T00:00:00+02:00
related: trumeau de cheminée
definition: Panneau d'applique de dimensions importantes, constitué d'un ou plusieurs éléments de glace encadrés et fixés au mur ou dans une boiserie. Il est placé entre deux ouvertures ou sur une cheminée et parfois peint dans sa partie supérieure.
TermeAssocie: trumeau de cheminée
status: 1
broad match: http://data.bnf.fr/ark:/12148/cb159721071

trumeau de cheminée
type: PreferredTerm
modified: 2015-01-07T15:58:34+01:00
created: 2014-01-15T14:54:24+01:00
status: 1

cheminée de glace
type: SimpleNonPreferredTerm
modified: 2015-01-07T15:58:34+01:00
created: 2014-01-15T14:54:24+01:00
status: 1

dais de procession
type: PreferredTerm
modified: 2014-12-02T10:14:53+01:00
created: 2014-01-15T14:54:24+01:00
status: 1

pot à jus
type: SimpleNonPreferredTerm
modified: 2014-12-08T16:58:21+01:00
created: 2014-01-15T14:54:24+01:00
status: 1

pot à crème
type: PreferredTerm
modified: 2014-12-08T16:58:21+01:00
created: 2014-01-15T14:54:24+01:00
status: 1

présentoir à documents
type: Concept
modified: 2014-09-11T16:45:06+02:00
in scheme: Thésaurus de la désignation des objets mobiliers
preferred label: portfolio stands @en-us
broader: support pour le bureau ou les loisirs
alternative label: pied présentoir à documents
alternative label: chaise présentoir à documents
alternative label: chevalet porte-documents
created: 2012-05-16T00:00:00+02:00
definition: Meuble permettant de consulter aisément des documents de types divers. Il se présente sous forme de chevalet, de chaise ou de pied.
status: 1
broad match: cb13162762z

porte-fusils
type: Concept
modified: 2014-12-05T10:33:00+01:00
in scheme: Thésaurus de la désignation des objets mobiliers
preferred label: gun racks @en-us
broader: support pour le bureau ou les loisirs
created: 2012-05-16T00:00:00+02:00
definition: Meuble d'applique, au sol ou suspendu, comportant des éléments pour un rangement horizontal ou vertical des fusils.
status: 1

support pour le bureau ou les loisirs
type: PreferredTerm
modified: 2014-09-11T16:00:27+02:00
created: 2014-01-15T14:54:24+01:00
status: 1

piédestal
type: Concept
modified: 2014-12-05T10:31:16+01:00
in scheme: Thésaurus de la désignation des objets mobiliers
preferred label: pedestals @en-us
broader: support pour le bureau ou les loisirs
created: 2012-05-16T00:00:00+02:00
related: socle d'oeuvre décorative
definition: Support au sol horizontal élevé à niveau d'appui ou plus, de plan massé, servant à présenter un objet : statue, vase, pendule, etc.
TermeAssocie: socle d'oeuvre décorative
status: 1

porte-papiers
type: Concept
modified: 2014-09-11T16:41:08+02:00
in scheme: Thésaurus de la désignation des objets mobiliers
preferred label: wall pockets @en-us
broader: support pour le bureau ou les loisirs
created: 2012-05-16T00:00:00+02:00
related: T69-4605
definition: Petit panneau d'applique comportant des traverses inclinées vers l'avant formant ainsi des cases pour recevoir les papiers. Le porte-papiers peut présenter sept cases correspondant aux jours de la semaine.
TermeAssocie: T69-4605
status: 1
broad match: cb13162762z

porte-cannes de billard
type: Concept
modified: 2014-12-05T10:32:03+01:00
in scheme: Thésaurus de la désignation des objets mobiliers
broader: support pour le bureau ou les loisirs
created: 2012-05-16T00:00:00+02:00
definition: Support d’applique en forme de barre ou de panneau suspendu ou support de milieu circulaire, servant à ranger les cannes de billard verticalement.
status: 1

dessus de lit
type: SimpleNonPreferredTerm
modified: 2014-12-12T12:25:18+01:00
created: 2014-01-15T14:54:24+01:00
status: 1

couvre-lit
type: SimpleNonPreferredTerm
modified: 2014-12-12T12:25:18+01:00
created: 2014-01-15T14:54:24+01:00
status: 1

courtine de lit
type: SimpleNonPreferredTerm
modified: 2014-12-12T12:25:18+01:00
created: 2014-01-15T14:54:24+01:00
status: 1

ciel de lit
type: SimpleNonPreferredTerm
modified: 2014-12-12T12:25:18+01:00
created: 2014-01-15T14:54:24+01:00
status: 1

garniture de lit
type: PreferredTerm
modified: 2014-12-12T12:25:18+01:00
created: 2014-01-15T14:54:24+01:00
status: 1

locomotive à vapeur
type: PreferredTerm
modified: 2014-12-18T10:09:52+01:00
created: 2014-01-15T14:54:24+01:00
status: 1

pot à conserves
type: Concept
modified: 2014-12-08T11:53:13+01:00
in scheme: Thésaurus de la désignation des objets mobiliers
preferred label: preserve pots @en-us
broader: récipient pour la conservation des aliments ou des boissons
alternative label: pot à confit
alternative label: pot à beurre fondu
alternative label: pot à sel
alternative label: pot à saindoux
alternative label: pot à farine
alternative label: pot à confitures
alternative label: boîte de ménage
alternative label: pot à graisse
alternative label: pot à moutarde
alternative label: pot à rillettes
alternative label: bocal à truffes
alternative label: verrine à confitures
alternative label: pot à miel
alternative label: bocal
alternative label: pot à conserver les œufs
created: 2012-05-16T00:00:00+02:00
related: boîte à thé ou à café
definition: Récipient circulaire pour conserver des aliments. Il est à fond plat, à parois rectilignes ou légèrement galbées, à large ouverture supérieure bordée d'un bourrelet ou d'une gorge pour y passer le lien maintenant le couvercle. Il peut être muni d'anses latérales ou de deux boutons plats verticaux pour y passer les liens du couvercle.
TermeAssocie: boîte à thé ou à café
status: 1

pot à graisse
type: SimpleNonPreferredTerm
modified: 2014-12-08T11:53:13+01:00
created: 2014-01-15T14:54:24+01:00
status: 1

bocal à truffes
type: SimpleNonPreferredTerm
modified: 2014-12-08T11:53:13+01:00
created: 2014-01-15T14:54:24+01:00
status: 1

boîte de ménage
type: SimpleNonPreferredTerm
modified: 2014-12-08T11:53:13+01:00
created: 2014-01-15T14:54:24+01:00
status: 1

bocal
type: SimpleNonPreferredTerm
modified: 2014-12-08T11:53:13+01:00
created: 2014-01-15T14:54:24+01:00
status: 1

pot à conserves
type: PreferredTerm
modified: 2014-12-08T11:53:13+01:00
created: 2014-01-15T14:54:24+01:00
status: 1

pot à confitures
type: SimpleNonPreferredTerm
modified: 2014-12-08T11:53:13+01:00
created: 2014-01-15T14:54:24+01:00
status: 1

verrine à confitures
type: SimpleNonPreferredTerm
modified: 2014-12-08T11:53:13+01:00
created: 2014-01-15T14:54:24+01:00
status: 1

pot à conserver les œufs
type: SimpleNonPreferredTerm
modified: 2014-12-08T11:53:13+01:00
created: 2014-01-15T14:54:24+01:00
status: 1

pot à confit
type: SimpleNonPreferredTerm
modified: 2014-12-08T11:53:13+01:00
created: 2014-01-15T14:54:24+01:00
status: 1

pot à moutarde
type: SimpleNonPreferredTerm
modified: 2014-12-08T11:53:13+01:00
created: 2014-01-15T14:54:24+01:00
status: 1

pot à sel
type: SimpleNonPreferredTerm
modified: 2014-12-08T11:53:13+01:00
created: 2014-01-15T14:54:24+01:00
status: 1

boîte à thé ou à café
type: Concept
modified: 2014-12-08T16:32:30+01:00
in scheme: Thésaurus de la désignation des objets mobiliers
broader: récipient pour le service ou la consommation des aliments
alternative label: bouteille à thé
alternative label: boîte à thé
alternative label: boîte à café
created: 2012-05-16T00:00:00+02:00
scope note: Ne pas confondre la boîte à thé ou à café, objet précieux qui fait partie d'un service ou d'un nécessaire de voyage, avec la boîte de ménage qui est un pot à conserves.
related: cuiller
related: pot à conserves
definition: Petit récipient en métal ou en céramique servant à conserver les feuilles de thé ou la poudre de café. Elle se présente sous forme de boîte à couvercle ou de bouteille trapue à large goulot court fermé par un bouchon vissé.
TermeAssocie: cuiller
TermeAssocie: pot à conserves
status: 1

pot à beurre fondu
type: SimpleNonPreferredTerm
modified: 2014-12-08T11:53:13+01:00
created: 2014-01-15T14:54:24+01:00
status: 1

pot à miel
type: SimpleNonPreferredTerm
modified: 2014-12-08T11:53:13+01:00
created: 2014-01-15T14:54:24+01:00
status: 1

pot à saindoux
type: SimpleNonPreferredTerm
modified: 2014-12-08T11:53:13+01:00
created: 2014-01-15T14:54:24+01:00
status: 1

pot à farine
type: SimpleNonPreferredTerm
modified: 2014-12-08T11:53:13+01:00
created: 2014-01-15T14:54:24+01:00
status: 1

pot à rillettes
type: SimpleNonPreferredTerm
modified: 2014-12-08T11:53:13+01:00
created: 2014-01-15T14:54:24+01:00
status: 1

huisserie
type: SimpleNonPreferredTerm
modified: 2014-10-15T13:13:44+02:00
created: 2014-01-15T14:54:24+01:00
status: 1

dormant
type: PreferredTerm
modified: 2014-10-15T13:13:44+02:00
created: 2014-01-15T14:54:24+01:00
status: 1

voiture utilitaire à énergie animale
type: Concept
modified: 2014-12-30T11:40:24+01:00
in scheme: Thésaurus de la désignation des objets mobiliers
broader: véhicule à énergie animale
alternative label: charrette
alternative label: limousine hippomobile
alternative label: fourgon hippomobile
alternative label: chariot
alternative label: tombereau
alternative label: char
alternative label: malle-poste
created: 2013-11-05T00:00:00+01:00
definition: Véhicule terrestre à énergie animale destiné au transport des marchandises et des denrées.
status: 1
broad match: http://data.bnf.fr/ark:/12148/cb119364001
broad match: http://vocab.getty.edu/aat/300227856
broad match: Traction animale

charrette
type: SimpleNonPreferredTerm
modified: 2014-12-30T11:40:24+01:00
created: 2014-01-15T14:54:24+01:00
status: 1

malle-poste
type: SimpleNonPreferredTerm
modified: 2014-12-30T11:40:24+01:00
created: 2014-01-15T14:54:24+01:00
status: 1

limousine hippomobile
type: SimpleNonPreferredTerm
modified: 2014-12-30T11:40:24+01:00
created: 2014-01-15T14:54:24+01:00
status: 1

fourgon hippomobile
type: SimpleNonPreferredTerm
modified: 2014-12-30T11:40:24+01:00
created: 2014-01-15T14:54:24+01:00
status: 1

char
type: SimpleNonPreferredTerm
modified: 2014-12-30T11:40:24+01:00
created: 2014-01-15T14:54:24+01:00
status: 1

tombereau
type: SimpleNonPreferredTerm
modified: 2014-12-30T11:40:24+01:00
created: 2014-01-15T14:54:24+01:00
status: 1

voiture utilitaire à énergie animale
type: PreferredTerm
modified: 2014-12-30T11:40:24+01:00
created: 2014-01-15T14:54:24+01:00
status: 1

chariot
type: SimpleNonPreferredTerm
modified: 2014-12-30T11:40:24+01:00
created: 2014-01-15T14:54:24+01:00
status: 1

pendant d'oreille
type: SimpleNonPreferredTerm
modified: 2014-12-30T12:31:29+01:00
created: 2014-01-15T14:54:24+01:00
status: 1

globe de mariage
type: Concept
modified: 2014-12-05T11:11:04+01:00
in scheme: Thésaurus de la désignation des objets mobiliers
broader: meuble lié aux coutumes et cultes domestiques
alternative label: couronne de mariée
alternative label: coussin de mariage
alternative label: bouquet de mariée
alternative label: boîte à bouquet de mariée
alternative label: boîte à couronne de mariée
created: 2012-05-16T00:00:00+02:00
related: bijou
related: bouquet
definition: Globe en verre sous lequel on place, afin de les conserver, un ou des souvenirs liés au mariage. Il peut s'agir d'un bouquet ou de la couronne de mariée qui peut être présentée posée ou non sur un coussin et associée ou non au bouquet de mariée.
TermeAssocie: bijou
TermeAssocie: bouquet
status: 1

boucle d'oreille
type: SimpleNonPreferredTerm
modified: 2014-12-30T12:31:29+01:00
created: 2014-01-15T14:54:24+01:00
status: 1

broche
type: SimpleNonPreferredTerm
modified: 2014-12-30T12:31:29+01:00
created: 2014-01-15T14:54:24+01:00
status: 1

collier
type: Concept
modified: 2014-12-30T12:30:30+01:00
in scheme: Thésaurus de la désignation des objets mobiliers
preferred label: necklaces @en-us
broader: bijou
created: 2013-11-29T00:00:00+01:00
definition: Bijou qui se porte autour du cou.
status: 1

bracelet
type: SimpleNonPreferredTerm
modified: 2014-12-30T12:31:29+01:00
created: 2014-01-15T14:54:24+01:00
status: 1

bijou de parure
type: SimpleNonPreferredTerm
modified: 2014-12-30T12:31:29+01:00
created: 2014-01-15T14:54:24+01:00
status: 1

pendentif
type: SimpleNonPreferredTerm
modified: 2014-12-30T12:31:29+01:00
created: 2014-01-15T14:54:24+01:00
status: 1

bijou
type: PreferredTerm
modified: 2014-12-30T12:31:29+01:00
created: 2014-01-15T14:54:24+01:00
status: 1

breloque
type: SimpleNonPreferredTerm
modified: 2014-12-30T12:31:29+01:00
created: 2014-01-15T14:54:24+01:00
status: 1

chalumeau
type: PreferredTerm
modified: 2014-10-10T11:44:58+02:00
created: 2014-01-15T14:54:24+01:00
status: 1

instrument de mesure des masses
type: PreferredTerm
modified: 2014-12-15T15:15:03+01:00
created: 2014-01-15T14:54:24+01:00
status: 1

machine à trépaner
type: Concept
modified: 2015-10-08T17:20:00+02:00
in scheme: Thésaurus de la désignation des objets mobiliers
narrower: machine à carotter
broader: machine à creuser
alternative label: foreuse rotative
created: 2012-05-16T00:00:00+02:00
definition: Machine à creuser un trou circulaire à l'aide d'un trépan travaillant en percussion ou en rotation.
status: 1

machine à trépaner
type: PreferredTerm
modified: 2015-10-08T17:20:00+02:00
created: 2014-01-15T14:54:24+01:00
status: 1

machine à carotter
type: Concept
modified: 2015-10-09T11:11:49+02:00
in scheme: Thésaurus de la désignation des objets mobiliers
broader: machine à trépaner
created: 2012-05-16T00:00:00+02:00
definition: Machine à trépaner servant à prélever un échantillon cylindrique de matière.
status: 1

foreuse rotative
type: SimpleNonPreferredTerm
modified: 2015-10-08T17:20:00+02:00
created: 2014-01-15T14:54:24+01:00
status: 1

objet lié à la fête des lumières
type: SimpleNonPreferredTerm
modified: 2014-01-10T00:00:00+01:00
created: 2014-01-15T14:54:24+01:00
status: 1

chandelier de Hanouca
type: Concept
modified: 2014-01-10T00:00:00+01:00
in scheme: Thésaurus de la désignation des objets mobiliers
broader: objet lié à la fête de Hanouca
alternative label: chandelier de la Reconsécration
alternative label: chandelier de Hanoukkah
created: 2012-05-16T00:00:00+02:00
scope note: Ce chandelier apparaît tardivement et n'est pas obligatoire. La fête de Hanouca dite de Reconsécration ou d'Inauguration se situe au mois de décembre et dure huit jours. Elle commémore la victoire des Israélites sur les troupes syriennes d'Antiochus Epiphane et la réinauguration du temple de Jérusalem sanctifiée par un miracle où la quantité d'huile limitée à un jour dura huit jours, le temps de fabriquer de l'huile nouvelle.
definition: Chandelier à huit ou à neuf branches utilisé pour la fête de Hanouca dont on allume une bougie supplémentaire chaque jour pendant les huit jours de la fête. Il comporte souvent huit branches latérales et une branche centrale, dite serviteur (ou shammash), perpendiculaire aux huit autres et qui sert à allumer les bougies. Il commémore le miracle de l'huile.
status: 1

toupie de Hanouca
type: Concept
modified: 2014-01-10T00:00:00+01:00
in scheme: Thésaurus de la désignation des objets mobiliers
broader: objet lié à la fête de Hanouca
alternative label: dreidel
alternative label: toupie de la reconsécration
alternative label: toupie de Hanoukkah
created: 2012-05-16T00:00:00+02:00
definition: Jouet consistant en une toupie en forme de dé à quatre faces sur lesquelles sont inscrites quatre lettres hébraïques (N., G., H., Sh., initiales des mots : nes gadol haya sham : un grand miracle s'est accompli ici) et une étoile de David ; on faisait usage de la sevivon (hébreu) ou des dreidlach (sing. dreidel, en yiddish) lors de cette fête.
status: 1

objet lié à la fête de l'Inauguration
type: SimpleNonPreferredTerm
modified: 2014-01-10T00:00:00+01:00
created: 2014-01-15T14:54:24+01:00
status: 1

objet lié à Hanoukkah
type: SimpleNonPreferredTerm
modified: 2014-01-10T00:00:00+01:00
created: 2014-01-15T14:54:24+01:00
status: 1

lampe de Hanouca
type: Concept
modified: 2014-01-10T00:00:00+01:00
in scheme: Thésaurus de la désignation des objets mobiliers
broader: objet lié à la fête de Hanouca
alternative label: lampe de reconsécration
alternative label: lampe de Hanoukkah
created: 2012-05-16T00:00:00+02:00
scope note: Les lampes de Hanouca commémorent le miracle de l'huile.
definition: Lampe composée de huit petits récipients ou godets contenant de l'huile que l'on allume l'un après l'autre, chaque jour, pendant huit jours. Pour avoir été longtemps placées sur les façades des maisons, les lampes de Hanouca ont souvent adopté une forme architecturale.
status: 1

objet lié à la fête de la Reconsécration
type: SimpleNonPreferredTerm
modified: 2014-01-10T00:00:00+01:00
created: 2014-01-15T14:54:24+01:00
status: 1

objet lié à la fête de Hanouca
type: PreferredTerm
modified: 2014-01-10T00:00:00+01:00
created: 2014-01-15T14:54:24+01:00
status: 1

tenture funéraire
type: PreferredTerm
modified: 2014-12-03T10:52:49+01:00
created: 2014-01-15T14:54:24+01:00
status: 1

portière funéraire
type: SimpleNonPreferredTerm
modified: 2014-12-03T10:52:49+01:00
created: 2014-01-15T14:54:24+01:00
status: 1

tableau-reliquaire
type: Concept
modified: 2014-11-26T17:50:30+01:00
in scheme: Thésaurus de la désignation des objets mobiliers
preferred label: framed reliquaries @en-us
preferred label: reliquiario a tabella @it
preferred label: quadro-relicário @pt
broader: reliquaire
created: 2012-05-16T00:00:00+02:00
definition: Reliquaire en forme de tableau encadré, généralement suspendu et souvent décoré de papiers roulés souvent dorés.
status: 1
broad match: http://data.bnf.fr/ark:/12148/cb119327497
broad match: http://vocab.getty.edu/aat/300187549

tableau-reliquaire
type: PreferredTerm
modified: 2014-11-26T17:50:30+01:00
created: 2014-01-15T14:54:24+01:00
status: 1

cuit-œufs
type: SimpleNonPreferredTerm
modified: 2015-03-09T10:49:11+01:00
created: 2014-01-15T14:54:24+01:00
status: 1

chauffe-œufs
type: SimpleNonPreferredTerm
modified: 2015-03-09T10:49:11+01:00
created: 2014-01-15T14:54:24+01:00
status: 1

pocheur à œuf
type: SimpleNonPreferredTerm
modified: 2015-03-09T10:49:11+01:00
created: 2014-01-15T14:54:24+01:00
status: 1

xylophone
type: Concept
modified: 2014-10-10T13:39:24+02:00
in scheme: Thésaurus de la désignation des objets mobiliers
preferred label: xylophones @en-us
broader: idiophone à émission par percussion directe
alternative label: lithophone
alternative label: métallophone
alternative label: balafon
alternative label: vibraphone
created: 2012-05-16T00:00:00+02:00
related: baguette
definition: Instrument constitué d'un ensemble de lattes de bois (parfois de pierre ou de métal) de taille croissante frappées avec une petite masse et comportant ou non un résonateur.
TermeAssocie: baguette
status: 1

métallophone
type: SimpleNonPreferredTerm
modified: 2014-10-10T13:39:24+02:00
created: 2014-01-15T14:54:24+01:00
status: 1

xylophone
type: PreferredTerm
modified: 2014-10-10T13:39:24+02:00
created: 2014-01-15T14:54:24+01:00
status: 1

vibraphone
type: SimpleNonPreferredTerm
modified: 2014-10-10T13:39:24+02:00
created: 2014-01-15T14:54:24+01:00
status: 1

balafon
type: SimpleNonPreferredTerm
modified: 2014-10-10T13:39:24+02:00
created: 2014-01-15T14:54:24+01:00
status: 1

lithophone
type: SimpleNonPreferredTerm
modified: 2014-10-10T13:39:24+02:00
created: 2014-01-15T14:54:24+01:00
status: 1

machine à entraîner mécaniquement
type: Concept
modified: 2015-10-14T14:57:05+02:00
in scheme: Thésaurus de la désignation des objets mobiliers
narrower: machine à pomper
narrower: machine à pousser
narrower: machine à ventiler
broader: machine à entraîner
alternative label: machine à dérouler
created: 2012-05-16T00:00:00+02:00
definition: Machine à entraîner des matériaux ou des produits par application d'une force impulsionnelle ou continue.
status: 1

machine à entraîner
type: Concept
modified: 2015-10-14T14:54:05+02:00
in scheme: Thésaurus de la désignation des objets mobiliers
narrower: machine à entraîner mécaniquement
broader: machine à manutentionner
alternative label: machine à entraîner par fluide
created: 2012-05-16T00:00:00+02:00
definition: Machine à manutentionner un matériau ou un produit par leur mise en mouvement.
status: 1
broad match: cb13162718g

machine à entraîner mécaniquement
type: PreferredTerm
modified: 2015-10-14T14:57:05+02:00
created: 2014-01-15T14:54:24+01:00
status: 1

machine à pousser
type: Concept
modified: 2014-01-10T00:00:00+01:00
in scheme: Thésaurus de la désignation des objets mobiliers
broader: machine à entraîner mécaniquement
created: 2012-05-16T00:00:00+02:00
definition: Machine à entraîner mécaniquement des matériaux en vrac en exerçant une pression sur ces derniers.
status: 1

machine à dérouler
type: SimpleNonPreferredTerm
modified: 2015-10-14T14:57:05+02:00
created: 2014-01-15T14:54:24+01:00
status: 1

machine à ventiler
type: Concept
modified: 2015-10-14T15:07:30+02:00
in scheme: Thésaurus de la désignation des objets mobiliers
broader: machine à entraîner mécaniquement
alternative label: ventilateur centrifuge
alternative label: ventilateur industriel
alternative label: ventilateur hélicoïdal
created: 2012-05-16T00:00:00+02:00
definition: Machine à entraîner mécaniquement un gaz en le déplaçant sous une faible pression.
status: 1
narrow match: http://data.bnf.fr/ark:/12148/cb119810749

porte-montre
type: PreferredTerm
modified: 2014-10-16T14:47:48+02:00
created: 2014-01-15T14:54:24+01:00
status: 1

crochet de montres
type: SimpleNonPreferredTerm
modified: 2014-10-16T14:47:48+02:00
created: 2014-01-15T14:54:24+01:00
status: 1

puits
type: Concept
modified: 2015-02-24T15:51:00+01:00
in scheme: Thésaurus de la désignation des objets mobiliers
preferred label: wells @en-us
broader: ouvrage lié à l'alimentation en eau
created: 2012-05-16T00:00:00+02:00
scope note: Voir aussi le Thesaurus de la désignation des œuvres architecturales et des espaces aménagés.
definition: Forage vertical, creusé et généralement chemisé, pour atteindre la nappe aquifère souterraine, souvent accompagné, en surface, d'une margelle en forme de pierre percée ou d'une assise de pierres qui en marque l'orifice. Des superstructures de formes diverses permettent de remonter le seau, l’outre, etc.
status: 1

puits
type: PreferredTerm
modified: 2015-02-24T15:51:00+01:00
created: 2014-01-15T14:54:24+01:00
status: 1

caleçon de bain
type: SimpleNonPreferredTerm
modified: 2014-12-12T10:25:05+01:00
created: 2014-01-15T14:54:24+01:00
status: 1

vêtement spécifique de sportif
type: PreferredTerm
modified: 2014-12-12T10:25:05+01:00
created: 2014-01-15T14:54:24+01:00
status: 1

maillot de bain
type: SimpleNonPreferredTerm
modified: 2014-12-12T10:25:05+01:00
created: 2014-01-15T14:54:24+01:00
status: 1

tenue de sport
type: SimpleNonPreferredTerm
modified: 2014-12-12T10:25:05+01:00
created: 2014-01-15T14:54:24+01:00
status: 1

objet ou matériel d'indication du temps
type: Concept
modified: 2014-10-17T11:43:55+02:00
in scheme: Thésaurus de la désignation des objets mobiliers
narrower: horloge
narrower: calendrier
broader: objet civil domestique
created: 2013-10-25T00:00:00+02:00
related: instrument de mesure du temps
definition: Instrument de mesure du temps dont le mécanisme peut être abrité dans un meuble spécifique.
TermeAssocie: instrument de mesure du temps
status: 1

objet ou matériel d'indication du temps
type: PreferredTerm
modified: 2014-10-17T11:43:55+02:00
created: 2014-01-15T14:54:24+01:00
status: 1

calendrier
type: Concept
modified: 2014-12-10T14:03:31+01:00
in scheme: Thésaurus de la désignation des objets mobiliers
preferred label: calendars @en-us
broader: objet ou matériel d'indication du temps
created: 2012-05-16T00:00:00+02:00
definition: Tableau indiquant les divisions de l'année en saisons, mois, semaines et jours, donnant le plus souvent l'ordre des fêtes religieuses, annonçant certains phénomènes astronomiques comme les lunaisons, marées, éclipses, etc.
status: 1

égouttoir
type: PreferredTerm
modified: 2014-12-04T16:39:35+01:00
created: 2014-01-15T14:54:24+01:00
status: 1

aumônière
type: Concept
modified: 2014-12-10T18:02:08+01:00
in scheme: Thésaurus de la désignation des objets mobiliers
preferred label: aulmonieres @en-us
broader: sac
created: 2012-05-16T00:00:00+02:00
definition: Petit sac porté ou non à la ceinture, surtout par les femmes, contenant des objets d'utilité courante, ou destiné à recueillir de l'argent.
status: 1

sac
type: Concept
modified: 2014-12-10T18:00:43+01:00
in scheme: Thésaurus de la désignation des objets mobiliers
preferred label: bags (costume accessories) @en-us
narrower: aumônière
broader: accessoire de l'habillement
alternative label: sac à main
alternative label: carnassière
alternative label: sacoche
alternative label: réticule
alternative label: sac-pochette
alternative label: bourse-sac
alternative label: cartable
created: 2013-11-14T00:00:00+01:00
definition: Récipient fait d'une matière souple (cuir, textile, etc.) dont seule la partie supérieure est ouverte. Le sac remplit une fonction utilitaire (rangement d'objets variés) ainsi qu'esthétique.
status: 1

aumônière
type: PreferredTerm
modified: 2014-12-10T18:02:08+01:00
created: 2014-01-15T14:54:24+01:00
status: 1

objet pour l'entretien du linge
type: Concept
modified: 2014-10-17T14:14:37+02:00
in scheme: Thésaurus de la désignation des objets mobiliers
narrower: lessiveuse
narrower: T69-4406
narrower: T69-4382
narrower: T69-4400
narrower: T69-4386
narrower: T69-4388
narrower: T69-4384
narrower: T69-4380
narrower: T69-4378
narrower: T69-4376
broader: objet civil domestique
alternative label: rouleau à plisser
alternative label: plaque à plisser
alternative label: platille
alternative label: pince à lessive
alternative label: pince à linge
alternative label: pot à couler la lessive
alternative label: perche à étendre le linge
created: 2012-05-16T00:00:00+02:00
definition: Récipient ou instrument servant à laver, sécher ou repasser le linge.
status: 1

objet civil domestique
type: PreferredTerm
modified: 2014-10-16T12:05:13+02:00
created: 2014-01-15T14:54:24+01:00
status: 1

chrémeau de confirmation
type: Concept
modified: 2014-12-03T10:58:05+01:00
in scheme: Thésaurus de la désignation des objets mobiliers
preferred label: crismale della confermazione @it
preferred label: confirmation chrism cloths @en-us
preferred label: crismal da confirmação @pt
broader: chrémeau
alternative label: brassard de confirmation
alternative label: bandeau de confirmation
alternative label: brassard de communion
created: 2012-05-16T00:00:00+02:00
related: costume de communion
definition: Bandelette de lin, souvent ornée d'une croix, que le nouveau confirmé devait porter sur le front après l'onction du saint Chrême. Conservé par le nouveau confirmé, il est souvent remplacé par un brassard.
TermeAssocie: costume de communion
status: 1
broad match: cb11945759g

chrémeau
type: Concept
modified: 2014-12-03T10:55:57+01:00
in scheme: Thésaurus de la désignation des objets mobiliers
preferred label: chrismales (clothing) @en-us
preferred label: crismale @it
preferred label: crismal @pt
narrower: chrémeau de confirmation
narrower: chrémeau de baptême
broader: linge ou garniture liés aux sacrements autres que l'Eucharistie
alternative label: bandeau d'ordination de prêtre
alternative label: chrémeau d'ordination
alternative label: bandeau de sacre d'évêque
alternative label: chrémeau de sacre d'évêque
created: 2012-05-16T00:00:00+02:00
scope note: Ne pas confondre avec le chrémeau d'autel.
definition: Bande ou bandelette de linge blanc que l'on place sur la tête ou les mains après qu'elles ont reçu l'onction d'une des saintes huiles.
status: 1
broad match: http://data.bnf.fr/ark:/12148/cb119669330

brassard de confirmation
type: SimpleNonPreferredTerm
modified: 2014-12-03T10:58:05+01:00
created: 2014-01-15T14:54:24+01:00
status: 1

costume de communion
type: Concept
modified: 2014-10-22T12:21:50+02:00
in scheme: Thésaurus de la désignation des objets mobiliers
broader: autre vêtement catholique
alternative label: aube de communion
alternative label: robe de communion
created: 2012-07-13T00:00:00+02:00
related: chrémeau de confirmation
definition: Élément d’habillement de couleur blanche, parfois orné de dentelles, que revêt le communiant.
TermeAssocie: chrémeau de confirmation
status: 1

chrémeau de confirmation
type: PreferredTerm
modified: 2014-12-03T10:58:05+01:00
created: 2014-01-15T14:54:24+01:00
status: 1

bandeau de confirmation
type: SimpleNonPreferredTerm
modified: 2014-12-03T10:58:05+01:00
created: 2014-01-15T14:54:24+01:00
status: 1

brassard de communion
type: SimpleNonPreferredTerm
modified: 2014-12-03T10:58:05+01:00
created: 2014-01-15T14:54:24+01:00
status: 1

mobilier monumental ou de l'espace extérieur
type: PreferredTerm
modified: 2014-10-15T15:57:43+02:00
created: 2014-01-15T14:54:24+01:00
status: 1

ébourreuse
type: SimpleNonPreferredTerm
modified: 2014-01-10T00:00:00+01:00
created: 2014-01-15T14:54:24+01:00
status: 1

machine à dépiler
type: PreferredTerm
modified: 2014-01-10T00:00:00+01:00
created: 2014-01-15T14:54:24+01:00
status: 1

boîte à bouquet de mariée
type: SimpleNonPreferredTerm
modified: 2014-12-05T11:11:04+01:00
created: 2014-01-15T14:54:24+01:00
status: 1

boîte à couronne de mariée
type: SimpleNonPreferredTerm
modified: 2014-12-05T11:11:04+01:00
created: 2014-01-15T14:54:24+01:00
status: 1

coussin de mariage
type: SimpleNonPreferredTerm
modified: 2014-12-05T11:11:04+01:00
created: 2014-01-15T14:54:24+01:00
status: 1

bouquet
type: Concept
modified: 2014-12-05T15:06:41+01:00
in scheme: Thésaurus de la désignation des objets mobiliers
preferred label: bouquets @en-us
broader: objet décoratif ou de rangement ou pour les plantes et les fleurs
alternative label: bouquet sous globe
alternative label: globe à bouquet
alternative label: bouquet de communiante
alternative label: boîte à bouquet
created: 2012-05-16T00:00:00+02:00
related: ex-voto
related: globe de mariage
definition: Ensemble de fleurs artificielles placées dans un vase, un porte-bouquet, ou un socle et parfois protégé par un globe de verre.
TermeAssocie: ex-voto
TermeAssocie: globe de mariage
status: 1

globe de mariage
type: PreferredTerm
modified: 2014-12-05T11:11:04+01:00
created: 2014-01-15T14:54:24+01:00
status: 1

couronne de mariée
type: SimpleNonPreferredTerm
modified: 2014-12-05T11:11:04+01:00
created: 2014-01-15T14:54:24+01:00
status: 1

bouquet de mariée
type: SimpleNonPreferredTerm
modified: 2014-12-05T11:11:04+01:00
created: 2014-01-15T14:54:24+01:00
status: 1

diorama
type: SimpleNonPreferredTerm
modified: 2014-12-03T16:12:02+01:00
created: 2014-01-15T14:54:24+01:00
status: 1

peinture murale marouflée
type: SimpleNonPreferredTerm
modified: 2014-12-03T16:12:02+01:00
created: 2014-01-15T14:54:24+01:00
status: 1

peinture murale
type: SimpleNonPreferredTerm
modified: 2014-12-03T16:12:02+01:00
created: 2014-01-15T14:54:24+01:00
status: 1

mur peint
type: SimpleNonPreferredTerm
modified: 2014-12-03T16:12:02+01:00
created: 2014-01-15T14:54:24+01:00
status: 1

panorama
type: SimpleNonPreferredTerm
modified: 2014-12-03T16:12:02+01:00
created: 2014-01-15T14:54:24+01:00
status: 1

peinture monumentale
type: PreferredTerm
modified: 2014-12-03T16:12:02+01:00
created: 2014-01-15T14:54:24+01:00
status: 1

corporal
type: Concept
modified: 2014-12-02T16:31:16+01:00
in scheme: Thésaurus de la désignation des objets mobiliers
preferred label: corporale @it
preferred label: corporals (altar cloths) @en-us
broader: linge ou garniture liés à l'Eucharistie
created: 2012-05-16T00:00:00+02:00
related: coffret pour le viatique
definition: Linge consacré blanc, en lin ou en chanvre, de forme carrée, que l'on place sur un autel pendant la messe et sur lequel reposent les hosties ou tout vase contenant le saint sacrement. Il ne porte aucun décor, à l’exception d’une petite croix brodée ou imprimée, là où l'on dépose habituellement le saint sacrement, un décor blanc limité aux angles ou encore une petite bordure de dentelle. Le corporal utilisé pour l'exposition du saint sacrement est de plus grande taille et peut être plus largement bordé de dentelles ou de broderies.
TermeAssocie: coffret pour le viatique
status: 1
broad match: cb11936841q

coffret pour le viatique
type: Concept
modified: 2014-11-26T12:34:51+01:00
in scheme: Thésaurus de la désignation des objets mobiliers
preferred label: cofanetto per il servizio da viatico @it
preferred label: Viaticum cases @en-us
preferred label: porta-viático @pt
broader: boîte et coffret pour le rangement des objets liturgiques
alternative label: nécessaire pour la communion des malades
alternative label: boîte d'administration
alternative label: cassette du viatique
created: 2012-05-16T00:00:00+02:00
related: ampoule à huile des malades
related: corporal
related: ciboire des malades
definition: Valise ou boîte utilisée pour porter les objets et linges nécessaires à l'administration du viatique et de l'extrême-onction (ciboire des malades, ampoule à huile des malades, corporal, étole de viatique, etc.).
TermeAssocie: ampoule à huile des malades
TermeAssocie: corporal
TermeAssocie: ciboire des malades
status: 1
broad match: cb13162914n

corporal
type: PreferredTerm
modified: 2014-12-02T16:31:16+01:00
created: 2014-01-15T14:54:24+01:00
status: 1

alternateur monophasé
type: Concept
modified: 2015-08-04T16:24:13+02:00
in scheme: Thésaurus de la désignation des objets mobiliers
broader: générateur électrique alternatif
created: 2012-05-16T00:00:00+02:00
definition: Générateur électrique alternatif à une phase.
status: 1
broad match: http://data.bnf.fr/ark:/12148/cb123986174

alternateur monophasé
type: PreferredTerm
modified: 2015-08-04T16:24:13+02:00
created: 2014-01-15T14:54:24+01:00
status: 1

plateau à gants et à anneau
type: SimpleNonPreferredTerm
modified: 2014-11-26T14:11:32+01:00
created: 2014-01-15T14:54:24+01:00
status: 1

plateau de présentation
type: PreferredTerm
modified: 2014-11-26T14:11:32+01:00
created: 2014-01-15T14:54:24+01:00
status: 1

paravent
type: PreferredTerm
modified: 2014-12-04T15:18:51+01:00
created: 2014-01-15T14:54:24+01:00
status: 1

machine à carotter
type: PreferredTerm
modified: 2015-10-09T11:11:49+02:00
created: 2014-01-15T14:54:24+01:00
status: 1

armoire à reliquaires
type: Concept
modified: 2014-12-01T15:37:26+01:00
in scheme: Thésaurus de la désignation des objets mobiliers
preferred label: armadio per reliquari @it
preferred label: reliquary cupboards @en-us
preferred label: armário para relicários @pt
broader: meuble de rangement pour objets, linges et vêtements du culte
created: 2012-05-16T00:00:00+02:00
related: reliquaire
definition: Meuble destiné à la conservation et à l'exposition des reliquaires. L’armoire à reliquaires doit être solidement fermée et peut comporter une inscription qui précise sa destination.
TermeAssocie: reliquaire
status: 1

armoire à reliquaires
type: PreferredTerm
modified: 2014-12-01T15:37:26+01:00
created: 2014-01-15T14:54:24+01:00
status: 1

claie garde-manger
type: Concept
modified: 2014-10-13T10:41:33+02:00
in scheme: Thésaurus de la désignation des objets mobiliers
broader: claie
created: 2012-05-16T00:00:00+02:00
definition: Claie en bois suspendue au plafond où l'on place la nourriture entamée.
status: 1
broad match: cb13562642r
broad match: http://vocab.getty.edu/aat/300079641

claie garde-manger
type: PreferredTerm
modified: 2014-10-13T10:41:33+02:00
created: 2014-01-15T14:54:24+01:00
status: 1

support ou organe de stabilité
type: Concept
modified: 2014-10-15T15:36:55+02:00
in scheme: Thésaurus de la désignation des objets mobiliers
preferred label: supporting and resisting elements @en-us
narrower: support vertical
narrower: support en surplomb
narrower: T69-223
broader: élément d'architecture
created: 2012-05-16T00:00:00+02:00
definition: Elément qui soutient ou équilibre une construction.
status: 1
broad match: http://vocab.getty.edu/aat/300078048

fondations et sols
type: Concept
modified: 2015-01-30T12:05:45+01:00
in scheme: Thésaurus de la désignation des objets mobiliers
preferred label: foundations and floors @en-us
narrower: T69-118
broader: élément d'architecture
alternative label: hypocauste
created: 2012-05-16T00:00:00+02:00
definition: Ouvrage en sous-sol soutenant une construction ou formant le sol de celle-ci.
status: 1

élément d'architecture
type: PreferredTerm
modified: 2014-10-15T15:53:19+02:00
created: 2014-01-15T14:54:24+01:00
status: 1

baie
type: Concept
modified: 2015-02-06T12:43:09+01:00
in scheme: Thésaurus de la désignation des objets mobiliers
preferred label: openings (architectural elements) @en-us
narrower: élément de baie
narrower: porte
narrower: T69-153
narrower: T69-151
narrower: T69-147
narrower: T69-145
narrower: T69-143
broader: élément d'architecture
created: 2012-05-16T00:00:00+02:00
scope note: Voir aussi le Thesaurus de la désignation des œuvres architecturales et des espaces aménagés.
definition: Ouverture de fonction quelconque, ménagée dans un mur ou une paroi, et son encadrement.
status: 1

charpente
type: Concept
modified: 2014-12-15T15:25:13+01:00
in scheme: Thésaurus de la désignation des objets mobiliers
preferred label: structural frames @en-us
narrower: pièce de charpente
narrower: T69-88
broader: élément d'architecture
alternative label: pan-de-bois
created: 2012-05-16T00:00:00+02:00
scope note: Voir aussi le Thesaurus de la désignation des œuvres architecturales et des espaces aménagés.
definition: Ouvrage généralement formé de pièces de bois ou de fers assemblées, formant le comble et portant le matériau de couverture. Désigne également les éléments d'une structure porteuse lorsqu'elle n'est pas en maçonnerie.
status: 1

mur - garde-corps - clôture
type: Concept
modified: 2015-01-30T13:03:28+01:00
in scheme: Thésaurus de la désignation des objets mobiliers
preferred label: walls - railings - fences @en-us
narrower: clôture
narrower: T69-132
narrower: T69-128
broader: élément d'architecture
created: 2012-05-16T00:00:00+02:00
scope note: Voir aussi le Thesaurus de la désignation des œuvres architecturales et des espaces aménagés.
definition: Ouvrage vertical délimitant un espace, formant une protection ou faisant obstacle au passage, etc., à l’intérieur ou à l’extérieur d’un édifice.
status: 1

moteur à énergie animale
type: Concept
modified: 2015-10-07T16:46:09+02:00
in scheme: Thésaurus de la désignation des objets mobiliers
broader: moteur à énergie mécanique
alternative label: manège (moteur)
alternative label: cage d'écureuil (moteur)
created: 2012-05-16T00:00:00+02:00
definition: Moteur à énergie mécanique dont la source énergétique motrice est d'origine musculaire.
status: 1
narrow match: Cage d'écureuil

manège (moteur)
type: SimpleNonPreferredTerm
modified: 2015-10-07T16:46:09+02:00
created: 2014-01-15T14:54:24+01:00
status: 1

cage d'écureuil (moteur)
type: SimpleNonPreferredTerm
modified: 2015-10-07T16:46:09+02:00
created: 2014-01-15T14:54:24+01:00
status: 1

moteur à énergie mécanique
type: Concept
modified: 2015-08-05T15:56:20+02:00
in scheme: Thésaurus de la désignation des objets mobiliers
narrower: moteur hydraulique
narrower: moteur à énergie animale
narrower: moteur pneumatique
narrower: moteur éolien
narrower: moteur à poids
narrower: moteur à ressort
broader: moteur
created: 2012-05-16T00:00:00+02:00
definition: Moteur dont la source énergétique motrice est mécanique.
status: 1

moteur à énergie animale
type: PreferredTerm
modified: 2015-10-07T16:46:09+02:00
created: 2014-01-15T14:54:24+01:00
status: 1

console d'architecture
type: Concept
modified: 2015-02-05T16:49:27+01:00
in scheme: Thésaurus de la désignation des objets mobiliers
preferred label: brackets (structural elements) @en-us
broader: support en surplomb
created: 2012-05-16T00:00:00+02:00
definition: Organe en surplomb nettement plus haut que large (à la différence du corbeau), portant une charge, et servant uniquement de soutien et non de support.
status: 1

modillon
type: Concept
modified: 2015-02-11T11:23:12+01:00
in scheme: Thésaurus de la désignation des objets mobiliers
preferred label: modillions @en-us
broader: support en surplomb
created: 2012-05-16T00:00:00+02:00
definition: Petit support de forme quelconque placé sous une corniche : ce n'est souvent qu'un élément de modénature.
status: 1

support en surplomb
type: PreferredTerm
modified: 2015-02-11T12:44:10+01:00
created: 2014-01-15T14:54:24+01:00
status: 1

tiare
type: Concept
modified: 2014-12-03T13:08:45+01:00
in scheme: Thésaurus de la désignation des objets mobiliers
preferred label: tiaras @en-us
preferred label: tiara @it
broader: coiffure liturgique
alternative label: fanons de tiare
created: 2012-05-16T00:00:00+02:00
definition: Coiffure de forme conique, réservée au pape, portée en dehors des services liturgiques. Elle est dotée de fanons, souvent surmontée d'une croix et décorée d'un motif de couronne (primitivement une, puis deux et, depuis la seconde moitié du XIVe siècle, trois couronnes superposées).
status: 1

fanons de tiare
type: SimpleNonPreferredTerm
modified: 2014-12-03T13:08:45+01:00
created: 2014-01-15T14:54:24+01:00
status: 1

tiare
type: PreferredTerm
modified: 2014-12-03T13:08:45+01:00
created: 2014-01-15T14:54:24+01:00
status: 1

monospace
type: PreferredTerm
modified: 2014-10-16T11:15:03+02:00
created: 2014-01-15T14:54:24+01:00
status: 1

machine à pressurer
type: Concept
modified: 2015-10-09T12:34:43+02:00
in scheme: Thésaurus de la désignation des objets mobiliers
broader: machine à extraire des fluides
alternative label: pressoir à vis horizontale
alternative label: pressoir à débit continu
alternative label: pressoir industriel
alternative label: pressoir hydraulique
alternative label: pressoir pneumatique
alternative label: pressoir à vis verticale
created: 2012-05-16T00:00:00+02:00
related: pressoir à fruits
definition: Machine à extraire des fluides de produits naturels par pression ou par centrifugation.
TermeAssocie: pressoir à fruits
status: 1
narrow match: cb11974635k

machine à pressurer
type: PreferredTerm
modified: 2015-10-09T12:34:43+02:00
created: 2014-01-15T14:54:24+01:00
status: 1

pressoir à fruits
type: Concept
modified: 2013-12-16T00:00:00+01:00
in scheme: Thésaurus de la désignation des objets mobiliers
broader: matériel pour la culture et l'horticulture
created: 2013-12-16T00:00:00+01:00
related: machine liée à la production artisanale
related: machine à pressurer
TermeAssocie: machine liée à la production artisanale
TermeAssocie: machine à pressurer
status: 1

pressoir à vis verticale
type: SimpleNonPreferredTerm
modified: 2015-10-09T12:34:43+02:00
created: 2014-01-15T14:54:24+01:00
status: 1

pressoir à débit continu
type: SimpleNonPreferredTerm
modified: 2015-10-09T12:34:43+02:00
created: 2014-01-15T14:54:24+01:00
status: 1

pressoir industriel
type: SimpleNonPreferredTerm
modified: 2015-10-09T12:34:43+02:00
created: 2014-01-15T14:54:24+01:00
status: 1

pressoir hydraulique
type: SimpleNonPreferredTerm
modified: 2015-10-09T12:34:43+02:00
created: 2014-01-15T14:54:24+01:00
status: 1

machine à extraire des fluides
type: Concept
modified: 2015-08-12T12:25:53+02:00
in scheme: Thésaurus de la désignation des objets mobiliers
narrower: machine à pressurer
narrower: machine à distiller
narrower: machine à essorer
narrower: T69-5549
broader: machine à séparer
created: 2012-05-16T00:00:00+02:00
definition: Machine à extraire un liquide ou un gaz d'un matériau ou d'un produit solide ou liquide.
status: 1

pressoir pneumatique
type: SimpleNonPreferredTerm
modified: 2015-10-09T12:34:43+02:00
created: 2014-01-15T14:54:24+01:00
status: 1

pressoir à vis horizontale
type: SimpleNonPreferredTerm
modified: 2015-10-09T12:34:43+02:00
created: 2014-01-15T14:54:24+01:00
status: 1

canne
type: Concept
modified: 2014-12-10T17:54:15+01:00
in scheme: Thésaurus de la désignation des objets mobiliers
preferred label: walking sticks @en-us
broader: accessoire de l'habillement
created: 2012-05-16T00:00:00+02:00
definition: Bâton léger, parfois ouvragé qui, tenu à la main, sert d'appui à une personne qui marche.
status: 1

accessoire de l'habillement
type: Concept
modified: 2014-10-17T16:42:33+02:00
in scheme: Thésaurus de la désignation des objets mobiliers
preferred label: costume accessories @en-us
narrower: sac
narrower: canne
narrower: mouchoir
narrower: T69-9330
narrower: T69-9331
narrower: T69-9332
broader: costume civil, professionnel ou militaire
alternative label: couronne de costume de mariée
alternative label: manchon
alternative label: embauchoir
alternative label: ombrelle
alternative label: parapluie
alternative label: couronne de chignon
alternative label: porte-clefs
alternative label: porte-monnaie
created: 2013-11-14T00:00:00+01:00
related: bijouterie et orfèvrerie civiles, monnaie, médaille
definition: Élément de forme et de fonction variées qui accompagne et complète les pièces du vêtement, généralement pour sortir, et qui peut être assortie à celles-ci.
TermeAssocie: bijouterie et orfèvrerie civiles, monnaie, médaille
status: 1

canne
type: PreferredTerm
modified: 2014-12-10T17:54:15+01:00
created: 2014-01-15T14:54:24+01:00
status: 1

étagère à épices
type: Concept
modified: 2014-12-04T16:41:21+01:00
in scheme: Thésaurus de la désignation des objets mobiliers
preferred label: spice cupboards @en-us
broader: étagère
alternative label: casier à épices
alternative label: étagère porte-ingrédients
created: 2012-05-16T00:00:00+02:00
definition: Casier ou étagère murale ou sur pieds où l'on range les pots à épices.
status: 1

étagère
type: PreferredTerm
modified: 2014-12-04T16:51:04+01:00
created: 2014-01-15T14:54:24+01:00
status: 1

étagère à musique
type: SimpleNonPreferredTerm
modified: 2014-12-04T16:51:04+01:00
created: 2014-01-15T14:54:24+01:00
status: 1

bibliothèque en table
type: Concept
modified: 2014-12-04T16:40:33+01:00
in scheme: Thésaurus de la désignation des objets mobiliers
preferred label: bureau-bookcases @en-us
broader: étagère
created: 2012-05-16T00:00:00+02:00
definition: Meuble composé d'une étagère à tablettes de profondeur décroissante montée sur une table basse ou sur pieds, servant à ranger des livres. Ces bibliothèques se présentent généralement par paires.
status: 1
broad match: cb13562146r

archet
type: Concept
modified: 2014-12-12T15:19:39+01:00
in scheme: Thésaurus de la désignation des objets mobiliers
preferred label: bows (chordophone components) @en-us
broader: accessoire du musicien
created: 2012-05-16T00:00:00+02:00
definition: Baguette, droite depuis le XVIIIe siècle, en bois dur, sur laquelle est tendue une mèche de crins ou de fibres artificielles avec laquelle on fait vibrer les cordes de différents instruments.
status: 1

accessoire du musicien
type: PreferredTerm
modified: 2014-10-10T11:19:50+02:00
created: 2014-01-15T14:54:24+01:00
status: 1

bâton de mesure
type: Concept
modified: 2014-10-10T11:23:22+02:00
in scheme: Thésaurus de la désignation des objets mobiliers
preferred label: batons (music equipment) @en-us
broader: accessoire du musicien
alternative label: bâton de chef d'orchestre
created: 2012-05-16T00:00:00+02:00
definition: Bâton petit et mince avec lequel le chef d'orchestre bat la mesure pour diriger l'orchestre.
status: 1
broad match: http://data.bnf.fr/ark:/12148/cb119367821

manteau de cheminée
type: PreferredTerm
modified: 2015-01-07T16:10:22+01:00
created: 2014-01-15T14:54:24+01:00
status: 1

ronde-bosse
type: Concept
modified: 2014-12-03T17:25:31+01:00
in scheme: Thésaurus de la désignation des objets mobiliers
preferred label: sculpture in the round @en-us
narrower: statue
narrower: groupe sculpté
narrower: torse
narrower: T69-4829
broader: sculpture
created: 2012-05-16T00:00:00+02:00
scope note: Indiquer dans le champ PDEN : figurine (- de 25 cm), statuette (25 à 80 cm), demi-nature (80 à 90 cm), petite nature (90 à 160 cm), figure grandeur naturelle (160 à 180 cm), figure colossale (+ de 180 cm).
related: support vertical
related: objet de représentation d'un organisme vivant
definition: Sculpture dont le volume correspond au moins aux trois quarts du volume réel d'un corps ou d'un objet et qui peut être entièrement travaillée (face, côtés, revers) ou n'être terminée que sous trois aspects. La ronde-bosse, contrairement aux reliefs, n'a jamais de fond.
TermeAssocie: support vertical
TermeAssocie: objet de représentation d'un organisme vivant
status: 1

statue de procession
type: Concept
modified: 2014-11-28T13:00:19+01:00
in scheme: Thésaurus de la désignation des objets mobiliers
preferred label: processional statues @en-us
preferred label: statua processionale @it
preferred label: escultura processional @pt
broader: objet lié à la procession
created: 2012-05-16T00:00:00+02:00
related: statue
definition: Statue cultuelle qui accompagne une procession. Elle est généralement posée sur une base ou un socle percé afin de pouvoir y passer des baguettes servant à porter l'œuvre comme sur un brancard.
TermeAssocie: statue
status: 1

statue
type: PreferredTerm
modified: 2014-12-04T10:46:20+01:00
created: 2014-01-15T14:54:24+01:00
status: 1

statue cinéraire
type: Concept
modified: 2015-02-24T14:45:23+01:00
in scheme: Thésaurus de la désignation des objets mobiliers
preferred label: cinerary statues @en-us
broader: T69-385
created: 2012-05-16T00:00:00+02:00
related: statue
definition: Statue, le plus souvent en terre cuite, destinée à contenir les cendres d'un défunt.
TermeAssocie: statue
status: 1

statue-reliquaire
type: Concept
modified: 2014-11-26T17:46:42+01:00
in scheme: Thésaurus de la désignation des objets mobiliers
preferred label: statue-reliquaries @en-us
preferred label: reliquiario a statua @it
preferred label: estátua-relicário @pt
broader: reliquaire
created: 2012-05-16T00:00:00+02:00
related: statue
definition: Statue contenant des reliques placées dans une ou plusieurs logettes dans le corps, dans la base ou dans un récipient porté par la statue.
TermeAssocie: statue
status: 1

statue ouvrante
type: Concept
modified: 2014-12-01T14:17:24+01:00
in scheme: Thésaurus de la désignation des objets mobiliers
preferred label: statue-polyptychs @en-us
preferred label: statua apribile @it
preferred label: escultura políptico @pt
broader: autel et son environnement
created: 2012-05-16T00:00:00+02:00
related: statue
definition: Statue, en général une Vierge à l'Enfant, qui s'ouvre par le milieu ou par le côté pour constituer un diptyque ou un triptyque contenant des représentations figurées qui peuvent être peintes ou sculptées.
TermeAssocie: statue
status: 1
broad match: http://vocab.getty.edu/aat/300047600

diptyque
type: Concept
modified: 2014-12-01T12:59:09+01:00
in scheme: Thésaurus de la désignation des objets mobiliers
preferred label: diticco @it
preferred label: diptychs @en-us
preferred label: díptico @pt
broader: polyptyque
alternative label: diptyque portatif
created: 2012-05-16T00:00:00+02:00
definition: Polyptyque composé de deux panneaux ou volets de forme et de dimensions généralement identiques. Quand il est de dimensions réduites, on l'appelle diptyque portatif.
status: 1

diptyque
type: PreferredTerm
modified: 2014-12-01T12:59:09+01:00
created: 2014-01-15T14:54:24+01:00
status: 1

diptyque portatif
type: SimpleNonPreferredTerm
modified: 2014-12-01T12:59:09+01:00
created: 2014-01-15T14:54:24+01:00
status: 1

triangle
type: Concept
modified: 2014-10-10T13:38:37+02:00
in scheme: Thésaurus de la désignation des objets mobiliers
preferred label: triangles (idiophones) @en-us
broader: idiophone à émission par percussion directe
created: 2012-05-16T00:00:00+02:00
scope note: Noter dans le champ DESC si l'instrument possède des anneaux.
related: baguette
definition: Triangle en métal, isocèle ou équilatéral, ouvert sur un des côtés. On le tient suspendu d'une main et on le frappe avec une baguette métallique de l'autre.
TermeAssocie: baguette
status: 1

triangle
type: PreferredTerm
modified: 2014-10-10T13:38:37+02:00
created: 2014-01-15T14:54:24+01:00
status: 1

gilet
type: Concept
modified: 2014-12-11T16:40:33+01:00
in scheme: Thésaurus de la désignation des objets mobiliers
preferred label: waistcoats (garments) @en-us
broader: vêtement d'intérieur ou d'extérieur
alternative label: boléro
created: 2012-05-16T00:00:00+02:00
definition: Sorte de veste courte et serrée à la taille, le plus souvent sans manches, qui se porte sur la chemise et sous la veste pour l'homme et sur le corsage ou la robe pour la femme.
status: 1

boléro
type: SimpleNonPreferredTerm
modified: 2014-12-11T16:40:33+01:00
created: 2014-01-15T14:54:24+01:00
status: 1

gilet
type: PreferredTerm
modified: 2014-12-11T16:40:33+01:00
created: 2014-01-15T14:54:24+01:00
status: 1

statue-reliquaire
type: PreferredTerm
modified: 2014-11-26T17:46:42+01:00
created: 2014-01-15T14:54:24+01:00
status: 1

machine à découper par tranchoir
type: Concept
modified: 2015-08-13T10:56:37+02:00
in scheme: Thésaurus de la désignation des objets mobiliers
broader: machine à découper
alternative label: dérouleuse
alternative label: massicot refendeur
alternative label: massicot
alternative label: massicot trilatéral
alternative label: trancheuse
created: 2012-05-16T00:00:00+02:00
scope note: Ne pas confondre avec machine à découper par cisaille.
definition: Machine à découper un produit à l'aide d'une lame effilée.
status: 1
narrow match: http://vocab.getty.edu/aat/300022407
narrow match: Massicot
narrow match: http://data.bnf.fr/ark:/12148/cb161801859

massicot refendeur
type: SimpleNonPreferredTerm
modified: 2015-08-13T10:56:37+02:00
created: 2014-01-15T14:54:24+01:00
status: 1

massicot trilatéral
type: SimpleNonPreferredTerm
modified: 2015-08-13T10:56:37+02:00
created: 2014-01-15T14:54:24+01:00
status: 1

machine à découper par tranchoir
type: PreferredTerm
modified: 2015-08-13T10:56:37+02:00
created: 2014-01-15T14:54:24+01:00
status: 1

trancheuse
type: SimpleNonPreferredTerm
modified: 2015-08-13T10:56:37+02:00
created: 2014-01-15T14:54:24+01:00
status: 1

dérouleuse
type: SimpleNonPreferredTerm
modified: 2015-08-13T10:56:37+02:00
created: 2014-01-15T14:54:24+01:00
status: 1

massicot
type: SimpleNonPreferredTerm
modified: 2015-08-13T10:56:37+02:00
created: 2014-01-15T14:54:24+01:00
status: 1

machine à ensacher
type: PreferredTerm
modified: 2015-10-14T16:03:50+02:00
created: 2014-01-15T14:54:24+01:00
status: 1

ensacheuse
type: SimpleNonPreferredTerm
modified: 2015-10-14T16:03:50+02:00
created: 2014-01-15T14:54:24+01:00
status: 1

ensacheuse à carrousel
type: SimpleNonPreferredTerm
modified: 2015-10-14T16:03:50+02:00
created: 2014-01-15T14:54:24+01:00
status: 1

pupitre protestant
type: Concept
modified: 2014-01-10T00:00:00+01:00
in scheme: Thésaurus de la désignation des objets mobiliers
broader: meuble du culte protestant
created: 2012-05-16T00:00:00+02:00
definition: Petit lutrin posé sur la table sainte et sur lequel se trouve une bible ouverte.
status: 1

meuble du culte protestant
type: Concept
modified: 2014-01-10T00:00:00+01:00
in scheme: Thésaurus de la désignation des objets mobiliers
narrower: pupitre protestant
narrower: siège liturgique protestant
narrower: chaire pastorale
narrower: clôture de choeur protestante
narrower: porte-cercueil protestant
narrower: fonts baptismaux protestants
narrower: T69-987
broader: meuble religieux
created: 2012-05-16T00:00:00+02:00
definition: Mobilier lié à l'exercie de la liturgie protestante.
status: 1

pupitre protestant
type: PreferredTerm
modified: 2014-01-10T00:00:00+01:00
created: 2014-01-15T14:54:24+01:00
status: 1

pot de toilette
type: PreferredTerm
modified: 2014-12-10T17:00:54+01:00
created: 2014-01-15T14:54:24+01:00
status: 1

poudrier de toilette
type: SimpleNonPreferredTerm
modified: 2014-12-10T17:00:54+01:00
created: 2014-01-15T14:54:24+01:00
status: 1

pot à pâte
type: SimpleNonPreferredTerm
modified: 2014-12-10T17:00:54+01:00
created: 2014-01-15T14:54:24+01:00
status: 1

pot à fards
type: SimpleNonPreferredTerm
modified: 2014-12-10T17:00:54+01:00
created: 2014-01-15T14:54:24+01:00
status: 1

tasse de toilette
type: SimpleNonPreferredTerm
modified: 2014-12-10T17:00:54+01:00
created: 2014-01-15T14:54:24+01:00
status: 1

boîte à poudre
type: SimpleNonPreferredTerm
modified: 2014-12-10T17:00:54+01:00
created: 2014-01-15T14:54:24+01:00
status: 1

boîte à fard
type: SimpleNonPreferredTerm
modified: 2014-12-10T17:00:54+01:00
created: 2014-01-15T14:54:24+01:00
status: 1

machine à estamper
type: Concept
modified: 2015-10-14T12:18:47+02:00
in scheme: Thésaurus de la désignation des objets mobiliers
narrower: machine à matricer
broader: machine à modeler
alternative label: estampeuse
created: 2012-05-16T00:00:00+02:00
definition: Machine à modeler pour former des creux ou des reliefs par refoulement de la matière à l'intérieur d'une empreinte.
status: 1

machine à matricer
type: Concept
modified: 2015-08-13T16:36:33+02:00
in scheme: Thésaurus de la désignation des objets mobiliers
broader: machine à estamper
alternative label: marteau-pilon à planche
alternative label: presse à friction
created: 2012-05-16T00:00:00+02:00
definition: Machine à estamper un matériau ou un produit par choc ou pression à l'aide d'une matrice.
status: 1

machine à estamper
type: PreferredTerm
modified: 2015-10-14T12:18:47+02:00
created: 2014-01-15T14:54:24+01:00
status: 1

estampeuse
type: SimpleNonPreferredTerm
modified: 2015-10-14T12:18:47+02:00
created: 2014-01-15T14:54:24+01:00
status: 1

conopée
type: PreferredTerm
modified: 2014-12-02T16:22:04+01:00
created: 2014-01-15T14:54:24+01:00
status: 1

pavillon de tabernacle
type: SimpleNonPreferredTerm
modified: 2014-12-02T16:22:04+01:00
created: 2014-01-15T14:54:24+01:00
status: 1

appareil d'enregistrement ou de restitution
type: Concept
modified: 2014-01-10T00:00:00+01:00
in scheme: Thésaurus de la désignation des objets mobiliers
narrower: support d'enregistrement
narrower: appareil d'enregistrement
narrower: appareil de restitution
narrower: appareil enregistrant et restituant des données
broader: dénomination provisoire
created: 2012-05-16T00:00:00+02:00
definition: Appareil servant à enregistrer ou restituer, de manière analogique ou numérique, des donner afin de permettre leur écoute ou leur visualisation, ou bien appareil proposant les deux fonctions à la fois.
status: 1

appareil d'enregistrement ou de restitution
type: PreferredTerm
modified: 2014-01-10T00:00:00+01:00
created: 2014-01-15T14:54:24+01:00
status: 1

appareil enregistrant et restituant des données
type: Concept
modified: 2014-01-10T00:00:00+01:00
in scheme: Thésaurus de la désignation des objets mobiliers
broader: appareil d'enregistrement ou de restitution
alternative label: gramophone
alternative label: phonautographe
alternative label: télégraphe
alternative label: magnétoscope
alternative label: numériseur
alternative label: magnétophone
alternative label: scanneur
alternative label: téléphone
alternative label: phonographe
alternative label: bélinographe
alternative label: télescripteur
alternative label: télécopieur
created: 2014-01-10T00:00:00+01:00
status: 1

empreinte de sceau
type: Concept
modified: 2014-12-30T12:49:27+01:00
in scheme: Thésaurus de la désignation des objets mobiliers
preferred label: seals (artifacts) @en-us
broader: marque d'appartenance ou d'autorité
created: 2013-03-21T00:00:00+01:00
related: sceau ecclésiastique
definition: ​Empreinte de cire ou de plomb où figurent des signes propres à une autorité souveraine, à un corps ou à un particulier, utilisée pour garantir la validité, l'authenticité, l'autorité d'un document sur lequel il est apposé ou pour le clore afin d'en tenir le contenu caché.
TermeAssocie: sceau ecclésiastique
status: 1

sceau ecclésiastique
type: PreferredTerm
modified: 2014-11-26T14:12:46+01:00
created: 2014-01-15T14:54:24+01:00
status: 1

archet
type: PreferredTerm
modified: 2014-12-12T15:19:39+01:00
created: 2014-01-15T14:54:24+01:00
status: 1

cordon de croix pectorale
type: SimpleNonPreferredTerm
modified: 2014-12-03T11:28:16+01:00
created: 2014-01-15T14:54:24+01:00
status: 1

accessoire du costume liturgique des clercs
type: PreferredTerm
modified: 2014-12-03T11:28:16+01:00
created: 2014-01-15T14:54:24+01:00
status: 1

colletin
type: Concept
modified: 2014-12-03T11:34:58+01:00
in scheme: Thésaurus de la désignation des objets mobiliers
preferred label: colleto di veste liturgica @it
preferred label: liturgical neckerchiefs @en-us
preferred label: virola @pt
broader: accessoire du costume liturgique des clercs
alternative label: collaro
alternative label: tour de chasuble
alternative label: tour d'étole
alternative label: tour de chape
created: 2012-05-16T00:00:00+02:00
related: voile huméral
related: étole de clerc
related: chasuble
related: chape
definition: Bande de tissu, étroite et longue, cousue sur la partie en contact avec le cou d'une chasuble, d'une chape ou d'une étole ou d'un voile huméral, pour en protéger le tissu. Le collaro est spécifiquement destiné à l’échancrure de la soutane.
TermeAssocie: voile huméral
TermeAssocie: étole de clerc
TermeAssocie: chasuble
TermeAssocie: chape
status: 1
broad match: http://data.bnf.fr/ark:/12148/cb16195848f

rational
type: SimpleNonPreferredTerm
modified: 2014-12-03T11:28:16+01:00
created: 2014-01-15T14:54:24+01:00
status: 1

collet de dalmatique
type: Concept
modified: 2014-12-03T11:32:18+01:00
in scheme: Thésaurus de la désignation des objets mobiliers
broader: accessoire du costume liturgique des clercs
created: 2012-05-16T00:00:00+02:00
definition: Large col amovible assorti à la dalmatique.
status: 1

aumusse
type: Concept
modified: 2014-12-03T11:29:14+01:00
in scheme: Thésaurus de la désignation des objets mobiliers
preferred label: almuces (hoods) @en-us
preferred label: almucio @it
preferred label: murça @pt
broader: accessoire du costume liturgique des clercs
created: 2012-05-16T00:00:00+02:00
definition: D'abord pèlerine courte, en fourrure, comportant souvent un capuchon, utilisée par les chanoines durant les offices au cours de l'hiver, l'aumusse est ensuite devenue leur insigne. Elle est aussi portée pliée sur une épaule ou un bras et prend alors la forme d'une simple étole.
status: 1
broad match: cb11941484w

console d'architecture
type: PreferredTerm
modified: 2015-02-05T16:49:27+01:00
created: 2014-01-15T14:54:24+01:00
status: 1

voiture de sport
type: SimpleNonPreferredTerm
modified: 2014-12-30T10:36:06+01:00
created: 2014-01-15T14:54:24+01:00
status: 1

voiture de compétition
type: PreferredTerm
modified: 2014-12-30T10:36:06+01:00
created: 2014-01-15T14:54:24+01:00
status: 1

voiture de course
type: SimpleNonPreferredTerm
modified: 2014-12-30T10:36:06+01:00
created: 2014-01-15T14:54:24+01:00
status: 1

idiophone à émission par percussion indirecte (secouement ou raclement)
type: Concept
modified: 2014-10-10T14:09:51+02:00
in scheme: Thésaurus de la désignation des objets mobiliers
preferred label: indirectly struck idiophones @en-us
narrower: sonnaille de troupeau
narrower: claquoir
narrower: sonnailles
narrower: cadre à grelots
narrower: grelot
narrower: marteau à musique
narrower: hochet (idiophone)
narrower: sistre
narrower: chapeau chinois
broader: idiophone
created: 2012-05-16T00:00:00+02:00
definition: Idiophone produisant un son lorsqu'un mouvement lui est appliqué, mouvement actionnant des percuteurs internes ou externes qui viennent frapper le corps de l'instrument.
status: 1

claquoir
type: Concept
modified: 2014-12-15T12:44:46+01:00
in scheme: Thésaurus de la désignation des objets mobiliers
preferred label: tabella @it
preferred label: clappers (idiophones) @en-us
broader: idiophone à émission par percussion indirecte (secouement ou raclement)
created: 2012-05-16T00:00:00+02:00
definition: Instrument ordinairement composé d'au moins deux éléments solidaires frappant l'un contre l'autre ; l'un des éléments est souvent en forme de heurtoir ou de poignée de métal. Lors des cérémonies religieuses, il sert à donner un signal aux fidèles, généralement pour les avertir d'avoir à se lever.
status: 1
broad match: http://data.bnf.fr/ark:/12148/cb166877129

sonnailles
type: Concept
modified: 2014-10-10T14:29:49+02:00
in scheme: Thésaurus de la désignation des objets mobiliers
broader: idiophone à émission par percussion indirecte (secouement ou raclement)
created: 2012-05-16T00:00:00+02:00
related: tambour sur cadre
definition: Petites lames métalliques qui se heurtent l'une contre l'autre. On les trouve accrochées par un lien au corps des danseurs ou à différents instruments de musique.
TermeAssocie: tambour sur cadre
status: 1

cadre à grelots
type: Concept
modified: 2014-09-05T12:48:09+02:00
in scheme: Thésaurus de la désignation des objets mobiliers
preferred label: frame rattles @en-us
broader: idiophone à émission par percussion indirecte (secouement ou raclement)
alternative label: cadre à sonnailles
alternative label: sonnailles sur cadre
created: 2012-05-16T00:00:00+02:00
related: tambour sur cadre
definition: Instrument formé d'un cadre en bois auquel est accroché un ensemble de grelots ou de sonnailles.
TermeAssocie: tambour sur cadre
status: 1
broad match: http://data.bnf.fr/ark:/12148/cb166877129

idiophone à émission par percussion indirecte (secouement ou raclement)
type: PreferredTerm
modified: 2014-10-10T14:09:51+02:00
created: 2014-01-15T14:54:24+01:00
status: 1

grelot
type: Concept
modified: 2014-12-15T12:45:41+01:00
in scheme: Thésaurus de la désignation des objets mobiliers
preferred label: pellet bells @en-us
broader: idiophone à émission par percussion indirecte (secouement ou raclement)
created: 2012-05-16T00:00:00+02:00
related: tambour sur cadre
definition: Petite coque creuse et trouée, en métal, renfermant une bille mobile de plomb. Le grelot est de taille diverse, utilisé seul ou en grelotière, accroché par un lien au cou d'un animal, à un bras ou une cheville de danseur ou encore à un instrument de musique.
TermeAssocie: tambour sur cadre
status: 1

marteau à musique
type: Concept
modified: 2014-09-05T14:16:08+02:00
in scheme: Thésaurus de la désignation des objets mobiliers
broader: idiophone à émission par percussion indirecte (secouement ou raclement)
alternative label: martelet
alternative label: toque-maillet
created: 2012-05-16T00:00:00+02:00
related: T69-4988
definition: Instrument, utilisé lors des offices des Ténèbres, en bois, dans lequel un petit marteau articulé frappe alternativement selon le mouvement de balancier imprimé à l'objet, l'une ou l'autre des surfaces d'une planche arrondie.
TermeAssocie: T69-4988
status: 1
broad match: http://vocab.getty.edu/aat/300041660
broad match: http://data.bnf.fr/ark:/12148/cb166877129

hochet (idiophone)
type: Concept
modified: 2014-12-15T12:46:31+01:00
in scheme: Thésaurus de la désignation des objets mobiliers
preferred label: rattles @en-us
broader: idiophone à émission par percussion indirecte (secouement ou raclement)
alternative label: maraca
created: 2012-05-16T00:00:00+02:00
definition: Instrument constitué de petits objets durs enfermés dans une coque rigide de forme et de matériau variés et qui se heurtent lorsqu'on les secoue.
status: 1

sistre
type: Concept
modified: 2014-10-10T14:27:03+02:00
in scheme: Thésaurus de la désignation des objets mobiliers
preferred label: sistra @en-us
broader: idiophone à émission par percussion indirecte (secouement ou raclement)
alternative label: crepitaculum
created: 2012-05-16T00:00:00+02:00
definition: Sorte de hochet, souvent en métal, en forme de U inversé avec une poignée verticale et des triangles horizontales, placées entre les deux branches du U qui s'entrechoquent lorsqu'on les secoue ; les barres portent parfois des anneaux mobiles ou des sonnailles.
status: 1

chapeau chinois
type: Concept
modified: 2014-10-10T14:17:33+02:00
in scheme: Thésaurus de la désignation des objets mobiliers
preferred label: jingling Johnnies @en-us
broader: idiophone à émission par percussion indirecte (secouement ou raclement)
created: 2012-05-16T00:00:00+02:00
definition: Long bâton à la partie supérieure duquel est accroché un chapeau en métal en forme de pagode agrémenté de clochettes et de grelots ; on en joue en frappant l'extrémité du bâton sur le sol. Utilisé dans la musique militaire.
status: 1
broad match: http://data.bnf.fr/ark:/12148/cb166877129

pot Jacqueline
type: SimpleNonPreferredTerm
modified: 2014-12-08T13:18:48+01:00
created: 2014-01-15T14:54:24+01:00
status: 1

pichet anthropomorphe
type: SimpleNonPreferredTerm
modified: 2014-12-08T13:18:48+01:00
created: 2014-01-15T14:54:24+01:00
status: 1

pichet
type: PreferredTerm
modified: 2014-12-08T13:18:48+01:00
created: 2014-01-15T14:54:24+01:00
status: 1

bouteille à goutte
type: SimpleNonPreferredTerm
modified: 2014-12-08T13:18:48+01:00
created: 2014-01-15T14:54:24+01:00
status: 1

pichet zoomorphe
type: SimpleNonPreferredTerm
modified: 2014-12-08T13:18:48+01:00
created: 2014-01-15T14:54:24+01:00
status: 1

pot à vin
type: SimpleNonPreferredTerm
modified: 2014-12-08T13:18:48+01:00
created: 2014-01-15T14:54:24+01:00
status: 1

nervure de voûte
type: Concept
modified: 2015-01-07T12:06:48+01:00
in scheme: Thésaurus de la désignation des objets mobiliers
preferred label: ribs (vault components) @en-us
broader: élément de couvrement
created: 2012-05-16T00:00:00+02:00
definition: Membre saillant à l'intrados d'une voûte.
status: 1

élément de couvrement
type: Concept
modified: 2014-09-08T11:21:30+02:00
in scheme: Thésaurus de la désignation des objets mobiliers
narrower: nervure de voûte
narrower: claveau
broader: couvrement
created: 2012-05-16T00:00:00+02:00
definition: Partie de l’appareil d’une plate-bande, d’une voûte, d’un arc ou d’une charpente.
status: 1
broad match: http://vocab.getty.edu/aat/300078053

nervure de voûte
type: PreferredTerm
modified: 2015-01-07T12:06:48+01:00
created: 2014-01-15T14:54:24+01:00
status: 1

cuve industrielle
type: PreferredTerm
modified: 2015-10-01T15:06:11+02:00
created: 2014-01-15T14:54:24+01:00
status: 1

objet pédagogique ou scientifique
type: Concept
modified: 2014-09-09T16:18:43+02:00
in scheme: Thésaurus de la désignation des objets mobiliers
narrower: objet de représentation scientifique et pédagogique
narrower: T69-9441
narrower: T69-9900
broader: instrument ou objet pédagogique ou scientifique
created: 2012-05-16T00:00:00+02:00
definition: Dans le cadre de l'enseignement ou de la réflexion scientifique, artefact permettant de représenter un phénomène physico-chimique ou élément naturel recueilli (et parfois traité) pour l'étude et la présentation.
status: 1

instrument ou objet pédagogique ou scientifique
type: PreferredTerm
modified: 2014-10-23T10:29:00+02:00
created: 2014-01-15T14:54:24+01:00
status: 1

instrument ou matériel d'ophtalmologie
type: Concept
modified: 2014-01-10T00:00:00+01:00
in scheme: Thésaurus de la désignation des objets mobiliers
broader: matériel médical
alternative label: synoptophore
alternative label: kératomètre
created: 2013-12-10T00:00:00+01:00
status: 1

synoptophore
type: SimpleNonPreferredTerm
modified: 2014-01-10T00:00:00+01:00
created: 2014-01-15T14:54:24+01:00
status: 1

instrument ou matériel d'ophtalmologie
type: PreferredTerm
modified: 2014-01-10T00:00:00+01:00
created: 2014-01-15T14:54:24+01:00
status: 1

kératomètre
type: SimpleNonPreferredTerm
modified: 2014-01-10T00:00:00+01:00
created: 2014-01-15T14:54:24+01:00
status: 1

brosse à meuble
type: Concept
modified: 2014-10-17T13:52:44+02:00
in scheme: Thésaurus de la désignation des objets mobiliers
broader: objet pour l'entretien de la maison
alternative label: brosse passe-partout
alternative label: brosse pour capitons
created: 2012-05-16T00:00:00+02:00
definition: Instrument, formé de fibres de même longueur ajustées dans une monture, de forme arrondi et muni d'une poignée ou d’un manche. La brosse à meuble sert à nettoyer, lustrer, entretenir le mobilier. Certaines sont aussi utilisées pour les tapis ou pour l'argenterie.
status: 1
broad match: http://data.bnf.fr/ark:/12148/cb11965878f
broad match: http://vocab.getty.edu/aat/300161423

brosse à meuble
type: PreferredTerm
modified: 2014-10-17T13:52:44+02:00
created: 2014-01-15T14:54:24+01:00
status: 1

brosse pour capitons
type: SimpleNonPreferredTerm
modified: 2014-10-17T13:52:44+02:00
created: 2014-01-15T14:54:24+01:00
status: 1

brosse passe-partout
type: SimpleNonPreferredTerm
modified: 2014-10-17T13:52:44+02:00
created: 2014-01-15T14:54:24+01:00
status: 1

machine à décortiquer
type: PreferredTerm
modified: 2015-10-09T12:40:56+02:00
created: 2014-01-15T14:54:24+01:00
status: 1

décortiqueuse
type: SimpleNonPreferredTerm
modified: 2015-10-09T12:40:56+02:00
created: 2014-01-15T14:54:24+01:00
status: 1

alternateur
type: SimpleNonPreferredTerm
modified: 2015-10-07T16:01:58+02:00
created: 2014-01-15T14:54:24+01:00
status: 1

alternateur triphasé
type: Concept
modified: 2015-10-07T16:13:16+02:00
in scheme: Thésaurus de la désignation des objets mobiliers
broader: générateur électrique alternatif
created: 2012-05-16T00:00:00+02:00
definition: Générateur électrique alternatif à trois phases.
status: 1
broad match: http://data.bnf.fr/ark:/12148/cb123986174

générateur électrique alternatif
type: PreferredTerm
modified: 2015-10-07T16:01:58+02:00
created: 2014-01-15T14:54:24+01:00
status: 1

chapelle à Vierge
type: PreferredTerm
modified: 2014-10-13T13:40:09+02:00
created: 2014-01-15T14:54:24+01:00
status: 1

polyptyque portatif
type: SimpleNonPreferredTerm
modified: 2014-12-01T12:55:21+01:00
created: 2014-01-15T14:54:24+01:00
status: 1

panneau de polyptyque
type: Concept
modified: 2014-12-01T13:03:29+01:00
in scheme: Thésaurus de la désignation des objets mobiliers
preferred label: scomparto di politicco @it
preferred label: polyptych panels @en-us
preferred label: painel (de políptico) @pt
broader: polyptyque
alternative label: compartiment de polyptyqye
created: 2012-05-16T00:00:00+02:00
definition: Elément démembré ou faisant partie d'un polyptyque ou d'un volet de polyptyque.
status: 1
broad match: http://data.bnf.fr/ark:/12148/cb133240296
broad match: http://vocab.getty.edu/aat/300178235
broad match: Polyptyque

polyptyque
type: PreferredTerm
modified: 2014-12-01T12:55:21+01:00
created: 2014-01-15T14:54:24+01:00
status: 1

parement d'image pieuse
type: SimpleNonPreferredTerm
modified: 2014-11-26T14:18:57+01:00
created: 2014-01-15T14:54:24+01:00
status: 1

auréole de dévotion
type: SimpleNonPreferredTerm
modified: 2014-11-26T14:18:57+01:00
created: 2014-01-15T14:54:24+01:00
status: 1

parure de statue
type: SimpleNonPreferredTerm
modified: 2014-11-26T14:18:57+01:00
created: 2014-01-15T14:54:24+01:00
status: 1

nimbe de dévotion
type: SimpleNonPreferredTerm
modified: 2014-11-26T14:18:57+01:00
created: 2014-01-15T14:54:24+01:00
status: 1

auréole de tableau
type: SimpleNonPreferredTerm
modified: 2014-11-26T14:18:57+01:00
created: 2014-01-15T14:54:24+01:00
status: 1

parure de sculpture
type: SimpleNonPreferredTerm
modified: 2014-11-26T14:18:57+01:00
created: 2014-01-15T14:54:24+01:00
status: 1

parure d'image sacrée
type: SimpleNonPreferredTerm
modified: 2014-11-26T14:18:57+01:00
created: 2014-01-15T14:54:24+01:00
status: 1

parement d'image sacrée
type: SimpleNonPreferredTerm
modified: 2014-11-26T14:18:57+01:00
created: 2014-01-15T14:54:24+01:00
status: 1

attribut d'image sacrée
type: PreferredTerm
modified: 2014-11-26T14:18:57+01:00
created: 2014-01-15T14:54:24+01:00
status: 1

parement d'icône
type: SimpleNonPreferredTerm
modified: 2014-11-26T14:18:57+01:00
created: 2014-01-15T14:54:24+01:00
status: 1

auréole de statue
type: SimpleNonPreferredTerm
modified: 2014-11-26T14:18:57+01:00
created: 2014-01-15T14:54:24+01:00
status: 1

sceptre d'image sacrée
type: SimpleNonPreferredTerm
modified: 2014-11-26T14:18:57+01:00
created: 2014-01-15T14:54:24+01:00
status: 1

revêtement d'image sacrée
type: SimpleNonPreferredTerm
modified: 2014-11-26T14:18:57+01:00
created: 2014-01-15T14:54:24+01:00
status: 1

parement de tableau
type: SimpleNonPreferredTerm
modified: 2014-11-26T14:18:57+01:00
created: 2014-01-15T14:54:24+01:00
status: 1

parure de tableau
type: SimpleNonPreferredTerm
modified: 2014-11-26T14:18:57+01:00
created: 2014-01-15T14:54:24+01:00
status: 1

machine à épurer par filtration
type: Concept
modified: 2015-10-15T14:26:34+02:00
in scheme: Thésaurus de la désignation des objets mobiliers
broader: machine à épurer
alternative label: filtre-tambour
alternative label: filtre vibrant
alternative label: filtre-presse
alternative label: filtre rotatif
created: 2012-05-16T00:00:00+02:00
definition: Machine à épurer un fluide (liquide, gaz) au moyen d'un filtre.
status: 1
narrow match: Filtre-presse

machine à épurer
type: PreferredTerm
modified: 2015-10-15T12:39:03+02:00
created: 2014-01-15T14:54:24+01:00
status: 1

machine à épurer par gravité
type: Concept
modified: 2015-09-23T16:33:21+02:00
in scheme: Thésaurus de la désignation des objets mobiliers
broader: machine à épurer
alternative label: trieur hélicoïdal
alternative label: trieur toboggan
created: 2012-05-16T00:00:00+02:00
definition: Machine à épurer un matériau ou un produit en jouant sur le degré de densité de ses composants.
status: 1

machine à épurer mécaniquement
type: Concept
modified: 2015-10-15T14:22:30+02:00
in scheme: Thésaurus de la désignation des objets mobiliers
broader: machine à épurer
alternative label: séparateur densimétrique
alternative label: séparateur à disques
alternative label: granosichter
alternative label: épierreuse
alternative label: séparateur granulométrique
alternative label: séparateur-aspirateur
alternative label: échardonneuse
alternative label: épierreur
alternative label: séparateur pneumatique
created: 2012-05-16T00:00:00+02:00
definition: Machine à épurer un matériau ou un produit par un procédé mécanique.
status: 1
narrow match: http://vocab.getty.edu/aat/300023114

machine à épurer chimiquement
type: Concept
modified: 2015-10-15T12:47:53+02:00
in scheme: Thésaurus de la désignation des objets mobiliers
broader: machine à épurer
alternative label: carboniseuse
alternative label: séparateur
created: 2012-05-16T00:00:00+02:00
definition: Machine à épurer un matériau ou un produit par un procédé chimique.
status: 1
narrow match: Séparateur à air
narrow match: cb11982504r

machine à désassembler
type: PreferredTerm
modified: 2014-01-10T00:00:00+01:00
created: 2014-01-15T14:54:24+01:00
status: 1

armoire à bannières
type: Concept
modified: 2014-12-01T15:34:51+01:00
in scheme: Thésaurus de la désignation des objets mobiliers
preferred label: banner cupboards @en-us
preferred label: armadio per stendardi processionali @it
preferred label: armário para bandeiras @pt
broader: meuble de rangement pour objets, linges et vêtements du culte
created: 2012-05-16T00:00:00+02:00
related: bannière de procession
definition: Meuble destiné à ranger les bannières de l'église. Certaines sont hautes et étroites, posées au sol, et peuvent contenir une disposition interne adaptée à leur fonction. D'autres, suspendues et peu profondes, comportent une ouverture dans la partie inférieure pour laisser dépasser les hampes.
TermeAssocie: bannière de procession
status: 1

armoire à bannières
type: PreferredTerm
modified: 2014-12-01T15:34:51+01:00
created: 2014-01-15T14:54:24+01:00
status: 1

porte-viandes
type: Concept
modified: 2014-12-05T10:16:40+01:00
in scheme: Thésaurus de la désignation des objets mobiliers
preferred label: meat racks @en-us
broader: rangement lié à l'alimentation
alternative label: crochet à viande
created: 2012-05-16T00:00:00+02:00
definition: Elément d’applique ou de milieu, en bois ou en fer, servant à suspendre ou poser les viandes et les charcuteries, placé éventuellement dans la cheminée et, dans ce cas, servant également à les fumer.
status: 1
broad match: http://vocab.getty.edu/aat/300197577

crochet à viande
type: SimpleNonPreferredTerm
modified: 2014-12-05T10:16:40+01:00
created: 2014-01-15T14:54:24+01:00
status: 1

porte-viandes
type: PreferredTerm
modified: 2014-12-05T10:16:40+01:00
created: 2014-01-15T14:54:24+01:00
status: 1

tableau
type: PreferredTerm
modified: 2014-12-03T16:32:15+01:00
created: 2014-01-15T14:54:24+01:00
status: 1

tableau de chevalet
type: SimpleNonPreferredTerm
modified: 2014-12-03T16:32:15+01:00
created: 2014-01-15T14:54:24+01:00
status: 1

retable des fonts baptismaux
type: Concept
modified: 2014-12-02T12:23:10+01:00
in scheme: Thésaurus de la désignation des objets mobiliers
preferred label: pala del fonte battesimale @it
preferred label: baptistery retables @en-us
preferred label: retábulo de baptistério @pt
broader: meuble lié aux sacrements autres que l'Eucharistie
created: 2012-05-16T00:00:00+02:00
related: tableau
definition: Structure comportant, dans la plupart des cas, une représentation du Baptême du Christ placée dans un cadre près des fonts baptismaux.
TermeAssocie: tableau
status: 1

dessus-de-baie
type: PreferredTerm
modified: 2015-01-07T16:27:24+01:00
created: 2014-01-15T14:54:24+01:00
status: 1

parc d'enfant
type: PreferredTerm
modified: 2014-10-10T17:16:14+02:00
created: 2014-01-15T14:54:24+01:00
status: 1

bibliothèque en table
type: PreferredTerm
modified: 2014-12-04T16:40:33+01:00
created: 2014-01-15T14:54:24+01:00
status: 1

machine à éplucher
type: Concept
modified: 2015-10-14T10:20:04+02:00
in scheme: Thésaurus de la désignation des objets mobiliers
broader: machine à séparer des solides
created: 2012-05-16T00:00:00+02:00
definition: Machine servant à enlever la peau ou les parties non comestibles des denrées alimentaires.
status: 1
narrow match: Éplucheuse à pommes de terre

machine à séparer des solides
type: PreferredTerm
modified: 2015-08-12T12:46:02+02:00
created: 2014-01-15T14:54:24+01:00
status: 1

machine à séparer
type: Concept
modified: 2015-10-09T12:01:57+02:00
in scheme: Thésaurus de la désignation des objets mobiliers
narrower: machine à séparer des solides
narrower: machine à extraire des fluides
narrower: T69-5577
broader: machine à dissocier
created: 2012-05-16T00:00:00+02:00
definition: Machine à dissocier les différents composants d'un matériau ou d'un produit pour n'en garder que les éléments utiles.
status: 1

machine à désagréger
type: Concept
modified: 2014-01-10T00:00:00+01:00
in scheme: Thésaurus de la désignation des objets mobiliers
broader: machine à séparer des solides
created: 2012-05-16T00:00:00+02:00
definition: Machine à séparer des solides par une action physico-chimique.
status: 1

pompe centrifuge
type: SimpleNonPreferredTerm
modified: 2015-10-14T14:59:45+02:00
created: 2014-01-15T14:54:24+01:00
status: 1

pompe rotative
type: SimpleNonPreferredTerm
modified: 2015-10-14T14:59:45+02:00
created: 2014-01-15T14:54:24+01:00
status: 1

véhicule de lutte contre l'incendie
type: Concept
modified: 2014-12-30T12:12:21+01:00
in scheme: Thésaurus de la désignation des objets mobiliers
preferred label: firefighting vehicles @en-us
broader: véhicule terrestre spécialisé motorisé ou non
alternative label: pompe à incendie
alternative label: camion de pompier
alternative label: véhicule échelle
alternative label: véhicule moto-pompe
created: 2013-11-06T00:00:00+01:00
related: machine à pomper
definition: Véhicule doté d'équipements nécessaires à la lutte contre le feu (pompe, réservoir, échelle, lance à incendie, etc.) et le plus souvent peint en rouge.
TermeAssocie: machine à pomper
status: 1

machine à pomper
type: PreferredTerm
modified: 2015-10-14T14:59:45+02:00
created: 2014-01-15T14:54:24+01:00
status: 1

pompe
type: SimpleNonPreferredTerm
modified: 2015-10-14T14:59:45+02:00
created: 2014-01-15T14:54:24+01:00
status: 1

bélier hydraulique
type: SimpleNonPreferredTerm
modified: 2015-10-14T14:59:45+02:00
created: 2014-01-15T14:54:24+01:00
status: 1

jupe
type: Concept
modified: 2014-12-11T16:43:03+01:00
in scheme: Thésaurus de la désignation des objets mobiliers
preferred label: skirts (garments) @en-us
broader: vêtement d'intérieur ou d'extérieur
created: 2012-05-16T00:00:00+02:00
definition: Vêtement, principalement féminin, qui enserre la taille et descend plus ou moins bas, couvrant tout ou une partie du bas du corps sans division pour chaque jambe.
status: 1

jupe
type: PreferredTerm
modified: 2014-12-11T16:43:03+01:00
created: 2014-01-15T14:54:24+01:00
status: 1

trousse à rasoirs
type: SimpleNonPreferredTerm
modified: 2014-12-10T16:41:31+01:00
created: 2014-01-15T14:54:24+01:00
status: 1

boîte à rasoirs
type: PreferredTerm
modified: 2014-12-10T16:41:31+01:00
created: 2014-01-15T14:54:24+01:00
status: 1

groupe sculpté de procession
type: Concept
modified: 2014-11-28T12:40:07+01:00
in scheme: Thésaurus de la désignation des objets mobiliers
preferred label: gruppo scultoreo processionale @it
preferred label: processional sculptural groups @en-us
preferred label: grupo escultório processional @pt
broader: objet lié à la procession
created: 2012-05-16T00:00:00+02:00
related: groupe sculpté
definition: Réunion d'au moins deux figures en ronde-bosse sur un même support, ayant une unité iconographique et dont la fonction est cultuelle (accompagnement d'une procession).
TermeAssocie: groupe sculpté
status: 1
broad match: http://vocab.getty.edu/aat/300047090

groupe sculpté de procession
type: PreferredTerm
modified: 2014-11-28T12:40:07+01:00
created: 2014-01-15T14:54:24+01:00
status: 1

groupe sculpté
type: Concept
modified: 2014-12-04T10:29:20+01:00
in scheme: Thésaurus de la désignation des objets mobiliers
broader: ronde-bosse
created: 2012-05-16T00:00:00+02:00
scope note: Préciser dans le champ STRU si le groupe est relié (une base commune en fait un tout indissociable), ou non relié (les figures ont des bases distinctes mais un même support). On peut indiquer dans le champ PDEN groupe sculpté d'applique.
related: groupe sculpté de procession
definition: Réunion de deux ou plusieurs figures en ronde-bosse sur un même support (socle, soubassement, piédestal).
TermeAssocie: groupe sculpté de procession
status: 1
broad match: http://data.bnf.fr/ark:/12148/cb16745166f
broad match: http://vocab.getty.edu/aat/300047264
broad match: Ronde-bosse

siège liturgique protestant
type: Concept
modified: 2014-01-10T00:00:00+01:00
in scheme: Thésaurus de la désignation des objets mobiliers
narrower: chaise de temple
narrower: banc de temple
narrower: fauteuil de temple
narrower: tabouret de temple
narrower: stalle de temple
broader: meuble du culte protestant
created: 2012-05-16T00:00:00+02:00
definition: Siège placé dans un temple et destiné soit aux célébrants ou aux membres du conseil paroissial, soit aux fidèles.
status: 1

banc de temple
type: Concept
modified: 2014-01-10T00:00:00+01:00
in scheme: Thésaurus de la désignation des objets mobiliers
broader: siège liturgique protestant
alternative label: banc pastoral
alternative label: banc des diacres
alternative label: banc des Anciens
created: 2012-05-16T00:00:00+02:00
scope note: Banc des diacres, banc des Anciens, Parquet ou banc pastoral sont des termes à utiliser dans le champ PDEN.
related: stalle de temple
definition: Le banc de temple peut être un banc de fidèles, placé dans la nef en face de la table sainte. Ces bancs sont parfois séparés de la table par une balustrade ou une barrière (clôture de chœur protestante). Il peut s'agir également d'un banc des diacres, placé près de la chaire pastorale et destiné aux diacres qui ont pour fonction de recueillir l'argent et de le distribuer auxœuvres ou d'un banc des Anciens, proche du précédent et destiné aux membres du Conseil paroissial. On désigne sous le terme de Parquet l'ensemble formé par ces derniers bancs. Enfin, il peut s'agir d'un banc destiné au pasteur ou à sa famille ou banc pastoral.
TermeAssocie: stalle de temple
status: 1

siège liturgique protestant
type: PreferredTerm
modified: 2014-01-10T00:00:00+01:00
created: 2014-01-15T14:54:24+01:00
status: 1

fauteuil de temple
type: Concept
modified: 2014-01-10T00:00:00+01:00
in scheme: Thésaurus de la désignation des objets mobiliers
broader: siège liturgique protestant
created: 2012-05-16T00:00:00+02:00
definition: Fauteuil, parfois d'origine civile, utilisé dans l'enceinte du temple.
status: 1

tabouret de temple
type: Concept
modified: 2014-01-10T00:00:00+01:00
in scheme: Thésaurus de la désignation des objets mobiliers
broader: siège liturgique protestant
created: 2012-05-16T00:00:00+02:00
definition: Forme que peut prendre parfois, dans un temple, le siège destiné aux officiants ou aux fidèles.
status: 1

stalle de temple
type: Concept
modified: 2014-01-10T00:00:00+01:00
in scheme: Thésaurus de la désignation des objets mobiliers
broader: siège liturgique protestant
alternative label: stalle pastorale
created: 2012-05-16T00:00:00+02:00
scope note: Utiliser les termes en italique dans le champ PDEN.
related: banc de temple
definition: Stalle utilisée dans un temple pour asseoir les fidèles ou des conseillers presbytéraux. Elle est destinée parfois au pasteur et entourée d'une grille de bois ou clayette qui la ferme complètement ou munie d'un petit toit. Elle peut être à une ou deux places voire plus quand elle est destinée à la famille du pasteur tout entière.
TermeAssocie: banc de temple
status: 1

machine à matricer
type: PreferredTerm
modified: 2015-08-13T16:36:33+02:00
created: 2014-01-15T14:54:24+01:00
status: 1

marteau-pilon à planche
type: SimpleNonPreferredTerm
modified: 2015-08-13T16:36:33+02:00
created: 2014-01-15T14:54:24+01:00
status: 1

presse à friction
type: SimpleNonPreferredTerm
modified: 2015-08-13T16:36:33+02:00
created: 2014-01-15T14:54:24+01:00
status: 1

meuble lié aux coutumes et cultes domestiques
type: PreferredTerm
modified: 2014-10-13T13:38:54+02:00
created: 2014-01-15T14:54:24+01:00
status: 1

pupitre à lire
type: Concept
modified: 2014-12-05T11:23:55+01:00
in scheme: Thésaurus de la désignation des objets mobiliers
preferred label: reading desks @en-us
broader: pupitre
created: 2012-05-16T00:00:00+02:00
definition: Pupitre réservé à la lecture. Il est unique, double ou triple ou encore à roue.
status: 1

pupitre à lire
type: PreferredTerm
modified: 2014-12-05T11:23:55+01:00
created: 2014-01-15T14:54:24+01:00
status: 1

machine à découper par scie
type: Concept
modified: 2015-08-12T17:00:03+02:00
in scheme: Thésaurus de la désignation des objets mobiliers
broader: machine à découper
alternative label: scie alternative
alternative label: scie circulaire
alternative label: scie à ruban
alternative label: scie à lame circulaire
alternative label: scie radiale
alternative label: scie à lame droite
created: 2012-05-16T00:00:00+02:00
definition: Machine à découper un produit à l'aide d'une lame ou d'un ruban d'acier à dents tranchantes.
status: 1
narrow match: Scie circulaire
narrow match: http://vocab.getty.edu/aat/300023996

scie à ruban
type: SimpleNonPreferredTerm
modified: 2015-08-12T17:00:03+02:00
created: 2014-01-15T14:54:24+01:00
status: 1

scie circulaire
type: SimpleNonPreferredTerm
modified: 2015-08-12T17:00:03+02:00
created: 2014-01-15T14:54:24+01:00
status: 1

scie à lame droite
type: SimpleNonPreferredTerm
modified: 2015-08-12T17:00:03+02:00
created: 2014-01-15T14:54:24+01:00
status: 1

scie radiale
type: SimpleNonPreferredTerm
modified: 2015-08-12T17:00:03+02:00
created: 2014-01-15T14:54:24+01:00
status: 1

scie alternative
type: SimpleNonPreferredTerm
modified: 2015-08-12T17:00:03+02:00
created: 2014-01-15T14:54:24+01:00
status: 1

machine à découper par scie
type: PreferredTerm
modified: 2015-08-12T17:00:03+02:00
created: 2014-01-15T14:54:24+01:00
status: 1

scie à lame circulaire
type: SimpleNonPreferredTerm
modified: 2015-08-12T17:00:03+02:00
created: 2014-01-15T14:54:24+01:00
status: 1

chapier
type: Concept
modified: 2014-12-01T15:40:50+01:00
in scheme: Thésaurus de la désignation des objets mobiliers
preferred label: mobile per pivali @it
preferred label: cope chest @en-us
preferred label: móvel para capas @pt
broader: meuble de rangement pour objets, linges et vêtements du culte
alternative label: chapier-commode
alternative label: chapier-armoire
alternative label: chapier-coffre
created: 2012-05-16T00:00:00+02:00
definition: Meuble destiné au rangement des chapes et souvent de l'ornement complet dont la forme varie suivant que les textiles sont suspendus, pliés ou posés à plat.
status: 1

meuble de rangement pour objets, linges et vêtements du culte
type: PreferredTerm
modified: 2014-12-01T15:30:17+01:00
created: 2014-01-15T14:54:24+01:00
status: 1

meuble de sacristie
type: Concept
modified: 2014-12-01T15:47:57+01:00
in scheme: Thésaurus de la désignation des objets mobiliers
preferred label: mobilia da sacrestia @it
preferred label: sacristy furniture @en-us
preferred label: móvel de sacristia @pt
broader: meuble de rangement pour objets, linges et vêtements du culte
alternative label: coffre de sacristie
alternative label: armoire de sacristie-chasublier
alternative label: armoire de sacristie-chapier
alternative label: armoire de sacristie
alternative label: table de sacristie
alternative label: placard de sacristie
created: 2012-05-16T00:00:00+02:00
definition: Meuble ou association de meubles placé dans la sacristie d'une église et servant à ranger les objets du culte ainsi que les vêtements, linges, garnitures, etc. ou à d'autres fonctions liturgiques. Il peut être accompagné d'un confessionnal, d'un prie-Dieu de sacristie, etc.
status: 1

chasublier
type: Concept
modified: 2014-12-01T15:44:29+01:00
in scheme: Thésaurus de la désignation des objets mobiliers
preferred label: vestment cases @en-us
preferred label: paratoio @it
preferred label: móvel para casulas @pt
broader: meuble de rangement pour objets, linges et vêtements du culte
alternative label: commode de sacristie
created: 2012-05-16T00:00:00+02:00
definition: Meuble à tablettes coulissantes ou tiroirs destiné au rangement à plat des chasubles et autres vêtements liturgiques.
status: 1

siège d'aisances
type: Concept
modified: 2014-12-04T12:36:46+01:00
in scheme: Thésaurus de la désignation des objets mobiliers
preferred label: commode chairs @en-us
broader: meuble d'hygiène
alternative label: chaise d'aisances
alternative label: fauteuil d'aisances
alternative label: tabouret d'aisances
created: 2012-05-16T00:00:00+02:00
related: pot de siège d'aisances
definition: Siège à cuvette servant aux nécessités. La cuvette est dans une caisse généralement de bois, parfois doublée de plaques d'étain. La caisse est carrée, circulaire ou rectangulaire, montée sur pieds et contient un récipient circulaire en métal, en faïence ou même en cuir, le seau d'aisances, placé sous un plateau de bois percé d'un trou ou sous un cercle de bois (la lunette) et fermé par un couvercle.
TermeAssocie: pot de siège d'aisances
status: 1

pot de siège d'aisances
type: PreferredTerm
modified: 2014-12-10T16:58:05+01:00
created: 2014-01-15T14:54:24+01:00
status: 1

coffre de communauté laïque
type: Concept
modified: 2014-10-13T10:48:03+02:00
in scheme: Thésaurus de la désignation des objets mobiliers
broader: coffre
created: 2012-05-16T00:00:00+02:00
related: coffre de confrérie, de congrégation ou de fabrique
definition: Coffre appartenant à un groupe religieux, civil ou professionnel, servant à mettre des archives ou des dons en nature, et comportant plusieurs serrures commandées par des clefs différentes, de façon à ce que le contenu ne puisse être retiré qu'en présence de plusieurs responsables.
TermeAssocie: coffre de confrérie, de congrégation ou de fabrique
status: 1
broad match: http://vocab.getty.edu/aat/300038992
broad match: cb13162914n
broad match: Coffre

coffre de communauté laïque
type: PreferredTerm
modified: 2014-10-13T10:48:03+02:00
created: 2014-01-15T14:54:24+01:00
status: 1

litre
type: Concept
modified: 2015-02-24T12:46:00+01:00
in scheme: Thésaurus de la désignation des objets mobiliers
preferred label: armorial bearings funeral strips @en-us
broader: monument
alternative label: litre funéraire
created: 2012-05-16T00:00:00+02:00
definition: Bande horizontale peinte, ou plus rarement sculptée, sur les élévations intérieures, parfois extérieures, d'une église et portant des armoiries. La litre a généralement un caractère funéraire ; le fond en est alors noir.
status: 1
broad match: http://vocab.getty.edu/aat/300006958

monument aux morts
type: Concept
modified: 2015-02-24T13:02:57+01:00
in scheme: Thésaurus de la désignation des objets mobiliers
preferred label: war memorials @en-us
narrower: tableau commémoratif des morts
broader: monument
created: 2012-05-16T00:00:00+02:00
scope note: Voir aussi le Thesaurus de la désignation des œuvres architecturales et des espaces aménagés.
related match: T96-191
definition: Monument élevé en l'honneur des victimes d'un conflit ou d'une catastrophe.
status: 1

croix de consécration
type: Concept
modified: 2015-02-24T12:43:53+01:00
in scheme: Thésaurus de la désignation des objets mobiliers
preferred label: consecration crosses @en-us
preferred label: croce di consacrazione @it
broader: monument
created: 2012-05-16T00:00:00+02:00
related: chandelier de consécration
definition: L’une des douze croix gravées, sculptées ou peintes sur les murs, les colonnes ou les piliers d'une église consacrée et destinées à perpétuer le souvenir des croix tracées par le prélat consécrateur pendant la cérémonie de dédicace.
TermeAssocie: chandelier de consécration
status: 1

monument commémoratif
type: SimpleNonPreferredTerm
modified: 2015-02-24T12:36:55+01:00
created: 2014-01-15T14:54:24+01:00
status: 1

monument
type: PreferredTerm
modified: 2015-02-24T12:36:55+01:00
created: 2014-01-15T14:54:24+01:00
status: 1

récipient à illusion
type: Concept
modified: 2014-10-16T14:50:51+02:00
in scheme: Thésaurus de la désignation des objets mobiliers
broader: objet décoratif ou de rangement ou pour les plantes et les fleurs
alternative label: plat à illusion
alternative label: assiette à illusion
created: 2012-05-16T00:00:00+02:00
definition: Récipient en céramique dont le contenu, dans le même matériau, tend à imiter des aliments, des végétaux ou des animaux.
status: 1

assiette à illusion
type: SimpleNonPreferredTerm
modified: 2014-10-16T14:50:51+02:00
created: 2014-01-15T14:54:24+01:00
status: 1

plat à illusion
type: SimpleNonPreferredTerm
modified: 2014-10-16T14:50:51+02:00
created: 2014-01-15T14:54:24+01:00
status: 1

récipient à illusion
type: PreferredTerm
modified: 2014-10-16T14:50:51+02:00
created: 2014-01-15T14:54:24+01:00
status: 1

bateau de plaisance
type: Concept
modified: 2014-12-19T12:06:51+01:00
in scheme: Thésaurus de la désignation des objets mobiliers
preferred label: competition and recreation craft @en-us
narrower: bateau de promenade
narrower: bateau de compétition
narrower: bateau de loisirs sportifs
narrower: bateau de croisière
narrower: engin de plage
broader: bateau
created: 2012-05-16T00:00:00+02:00
definition: Bateau destiné à la pratique du sport ou des loisirs sur l'eau.
status: 1
narrow match: cb11958306q

bateau de plaisance
type: PreferredTerm
modified: 2014-12-19T12:06:51+01:00
created: 2014-01-15T14:54:24+01:00
status: 1

bateau de promenade
type: Concept
modified: 2014-12-19T12:02:36+01:00
in scheme: Thésaurus de la désignation des objets mobiliers
preferred label: excursion boats @en-us
broader: bateau de plaisance
alternative label: voilier de promenade
alternative label: vedette de promenade
created: 2012-05-16T00:00:00+02:00
definition: Bateau utilisé pour des sorties de quelques heures avec des groupes.
status: 1
broad match: cb11953087h

bateau de compétition
type: Concept
modified: 2014-12-19T12:04:34+01:00
in scheme: Thésaurus de la désignation des objets mobiliers
preferred label: competition craft @en-us
broader: bateau de plaisance
alternative label: voilier de régate
alternative label: vedette de compétition
created: 2012-05-16T00:00:00+02:00
definition: Bateau conçu, aménagé et homologué, pour des épreuves officielles ou spécifiques.
status: 1
broad match: cb11953087h

bateau de loisirs sportifs
type: Concept
modified: 2014-12-19T11:59:19+01:00
in scheme: Thésaurus de la désignation des objets mobiliers
preferred label: water sports equipment @en-us
broader: bateau de plaisance
alternative label: kayak
alternative label: yole
alternative label: planche de surf
alternative label: planche à voile
alternative label: canoë
alternative label: périssoire
created: 2012-05-16T00:00:00+02:00
definition: Bateau non habitable, d'eaux abritées, à usage sportif dont la propulsion est assurée par l'homme au moyen de rames, de pagaie ou d'avirons.
status: 1

bateau de croisière
type: Concept
modified: 2014-12-19T11:53:17+01:00
in scheme: Thésaurus de la désignation des objets mobiliers
preferred label: yachts @en-us
broader: bateau de plaisance
alternative label: yacht à moteur
alternative label: yacht à voiles
created: 2012-05-16T00:00:00+02:00
definition: Bateau habitable, à voile ou à moteur, conçu ou aménagé pour la croisière privée.
status: 1

engin de plage
type: Concept
modified: 2014-10-16T09:49:05+02:00
in scheme: Thésaurus de la désignation des objets mobiliers
broader: bateau de plaisance
alternative label: scooter des mers
alternative label: hydrojet
alternative label: ski nautique
alternative label: pédalo
created: 2012-05-16T00:00:00+02:00
definition: Tout engin flottant qui, sans être un bateau, est conçu pour le loisir à proximité des rivages, éventuellement muni d'un appareil propulsif léger.
status: 1
broad match: Catégorie:Bateau de plaisance

matériel de transport aéronautique
type: Concept
modified: 2014-10-14T15:30:08+02:00
in scheme: Thésaurus de la désignation des objets mobiliers
preferred label: air and space transportation vehicles @en-us
narrower: aéronef
narrower: véhicule de la recherche spatiale
narrower: T69-9017
broader: moyen de transport
created: 2013-11-06T00:00:00+01:00
definition: Véhicule ou matériel destiné au transport dans les airs et par extension dans l'espace.
status: 1

matériel de transport terrestre
type: Concept
modified: 2014-10-16T11:02:55+02:00
in scheme: Thésaurus de la désignation des objets mobiliers
preferred label: land vehicles @en-us
narrower: véhicule terrestre motorisé
narrower: véhicule terrestre spécialisé motorisé ou non
narrower: T69-8850
narrower: T69-8864
broader: moyen de transport
created: 2013-11-05T00:00:00+01:00
definition: Véhicule ou matériel destiné au transport terrestre, ne nécessitant pas nécessairement d'infrastructure spécialisée.
status: 1

moyen de transport
type: PreferredTerm
modified: 2014-10-14T15:28:07+02:00
created: 2014-01-15T14:54:24+01:00
status: 1

jeu de timbres
type: Concept
modified: 2014-10-10T13:36:14+02:00
in scheme: Thésaurus de la désignation des objets mobiliers
preferred label: glockenspiels @en-us
broader: idiophone à émission par percussion directe
alternative label: carillon portable à lames
alternative label: glockenspiel
alternative label: jeu de timbre à clavier
alternative label: lyre militaire
created: 2012-05-16T00:00:00+02:00
related: baguette
definition: Instrument formé de barres métalliques de longueur croissante et disposées comme sur un xylophone. On en joue avec des baguettes. Certains disposent d'un clavier.
TermeAssocie: baguette
status: 1

baguette
type: PreferredTerm
modified: 2014-10-10T11:22:10+02:00
created: 2014-01-15T14:54:24+01:00
status: 1

mailloche
type: SimpleNonPreferredTerm
modified: 2014-10-10T11:22:10+02:00
created: 2014-01-15T14:54:24+01:00
status: 1

relique
type: PreferredTerm
modified: 2014-11-27T10:39:16+01:00
created: 2014-01-15T14:54:24+01:00
status: 1

dessus-de-fenêtre
type: PreferredTerm
modified: 2015-01-07T17:07:57+01:00
created: 2014-01-15T14:54:24+01:00
status: 1

tour à sertir
type: SimpleNonPreferredTerm
modified: 2015-10-08T14:34:16+02:00
created: 2014-01-15T14:54:24+01:00
status: 1

presse à sertir
type: SimpleNonPreferredTerm
modified: 2015-10-08T14:34:16+02:00
created: 2014-01-15T14:54:24+01:00
status: 1

machine à sertir
type: PreferredTerm
modified: 2015-10-08T14:34:16+02:00
created: 2014-01-15T14:54:24+01:00
status: 1

fontaine intermittente
type: SimpleNonPreferredTerm
modified: 2014-12-15T14:16:02+01:00
created: 2014-01-15T14:54:24+01:00
status: 1

instrument de démonstration en dynamique des fluides
type: PreferredTerm
modified: 2014-12-15T14:16:02+01:00
created: 2014-01-15T14:54:24+01:00
status: 1

polissoir
type: Concept
modified: 2014-05-27T17:10:25+02:00
in scheme: Thésaurus de la désignation des objets mobiliers
broader: matériel archéologique
created: 2014-05-27T17:09:24+02:00
definition: Ouvrage généralement de pierre dure ou tendre, propre à abraser ou polir la surface rugueuse d'un outil préhistorique.
status: 1

polissoir
type: PreferredTerm
modified: 2014-05-27T17:10:25+02:00
created: 2014-01-15T14:54:24+01:00
status: 1

alcôve
type: Concept
modified: 2015-01-16T16:48:02+01:00
in scheme: Thésaurus de la désignation des objets mobiliers
preferred label: alcoves @en-us
broader: divisions architecturales
created: 2012-05-16T00:00:00+02:00
definition: Dans une chambre, l'alcôve est un renfoncement qui reçoit un lit de parade ou de repos.
status: 1

alcôve
type: PreferredTerm
modified: 2015-01-16T16:48:02+01:00
created: 2014-01-15T14:54:24+01:00
status: 1

fromager
type: Concept
modified: 2014-12-08T16:39:55+01:00
in scheme: Thésaurus de la désignation des objets mobiliers
broader: récipient pour le service ou la consommation des aliments
created: 2012-05-16T00:00:00+02:00
definition: Récipient ajouré, en terre cuite, posé sur de petits pieds et assorti d’un plateau, destiné à égoutter et servir le fromage frais. Il peut être circulaire, en forme d’assiette creuse, de cœur ou d’étoile.
status: 1

melonnière
type: SimpleNonPreferredTerm
modified: 2014-10-17T10:55:00+02:00
created: 2014-01-15T14:54:24+01:00
status: 1

coupe à glace
type: Concept
modified: 2014-10-17T11:07:57+02:00
in scheme: Thésaurus de la désignation des objets mobiliers
broader: récipient pour le service ou la consommation des aliments
created: 2012-05-16T00:00:00+02:00
definition: Récipient généralement en verre ou en métal, hémisphérique, sur pied plus ou moins haut, pour le service et la consommation d'un dessert glacé.
status: 1

porte-dîner
type: Concept
modified: 2014-12-08T16:57:19+01:00
in scheme: Thésaurus de la désignation des objets mobiliers
broader: récipient pour le service ou la consommation des aliments
alternative label: boîte des champs
alternative label: porte-manger
alternative label: écuelle des champs
alternative label: pot des champs
alternative label: porte-soupe
created: 2012-05-16T00:00:00+02:00
definition: Récipient simple, double ou triple, en bois, métal ou terre cuite, servant à transporter et consommer les aliments à l'extérieur de la maison. Le porte-dîner, circulaire, à fond plat, est muni d'une ou deux anses, articulées ou non par des brides. Le couvercle, une fois retourné, peut servir d'assiette.
status: 1
broad match: cb13184671j

drageoir
type: Concept
modified: 2014-12-08T16:37:46+01:00
in scheme: Thésaurus de la désignation des objets mobiliers
preferred label: comfit boxes @en-us
broader: récipient pour le service ou la consommation des aliments
alternative label: bonbonnière de poche
alternative label: boîte à bergamote
alternative label: drageoir de poche
alternative label: bonbonnière
created: 2012-05-16T00:00:00+02:00
related: pelle de service
definition: Récipient couvert, pour le service des dragées, confitures sèches et sucreries. Circulaire, généralement porté par un haut pied et posé sur un plateau ou un présentoir, le drageoir peut être accompagné de cuillers ou de petites pelles de service. La bonbonnière, plus petite, n'a pas de pied.
TermeAssocie: pelle de service
status: 1

confiturier
type: Concept
modified: 2014-12-08T16:34:01+01:00
in scheme: Thésaurus de la désignation des objets mobiliers
preferred label: jam pots @en-us
broader: récipient pour le service ou la consommation des aliments
alternative label: drageoir-confiturier
alternative label: plateau à deux pots de confiture
alternative label: plateau à trois pots de confiture
created: 2012-05-16T00:00:00+02:00
definition: Récipient couvert, en métal, céramique ou verre, pour le service des confitures. A fond plat et sans anses, il peut être posé ou fixé sur un plateau ou monté sur un pied, le couvercle peut être alors muni d'une encoche pour une cuiller. Il peut également se présenter sous forme de pots tronconiques ou d’un réceptacle dans lequel les cuillers sont disposées verticalement.
status: 1

plateau à huitres
type: SimpleNonPreferredTerm
modified: 2014-10-17T10:55:00+02:00
created: 2014-01-15T14:54:24+01:00
status: 1

légumier
type: Concept
modified: 2014-12-08T16:47:43+01:00
in scheme: Thésaurus de la désignation des objets mobiliers
preferred label: vegetable dishes @en-us
broader: récipient pour le service ou la consommation des aliments
created: 2012-05-16T00:00:00+02:00
definition: Récipient bas, couvert, en terre cuite, argent ou métal argenté, pour servir les légumes cuits. Généralement circulaire, à fond plat ou sur pied bas et à anses latérales horizontales, il peut être posé sur un plateau ou un présentoir assortis et indépendants. Il est souvent assorti à la soupière.
status: 1

porte-moutardier
type: SimpleNonPreferredTerm
modified: 2014-10-17T10:55:00+02:00
created: 2014-01-15T14:54:24+01:00
status: 1

soupière
type: Concept
modified: 2014-12-10T13:13:20+01:00
in scheme: Thésaurus de la désignation des objets mobiliers
preferred label: tureens @en-us
broader: récipient pour le service ou la consommation des aliments
alternative label: soupière-terrine
alternative label: pot à oille
created: 2012-05-16T00:00:00+02:00
scope note: Indiquer pot à oille, soupière-terrine dans le champ PDEN. La soupière, plus grande que le légumier, lui est souvent assortie et peut faire partie d'un surtout.
related: surtout de table
related: présentoir
definition: Récipient, généralement circulaire, pour le service du potage. Parfois individuel, il est couvert et composé de terre cuite ou de métal. Il comporte deux anses latérales horizontales et un ou plusieurs pieds. Une louche et un plateau ou un présentoir l’accompagnent généralement.
TermeAssocie: surtout de table
TermeAssocie: présentoir
status: 1

oeufrier
type: SimpleNonPreferredTerm
modified: 2014-10-17T10:55:00+02:00
created: 2014-01-15T14:54:24+01:00
status: 1

poivrière saupoudreuse
type: Concept
modified: 2014-10-17T11:23:58+02:00
in scheme: Thésaurus de la désignation des objets mobiliers
preferred label: pepper shakers @en-us
broader: récipient pour le service ou la consommation des aliments
alternative label: saupoudreuse à poivre
created: 2012-05-16T00:00:00+02:00
definition: Petite saupoudreuse à poivre, en bois, métal ou céramique, à haut couvercle percé d'un trou. Elle est généralement assortie à une salière saupoudreuse.
status: 1

cloche à fromage
type: Concept
modified: 2014-10-17T11:01:54+02:00
in scheme: Thésaurus de la désignation des objets mobiliers
preferred label: cheese dishes @en-us
broader: récipient pour le service ou la consommation des aliments
created: 2012-05-16T00:00:00+02:00
definition: Haut couvercle bombé en céramique, cristal ou verre, posé sur un plat ou un plateau circulaire, dans le même matériau ou non, pour le service et la conservation des fromages.
status: 1

moutardier
type: Concept
modified: 2014-12-08T16:48:55+01:00
in scheme: Thésaurus de la désignation des objets mobiliers
preferred label: mustard pots @en-us
broader: récipient pour le service ou la consommation des aliments
created: 2012-05-16T00:00:00+02:00
related: cuiller
definition: Récipient couvert et muni d’une anse, en métal, céramique ou verre, pour le service de la moutarde. Fréquemment en forme de baril, de pichet ou de saupoudreuse sans ajours, il est accompagné d’une cuillère et d’un plateau assortis. Il peut être assorti à un huilier-vinaigrier, à une saupoudreuse (etc.) et faire partie d'un service à ingrédients ou d'un surtout.
TermeAssocie: cuiller
status: 1

huilier-vinaigrier
type: Concept
modified: 2014-12-08T16:42:33+01:00
in scheme: Thésaurus de la désignation des objets mobiliers
preferred label: cruet sets @en-us
broader: récipient pour le service ou la consommation des aliments
alternative label: porte huilier-vinaigrier
alternative label: bouteille à huile
alternative label: huilier-guédoufle
alternative label: bouteille à vinaigre
created: 2012-05-16T00:00:00+02:00
related: surtout de table
definition: Paire de petites bouteilles, brocs ou carafes en verre ou céramique, pour l'huile et le vinaigre, posés sur un plateau ou encastrés dans un récipient adapté ou dans une monture porte huilier-vinaigrier). Il peut être assorti à un moutardier, à une saupoudreuse (etc.) et faire partie d'un service à ingrédients ou d'un surtout.
TermeAssocie: surtout de table
status: 1

plateau à coquillages
type: SimpleNonPreferredTerm
modified: 2014-10-17T10:55:00+02:00
created: 2014-01-15T14:54:24+01:00
status: 1

présentoir à huîtres
type: SimpleNonPreferredTerm
modified: 2014-10-17T10:55:00+02:00
created: 2014-01-15T14:54:24+01:00
status: 1

coquetier
type: Concept
modified: 2014-12-08T16:35:03+01:00
in scheme: Thésaurus de la désignation des objets mobiliers
preferred label: eggcups @en-us
broader: récipient pour le service ou la consommation des aliments
created: 2012-05-16T00:00:00+02:00
definition: Petit récipient sur pied, dans lequel on dispose verticalement un œuf pour le manger. Le pied de certains coquetiers peut constituer, une fois retourné, un réceptacle pour y placer l'œuf horizontalement.
status: 1

assiette
type: Concept
modified: 2014-12-08T16:26:39+01:00
in scheme: Thésaurus de la désignation des objets mobiliers
preferred label: plates (dishes) @en-us
broader: récipient pour le service ou la consommation des aliments
alternative label: assiette creuse
alternative label: assiette à escargots
alternative label: assiette à l'italienne
alternative label: assiette à asperges
alternative label: assiette plate
alternative label: assiette de baptême
alternative label: assiette à rôti
alternative label: assiette à artichaut
alternative label: assiette à coquillages
alternative label: assiette à dessert
alternative label: assiette patronymique
alternative label: assiette à compartiments
alternative label: assiette-réchaud
alternative label: assiette à bouillie
alternative label: assiette d'accordailles
alternative label: assiette calotte
alternative label: assiette à salade
alternative label: assiette à œufs
created: 2012-05-16T00:00:00+02:00
definition: Récipient individuel plat, le plus souvent circulaire, composé d'un bassin, constitué par le fond entouré d'un talus, ou descente, généralement bordé par un marli, couronne horizontale ou oblique à contours variés et profil droit ou galbé. L’assiette peut être désignée par sa forme (assiette plate), sa destination (assiette à dessert), son décor (assiette de baptême). Une série d’assiettes peut faire partie d’un service.
status: 1

huilier
type: Concept
modified: 2014-12-08T16:41:06+01:00
in scheme: Thésaurus de la désignation des objets mobiliers
broader: récipient pour le service ou la consommation des aliments
alternative label: burette à huile
created: 2012-05-16T00:00:00+02:00
related: surtout de table
definition: Récipient verseur pour le service de l'huile, à fond plat ou sur un petit pied, muni d'un goulot ou d'un bec, avec ou sans anse.
TermeAssocie: surtout de table
status: 1

jatte
type: Concept
modified: 2014-12-08T16:46:54+01:00
in scheme: Thésaurus de la désignation des objets mobiliers
broader: récipient pour le service ou la consommation des aliments
alternative label: jatte en coquille
alternative label: jatte à fruits
alternative label: jatte à crème
alternative label: compotier
alternative label: compotier-coquille
created: 2012-05-16T00:00:00+02:00
related: surtout de table
related: jatte à punch
definition: Récipient pour le service des crèmes ou des compotes. La jatte se présente parfois sous la forme d’une coupe ou d’une coquille.
TermeAssocie: surtout de table
TermeAssocie: jatte à punch
status: 1

coquille
type: SimpleNonPreferredTerm
modified: 2014-10-17T10:55:00+02:00
created: 2014-01-15T14:54:24+01:00
status: 1

saucière
type: Concept
modified: 2014-12-10T13:07:29+01:00
in scheme: Thésaurus de la désignation des objets mobiliers
preferred label: sauceboats @en-us
broader: récipient pour le service ou la consommation des aliments
alternative label: saucière dégraisseuse
alternative label: saucière à bain-marie
created: 2012-05-16T00:00:00+02:00
definition: Récipient allongé, à fond arrondi, en terre cuite, argent ou métal argenté, pour le service des sauces. La saucière est généralement en forme de bateau et comporte un ou deux becs ainsi qu’une ou deux anses verticales sur les côtés. Elle peut être simple ou double et fixée sur un plateau.
status: 1

présentoir à glace ou à fruit
type: SimpleNonPreferredTerm
modified: 2014-10-17T10:55:00+02:00
created: 2014-01-15T14:54:24+01:00
status: 1

récipient pour le service ou la consommation des aliments
type: PreferredTerm
modified: 2014-10-17T10:55:00+02:00
created: 2014-01-15T14:54:24+01:00
status: 1

marronnière
type: SimpleNonPreferredTerm
modified: 2014-10-17T10:55:00+02:00
created: 2014-01-15T14:54:24+01:00
status: 1

présentoir à œufs
type: SimpleNonPreferredTerm
modified: 2014-11-18T16:50:34+01:00
created: 2014-01-15T14:54:24+01:00
status: 1

plateau à melon
type: SimpleNonPreferredTerm
modified: 2014-10-17T10:55:00+02:00
created: 2014-01-15T14:54:24+01:00
status: 1

dais de trône pontifical
type: Concept
modified: 2014-12-02T15:23:13+01:00
in scheme: Thésaurus de la désignation des objets mobiliers
preferred label: pontifical throne canopies @en-us
preferred label: baldacchino della cattedra pontificale @it
preferred label: baldaquino de trono pontifical @pt
broader: trône pontifical
created: 2012-05-16T00:00:00+02:00
related: garniture de dais de trône pontifical
definition: Dais situé au-dessus d'un trône épiscopal ou abbatial et souvent accompagné d'une garniture.
TermeAssocie: garniture de dais de trône pontifical
status: 1

trône pontifical
type: PreferredTerm
modified: 2014-12-02T15:22:10+01:00
created: 2014-01-15T14:54:24+01:00
status: 1

camail de confrérie
type: Concept
modified: 2014-12-03T12:28:46+01:00
in scheme: Thésaurus de la désignation des objets mobiliers
preferred label: mozzetta di confraternita @it
preferred label: confraternity mozettas @en-us
preferred label: mozeta de confraria @pt
broader: autre vêtement catholique
created: 2012-07-13T00:00:00+02:00
related: mozette
related: aube de confrérie
definition: Pèlerine, parfois à capuchon, portée par les membres d'une confrérie sur une aube. Il peut être décoré de motifs iconographiques en relation avec la confrérie.
TermeAssocie: mozette
TermeAssocie: aube de confrérie
status: 1

mozette
type: Concept
modified: 2014-12-03T14:40:08+01:00
in scheme: Thésaurus de la désignation des objets mobiliers
preferred label: mozzetta @it
preferred label: mozzettas @en-us
preferred label: mozeta @pt
broader: vêtement liturgique de dessus
alternative label: pelisse de chœur
alternative label: camail
alternative label: pèlerine d'église
created: 2012-05-16T00:00:00+02:00
related: camail de confrérie
definition: Pèlerine courte, ouverte ou boutonnée sur le devant, comportant un petit capuchon, portée, dans le chœur, sur une soutane et éventuellement un surplis ou un rochet par les nombreux clercs pour lesquels elle est un signe de juridiction. Le capuchon est cousu ou amovible et maintenu par des boutons ou des agrafes. Certains clercs, prêtres ou enfants de chœur, qui n'ont pas le droit de revêtir la mozette, peuvent porter un vêtement de même forme, le camail.
TermeAssocie: camail de confrérie
status: 1
broad match: http://vocab.getty.edu/aat/300210450

camail de confrérie
type: PreferredTerm
modified: 2014-12-03T12:28:46+01:00
created: 2014-01-15T14:54:24+01:00
status: 1

aube de confrérie
type: Concept
modified: 2014-12-03T12:23:26+01:00
in scheme: Thésaurus de la désignation des objets mobiliers
preferred label: camice di confraternita @it
preferred label: confraternity albs @en-us
preferred label: alva de confraria @pt
broader: autre vêtement catholique
alternative label: sac de confrérie
created: 2012-05-16T00:00:00+02:00
related: camail de confrérie
definition: Aube blanche, souvent ouverte, portée par les membres d'une confrérie par-dessus leurs vêtements civils et sous un camail de confrérie. L'extrémité de ses manches comporte parfois des manchettes assorties au camail.
TermeAssocie: camail de confrérie
status: 1

psyché
type: Concept
modified: 2014-12-04T11:08:15+01:00
in scheme: Thésaurus de la désignation des objets mobiliers
preferred label: cheval glasses @en-us
broader: glace
created: 2012-05-16T00:00:00+02:00
definition: Miroir de milieu, fixe ou mobile, fait pour se voir en pied. Il est monté dans un cadre vertical placé sur patins, et est souvent accompagné de luminaires placés de chaque côté sur les montants. Il peut comporter des petites armoires latérales.
status: 1
broad match: cb13162911m

psyché
type: PreferredTerm
modified: 2014-12-04T11:08:15+01:00
created: 2014-01-15T14:54:24+01:00
status: 1

style liturgique
type: PreferredTerm
modified: 2014-12-01T11:23:47+01:00
created: 2014-01-15T14:54:24+01:00
status: 1

brûle-parfum
type: Concept
modified: 2014-12-10T15:48:53+01:00
in scheme: Thésaurus de la désignation des objets mobiliers
preferred label: cassolettes @en-us
broader: objet pour l'entretien de la maison
alternative label: cassolette
alternative label: fleur à parfum
created: 2012-05-16T00:00:00+02:00
related: meuble brûle-parfum
definition: Récipient couvert dans lequel on place des braises pour brûler des matières aromatiques dont la fumée odoriférante s'échappe par des jours pratiqués dans le couvercle et le haut du corps.
TermeAssocie: meuble brûle-parfum
status: 1

fleur à parfum
type: SimpleNonPreferredTerm
modified: 2014-12-10T15:48:53+01:00
created: 2014-01-15T14:54:24+01:00
status: 1

meuble brûle-parfum
type: Concept
modified: 2014-10-10T16:16:53+02:00
in scheme: Thésaurus de la désignation des objets mobiliers
broader: meuble d'hygiène
created: 2012-05-16T00:00:00+02:00
related: brûle-parfum
definition: Meuble à hauteur d'appui monté sur un ou plusieurs pieds, comportant une cuvette intérieure en métal, doublant une cuvette extérieure également en métal, servant à brûler, grâce à un réchaud parfois incorporé, des parfums en pastilles. La cuvette est fermée par un ou deux couvercles (alors superposés) ajourés.
TermeAssocie: brûle-parfum
status: 1
broad match: Meuble

cassolette
type: SimpleNonPreferredTerm
modified: 2014-12-10T15:48:53+01:00
created: 2014-01-15T14:54:24+01:00
status: 1

brûle-parfum
type: PreferredTerm
modified: 2014-12-10T15:48:53+01:00
created: 2014-01-15T14:54:24+01:00
status: 1

moteur pneumatique
type: Concept
modified: 2015-08-06T12:45:50+02:00
in scheme: Thésaurus de la désignation des objets mobiliers
broader: moteur à énergie mécanique
created: 2012-05-16T00:00:00+02:00
definition: Moteur à énergie mécanique utilisant l'énergie motrice de l'air comprimé.
status: 1

moteur pneumatique
type: PreferredTerm
modified: 2015-08-06T12:45:50+02:00
created: 2014-01-15T14:54:24+01:00
status: 1

sarcophage
type: Concept
modified: 2015-02-24T15:19:59+01:00
in scheme: Thésaurus de la désignation des objets mobiliers
preferred label: sarcophagi (coffins) @en-us
preferred label: sarcofago @it
broader: monument funéraire
created: 2012-05-16T00:00:00+02:00
scope note: Le sarcophage peut être chrétien ou païen. Il peut être un élément constitutif d'un tombeau et ne joue alors qu'un rôle symbolique.
definition: Cuve destinée à recevoir un ou plusieurs corps. Fermé d'un couvercle, le sarcophage est en pierre, en terre cuite ou en plâtre. Il comporte parfois un décor sculpté ou des inscriptions.
status: 1

sarcophage
type: PreferredTerm
modified: 2015-02-24T15:19:59+01:00
created: 2014-01-15T14:54:24+01:00
status: 1

cénotaphe
type: Concept
modified: 2015-02-24T14:37:32+01:00
in scheme: Thésaurus de la désignation des objets mobiliers
preferred label: cenotafio @it
preferred label: cenotaphs @en-us
broader: monument funéraire
created: 2012-05-16T00:00:00+02:00
scope note: Le cénotaphe présente toutes les caractéristiques du tombeau. En cas d'incertitude sur la présence de la sépulture lors de sa construction, employer tombeau, monument funéraire. Voir aussi le Thesaurus de la désignation des œuvres architecturales et des espaces aménagés.
definition: Monument funéraire élevé à la mémoire d'un mort, ailleurs que sur le lieu de sa sépulture.
status: 1
broad match: cb11932525p

cénotaphe
type: PreferredTerm
modified: 2015-02-24T14:37:32+01:00
created: 2014-01-15T14:54:24+01:00
status: 1

chape
type: Concept
modified: 2014-12-03T14:32:37+01:00
in scheme: Thésaurus de la désignation des objets mobiliers
preferred label: piviale @it
preferred label: copes @en-us
preferred label: capa @pt
broader: vêtement liturgique de dessus
alternative label: chape prélatice
alternative label: mors de chape
alternative label: mantum
alternative label: cappa magna
alternative label: pluvial
alternative label: cape liturgique
created: 2012-05-16T00:00:00+02:00
related: ornement liturgique catholique
related: colletin
definition: Grand vêtement de tissu précieux et richement décoré, ouvert sur le devant, porté par-dessus tous les autres et servant lors des cérémonies solennelles. La chape peut être portée par tous les clercs. La chape pouvait comporter un capuchon, dont le chaperon (application d'étoffe de forme arrondie) est un vestige. Elle est souvent bordée sur le devant d’un décor spécifique appelé orfroi. Elle est maintenue fermée, soit par des crochets, soit par une ou deux boucles en métal appelées mors de chape, fermail ou encore formal (réservées aux évêques, aux cardinaux et au pape). On appelle mantum, la chape réservée au pape. La chape prélatice est un grand manteau de chœur en forme de cape avec pèlerine, capuchon et traîne.
TermeAssocie: ornement liturgique catholique
TermeAssocie: colletin
status: 1

mantum
type: SimpleNonPreferredTerm
modified: 2014-12-03T14:32:37+01:00
created: 2014-01-15T14:54:24+01:00
status: 1

mors de chape
type: SimpleNonPreferredTerm
modified: 2014-12-03T14:32:37+01:00
created: 2014-01-15T14:54:24+01:00
status: 1

pluvial
type: SimpleNonPreferredTerm
modified: 2014-12-03T14:32:37+01:00
created: 2014-01-15T14:54:24+01:00
status: 1

cape liturgique
type: SimpleNonPreferredTerm
modified: 2014-12-03T14:32:37+01:00
created: 2014-01-15T14:54:24+01:00
status: 1

chape
type: PreferredTerm
modified: 2014-12-03T14:32:37+01:00
created: 2014-01-15T14:54:24+01:00
status: 1

chape prélatice
type: SimpleNonPreferredTerm
modified: 2014-12-03T14:32:37+01:00
created: 2014-01-15T14:54:24+01:00
status: 1

cappa magna
type: SimpleNonPreferredTerm
modified: 2014-12-03T14:32:37+01:00
created: 2014-01-15T14:54:24+01:00
status: 1

garniture de siège
type: Concept
modified: 2014-12-12T12:22:39+01:00
in scheme: Thésaurus de la désignation des objets mobiliers
preferred label: upholstery @en-us
broader: garniture de meuble
created: 2012-05-16T00:00:00+02:00
definition: Ensemble des éléments fixes ou amovibles (sangles, élastiques, ficelles, toiles, etc., ainsi que les coussins et les clous) qui servent à garnir un siège (fond, dossier et manchettes).
status: 1

garniture de siège
type: PreferredTerm
modified: 2014-12-12T12:22:39+01:00
created: 2014-01-15T14:54:24+01:00
status: 1

panneau de polyptyque
type: PreferredTerm
modified: 2014-12-01T13:03:29+01:00
created: 2014-01-15T14:54:24+01:00
status: 1

compartiment de polyptyqye
type: SimpleNonPreferredTerm
modified: 2014-12-01T13:03:29+01:00
created: 2014-01-15T14:54:24+01:00
status: 1

corbeille à bouteille
type: SimpleNonPreferredTerm
modified: 2014-10-16T15:15:43+02:00
created: 2014-01-15T14:54:24+01:00
status: 1

chariot à vin
type: SimpleNonPreferredTerm
modified: 2014-10-16T15:15:43+02:00
created: 2014-01-15T14:54:24+01:00
status: 1

présentoir à bouteille
type: PreferredTerm
modified: 2014-10-16T15:15:43+02:00
created: 2014-01-15T14:54:24+01:00
status: 1

coffre-fort
type: Concept
modified: 2014-12-04T16:06:44+01:00
in scheme: Thésaurus de la désignation des objets mobiliers
preferred label: strongboxes @en-us
broader: coffre
created: 2012-05-16T00:00:00+02:00
definition: Coffre fait pour garder hors d'atteinte, de l'or, de l'argent, des objets précieux ou des valeurs. Il est en bois épais et/ou en métal, et comporte une ou plusieurs serrures complexes.
status: 1

coffre-fort
type: PreferredTerm
modified: 2014-12-04T16:06:44+01:00
created: 2014-01-15T14:54:24+01:00
status: 1

clef de voûte
type: Concept
modified: 2015-01-07T12:00:48+01:00
in scheme: Thésaurus de la désignation des objets mobiliers
preferred label: keystones (vault components) @en-us
broader: claveau
alternative label: clé de voûte pendante
alternative label: clé de voûte
created: 2012-05-16T00:00:00+02:00
definition: Claveau formant le faîte d'une voûte.
status: 1

clef de voûte
type: PreferredTerm
modified: 2015-01-07T12:00:48+01:00
created: 2014-01-15T14:54:24+01:00
status: 1

clé de voûte pendante
type: SimpleNonPreferredTerm
modified: 2015-01-07T12:00:48+01:00
created: 2014-01-15T14:54:24+01:00
status: 1

clé de voûte
type: SimpleNonPreferredTerm
modified: 2015-01-07T12:00:48+01:00
created: 2014-01-15T14:54:24+01:00
status: 1

claveau
type: Concept
modified: 2015-01-07T11:52:03+01:00
in scheme: Thésaurus de la désignation des objets mobiliers
preferred label: voussoirs @en-us
narrower: clef de voûte
narrower: clef d'arc
broader: élément de couvrement
created: 2012-05-16T00:00:00+02:00
definition: Elément de l'appareil d'une plate-bande, d'un arc ou d'une voûte, taillé en forme de coin.
status: 1
narrow match: http://data.bnf.fr/ark:/12148/cb119440119

casier à épices
type: SimpleNonPreferredTerm
modified: 2014-12-04T16:41:21+01:00
created: 2014-01-15T14:54:24+01:00
status: 1

étagère porte-ingrédients
type: SimpleNonPreferredTerm
modified: 2014-12-04T16:41:21+01:00
created: 2014-01-15T14:54:24+01:00
status: 1

étagère à épices
type: PreferredTerm
modified: 2014-12-04T16:41:21+01:00
created: 2014-01-15T14:54:24+01:00
status: 1

bague
type: PreferredTerm
modified: 2014-12-30T12:26:17+01:00
created: 2014-01-15T14:54:24+01:00
status: 1

alliance
type: SimpleNonPreferredTerm
modified: 2014-12-30T12:26:17+01:00
created: 2014-01-15T14:54:24+01:00
status: 1

miroir peint
type: Concept
modified: 2014-10-10T15:16:10+02:00
in scheme: Thésaurus de la désignation des objets mobiliers
broader: glace
created: 2012-05-16T00:00:00+02:00
definition: Miroir comportant en son milieu une peinture sous verre.
status: 1
broad match: cb13162911m
broad match: http://vocab.getty.edu/aat/300037682
broad match: Miroir

miroir peint
type: PreferredTerm
modified: 2014-10-10T15:16:10+02:00
created: 2014-01-15T14:54:24+01:00
status: 1

daubière
type: PreferredTerm
modified: 2014-12-08T12:19:24+01:00
created: 2014-01-15T14:54:24+01:00
status: 1

braisière
type: SimpleNonPreferredTerm
modified: 2014-12-08T12:19:24+01:00
created: 2014-01-15T14:54:24+01:00
status: 1

artichautière
type: SimpleNonPreferredTerm
modified: 2014-12-08T12:19:24+01:00
created: 2014-01-15T14:54:24+01:00
status: 1

chaponnière
type: SimpleNonPreferredTerm
modified: 2014-12-08T12:19:24+01:00
created: 2014-01-15T14:54:24+01:00
status: 1

huguenote
type: SimpleNonPreferredTerm
modified: 2014-12-08T12:19:24+01:00
created: 2014-01-15T14:54:24+01:00
status: 1

objet de représentation d'un organisme vivant
type: PreferredTerm
modified: 2014-09-09T17:19:48+02:00
created: 2014-01-15T14:54:24+01:00
status: 1

objet de représentation scientifique et pédagogique
type: Concept
modified: 2014-09-09T17:17:50+02:00
in scheme: Thésaurus de la désignation des objets mobiliers
narrower: objet de représentation d'un organisme vivant
narrower: objet de représentation de corps célestes
narrower: objet de représentation d'élément mécanique
broader: objet pédagogique ou scientifique
created: 2013-12-20T00:00:00+01:00
status: 1
broad match: http://data.bnf.fr/ark:/12148/cb131627890
broad match: http://vocab.getty.edu/aat/300047753

cire pathologique
type: SimpleNonPreferredTerm
modified: 2014-09-09T17:19:48+02:00
created: 2014-01-15T14:54:24+01:00
status: 1

modèle d'organe
type: SimpleNonPreferredTerm
modified: 2014-09-09T17:19:48+02:00
created: 2014-01-15T14:54:24+01:00
status: 1

quenouille
type: Concept
modified: 2014-12-10T15:00:39+01:00
in scheme: Thésaurus de la désignation des objets mobiliers
preferred label: distaffs @en-us
broader: matériel pour le filage
created: 2012-05-16T00:00:00+02:00
definition: Bâton supportant à son sommet une matière textile dite filasse, qui doit être filée grâce au fuseau ou au rouet.
status: 1

matériel pour le filage
type: Concept
modified: 2014-10-17T12:09:22+02:00
in scheme: Thésaurus de la désignation des objets mobiliers
narrower: quenouille
narrower: rouet
narrower: fuseau
broader: objet ou matériel pour les ouvrages textiles
alternative label: porte-fuseaux
alternative label: porte-quenouille
created: 2013-03-28T00:00:00+01:00
definition: Petit matériel ou outil servant à la fabrication manuelle de fils, à l'aide d'un fuseau ou d'un rouet.
status: 1
broad match: http://vocab.getty.edu/aat/300163224
broad match: http://data.bnf.fr/ark:/12148/cb11942815d
broad match: Filage textile

quenouille
type: PreferredTerm
modified: 2014-12-10T15:00:39+01:00
created: 2014-01-15T14:54:24+01:00
status: 1

moteur électrique
type: Concept
modified: 2015-08-06T16:20:22+02:00
in scheme: Thésaurus de la désignation des objets mobiliers
narrower: moteur électrique alternatif
narrower: moteur électrique continu
broader: moteur
created: 2012-05-16T00:00:00+02:00
definition: Moteur dont la source énergétique motrice est électrique.
status: 1

moteur
type: PreferredTerm
modified: 2015-08-05T15:50:53+02:00
created: 2014-01-15T14:54:24+01:00
status: 1

dessus-de-porte
type: PreferredTerm
modified: 2015-01-07T16:42:12+01:00
created: 2014-01-15T14:54:24+01:00
status: 1

carton d'autel
type: SimpleNonPreferredTerm
modified: 2014-11-27T12:10:07+01:00
created: 2014-01-15T14:54:24+01:00
status: 1

table des secrètes
type: SimpleNonPreferredTerm
modified: 2014-11-27T12:10:07+01:00
created: 2014-01-15T14:54:24+01:00
status: 1

canon d'autel
type: PreferredTerm
modified: 2014-11-27T12:10:07+01:00
created: 2014-01-15T14:54:24+01:00
status: 1

tablette des secrètes
type: SimpleNonPreferredTerm
modified: 2014-11-27T12:10:07+01:00
created: 2014-01-15T14:54:24+01:00
status: 1

secrète
type: SimpleNonPreferredTerm
modified: 2014-11-27T12:10:07+01:00
created: 2014-01-15T14:54:24+01:00
status: 1

couloire
type: Concept
modified: 2014-11-27T14:58:24+01:00
in scheme: Thésaurus de la désignation des objets mobiliers
preferred label: strainer spoons @en-us
preferred label: colatoio @it
preferred label: coador @pt
broader: objet lié à l'Eucharistie
alternative label: passoire liturgique
alternative label: passoire pour le vin de communion
created: 2012-05-16T00:00:00+02:00
definition: Passoire, généralement en forme de cuiller, pour filtrer le vin de messe, lorsqu'on le verse, avant sa consécration, dans le calice. Habituellement en or ou en argent, elle peut avoir un manche ou une anse en forme d'anneau. Les trous du cuilleron peuvent dessiner un symbole eucharistique.
status: 1
broad match: cb11936841q

passoire pour le vin de communion
type: SimpleNonPreferredTerm
modified: 2014-11-27T14:58:24+01:00
created: 2014-01-15T14:54:24+01:00
status: 1

passoire liturgique
type: SimpleNonPreferredTerm
modified: 2014-11-27T14:58:24+01:00
created: 2014-01-15T14:54:24+01:00
status: 1

couloire
type: PreferredTerm
modified: 2014-11-27T14:58:24+01:00
created: 2014-01-15T14:54:24+01:00
status: 1

carboniseuse
type: SimpleNonPreferredTerm
modified: 2015-10-15T12:47:53+02:00
created: 2014-01-15T14:54:24+01:00
status: 1

machine à épurer chimiquement
type: PreferredTerm
modified: 2015-10-15T12:47:53+02:00
created: 2014-01-15T14:54:24+01:00
status: 1

séparateur
type: SimpleNonPreferredTerm
modified: 2015-10-15T12:47:53+02:00
created: 2014-01-15T14:54:24+01:00
status: 1

repoussoir à peaux
type: PreferredTerm
modified: 2014-10-17T14:57:49+02:00
created: 2014-01-15T14:54:24+01:00
status: 1

cravate
type: Concept
modified: 2014-12-11T16:38:20+01:00
in scheme: Thésaurus de la désignation des objets mobiliers
preferred label: neckties @en-us
broader: vêtement d'intérieur ou d'extérieur
alternative label: nœud papillon
created: 2012-05-16T00:00:00+02:00
definition: Bande d'étoffe passée autour du col ou sous le col de la chemise, nouée par-devant et dont les deux pans verticaux pendent sur la poitrine.
status: 1

cravate
type: PreferredTerm
modified: 2014-12-11T16:38:20+01:00
created: 2014-01-15T14:54:24+01:00
status: 1

nœud papillon
type: SimpleNonPreferredTerm
modified: 2014-12-11T16:38:20+01:00
created: 2014-01-15T14:54:24+01:00
status: 1

bassin de lit
type: Concept
modified: 2014-01-10T00:00:00+01:00
in scheme: Thésaurus de la désignation des objets mobiliers
broader: accessoire d'aide au malade
alternative label: bassin d'accouchée
created: 2012-05-16T00:00:00+02:00
related: pot de chambre
TermeAssocie: pot de chambre
status: 1

pot de chambre
type: PreferredTerm
modified: 2014-12-10T16:56:48+01:00
created: 2014-01-15T14:54:24+01:00
status: 1

seau d'aisances
type: SimpleNonPreferredTerm
modified: 2014-12-10T16:56:48+01:00
created: 2014-01-15T14:54:24+01:00
status: 1

vase de nuit
type: SimpleNonPreferredTerm
modified: 2014-12-10T16:56:48+01:00
created: 2014-01-15T14:54:24+01:00
status: 1

seau d'hygiène
type: SimpleNonPreferredTerm
modified: 2014-12-10T16:56:48+01:00
created: 2014-01-15T14:54:24+01:00
status: 1

table de nuit
type: Concept
modified: 2014-12-05T13:45:37+01:00
in scheme: Thésaurus de la désignation des objets mobiliers
preferred label: night tables @en-us
broader: table pour l'hygiène ou le repos
alternative label: table de chevet
alternative label: table de nuit large
created: 2012-05-16T00:00:00+02:00
related: pot de chambre
definition: Petite table servant à placer les objets nécessaires pour la nuit, essentiellement le vase de nuit, dans un corps de rangement plus ou moins important. Les tables de nuit peuvent aller par paires.
TermeAssocie: pot de chambre
status: 1
broad match: http://data.bnf.fr/ark:/12148/cb131630926

bourdaloue
type: SimpleNonPreferredTerm
modified: 2014-12-10T16:56:48+01:00
created: 2014-01-15T14:54:24+01:00
status: 1

urinal
type: SimpleNonPreferredTerm
modified: 2014-12-10T16:56:48+01:00
created: 2014-01-15T14:54:24+01:00
status: 1

boule à éponge à fard
type: SimpleNonPreferredTerm
modified: 2014-12-10T16:40:30+01:00
created: 2014-01-15T14:54:24+01:00
status: 1

grille à éponge
type: SimpleNonPreferredTerm
modified: 2014-12-10T16:40:30+01:00
created: 2014-01-15T14:54:24+01:00
status: 1

bol à éponge
type: SimpleNonPreferredTerm
modified: 2014-12-10T16:40:30+01:00
created: 2014-01-15T14:54:24+01:00
status: 1

boule à éponge
type: SimpleNonPreferredTerm
modified: 2014-12-10T16:40:30+01:00
created: 2014-01-15T14:54:24+01:00
status: 1

boîte à éponge
type: PreferredTerm
modified: 2014-12-10T16:40:30+01:00
created: 2014-01-15T14:54:24+01:00
status: 1

système de transmission
type: PreferredTerm
modified: 2015-10-08T10:53:52+02:00
created: 2014-01-15T14:54:24+01:00
status: 1

bâton de chef d'orchestre
type: SimpleNonPreferredTerm
modified: 2014-10-10T11:23:22+02:00
created: 2014-01-15T14:54:24+01:00
status: 1

bâton de mesure
type: PreferredTerm
modified: 2014-10-10T11:23:22+02:00
created: 2014-01-15T14:54:24+01:00
status: 1

vedette de compétition
type: SimpleNonPreferredTerm
modified: 2014-12-19T12:04:34+01:00
created: 2014-01-15T14:54:24+01:00
status: 1

voilier de régate
type: SimpleNonPreferredTerm
modified: 2014-12-19T12:04:34+01:00
created: 2014-01-15T14:54:24+01:00
status: 1

bateau de compétition
type: PreferredTerm
modified: 2014-12-19T12:04:34+01:00
created: 2014-01-15T14:54:24+01:00
status: 1

instrument de démonstration en optique
type: Concept
modified: 2014-12-15T14:23:20+01:00
in scheme: Thésaurus de la désignation des objets mobiliers
broader: instrument de démonstration de phénomènes physiques
alternative label: polyprisme
alternative label: miroir ardent
alternative label: miroir double par réflexion infinie
alternative label: prisme creux
alternative label: prisme à angle variable
alternative label: œil artificiel
alternative label: disque de Newton
created: 2012-05-16T00:00:00+02:00
definition: Instrument de démonstration des phénomènes liés à l'optique : réflexion, réfraction, spectroscopie, polarisation.
status: 1
narrow match: http://data.bnf.fr/ark:/12148/cb119582847
narrow match: http://vocab.getty.edu/aat/300266644
narrow match: Disque de Newton

instrument de démonstration en optique
type: PreferredTerm
modified: 2014-12-15T14:23:20+01:00
created: 2014-01-15T14:54:24+01:00
status: 1

disque de Newton
type: SimpleNonPreferredTerm
modified: 2014-12-15T14:23:20+01:00
created: 2014-01-15T14:54:24+01:00
status: 1

œil artificiel
type: SimpleNonPreferredTerm
modified: 2014-12-15T14:23:20+01:00
created: 2014-01-15T14:54:24+01:00
status: 1

miroir double par réflexion infinie
type: SimpleNonPreferredTerm
modified: 2014-12-15T14:23:20+01:00
created: 2014-01-15T14:54:24+01:00
status: 1

polyprisme
type: SimpleNonPreferredTerm
modified: 2014-12-15T14:23:20+01:00
created: 2014-01-15T14:54:24+01:00
status: 1

prisme creux
type: SimpleNonPreferredTerm
modified: 2014-12-15T14:23:20+01:00
created: 2014-01-15T14:54:24+01:00
status: 1

prisme à angle variable
type: SimpleNonPreferredTerm
modified: 2014-12-15T14:23:20+01:00
created: 2014-01-15T14:54:24+01:00
status: 1

miroir ardent
type: SimpleNonPreferredTerm
modified: 2014-12-15T14:23:20+01:00
created: 2014-01-15T14:54:24+01:00
status: 1

couvre-pains
type: Concept
modified: 2014-01-10T00:00:00+01:00
in scheme: Thésaurus de la désignation des objets mobiliers
broader: linge et garniture liés aux fêtes liturgiques et au culte domestique
created: 2012-05-16T00:00:00+02:00
definition: Pièce de lin blanc agrémenté de motifs brodés en une seule couleur, destinée à couvrir les miches du pain tressé (la hallah) consommé durant le Shabbat, lors de sa sanctification pendant la prière du Qiddoush ou prière récitée le vendredi soir à la synagogue.
status: 1

couvre-pains
type: PreferredTerm
modified: 2014-01-10T00:00:00+01:00
created: 2014-01-15T14:54:24+01:00
status: 1

garniture de dais de trône pontifical
type: Concept
modified: 2014-12-03T11:05:36+01:00
in scheme: Thésaurus de la désignation des objets mobiliers
preferred label: pontifical throne canopy hangings @en-us
preferred label: guarnizione del baldacchino della catedra pontificale @it
preferred label: ornamento de baldaquino de trono pontifical @pt
broader: linge ou garniture liés aux sièges
alternative label: rideau de dais de trône pontifical
alternative label: garnitures de dais de trône pontifical
alternative label: pente de dais de trône pontifical
alternative label: ciel de dais de trône pontifical
created: 2012-05-16T00:00:00+02:00
related: dais de trône pontifical
definition: Ensemble des textiles mis en place sur un dais de trône pontifical, lors des messes pontificales : ciel de dais, rideaux de dais, pentes de dais et éventuellement décors d'amortissement (boules, panaches, etc., parfois montés sur des supports indépendants).
TermeAssocie: dais de trône pontifical
status: 1

dais de trône pontifical
type: PreferredTerm
modified: 2014-12-02T15:23:13+01:00
created: 2014-01-15T14:54:24+01:00
status: 1

objet lié à la consécration des églises, des autels et de la Porte sainte
type: PreferredTerm
modified: 2014-11-27T16:00:34+01:00
created: 2014-01-15T14:54:24+01:00
status: 1

service de cérémonie de la Porte sainte
type: Concept
modified: 2014-11-27T16:04:01+01:00
in scheme: Thésaurus de la désignation des objets mobiliers
preferred label: Porta Santa ceremony services @en-us
preferred label: servizio cerimoniale per la Porta Santa @it
preferred label: serviço do cerimonial da Porta Santa @pt
broader: objet lié à la consécration des églises, des autels et de la Porte sainte
alternative label: marteau de la Porte sainte
alternative label: plat de la Porte sainte
alternative label: truelle de la Porte sainte
created: 2012-05-16T00:00:00+02:00
definition: Ensemble d'instruments utilisés par le pape ou par de hauts dignitaires ecclésiastiques comme les cardinaux pénitenciers, lors des cérémonies d'ouverture et de clôture de la Porte sainte des basiliques jubilaires romaines. Le service de cérémonie de la Porte sainte comprend un marteau (marteau de la Porte sainte) et une truelle (truelle de la Porte sainte), éventuellement accompagnés d'un plat (plat de la Porte sainte). Le service d'honneur qu'utilise le pape est en or ou en argent.
status: 1
broad match: cb11936841q
broad match: http://vocab.getty.edu/aat/300133146
broad match: Porte Sainte

chandelier de consécration
type: Concept
modified: 2014-11-27T16:02:32+01:00
in scheme: Thésaurus de la désignation des objets mobiliers
preferred label: dedication candle sconces @en-us
preferred label: candeliere di consacrazione @it
preferred label: castiçal de consagração @pt
broader: objet lié à la consécration des églises, des autels et de la Porte sainte
created: 2012-05-16T00:00:00+02:00
related: chandelier d'église
related: croix de consécration
definition: Petit chandelier mural, fixé à l'intérieur d'une église consacrée, sous chacune des douze croix de consécration.
TermeAssocie: chandelier d'église
TermeAssocie: croix de consécration
status: 1
broad match: http://vocab.getty.edu/aat/300037589

service de consécration
type: Concept
modified: 2015-06-16T12:56:17+02:00
in scheme: Thésaurus de la désignation des objets mobiliers
preferred label: consecration services @en-us
preferred label: servizio per la consacrazione dell'altare @it
preferred label: serviço da sagração @pt
broader: objet lié à la consécration des églises, des autels et de la Porte sainte
alternative label: truelle de consécration
alternative label: spatule de consécration
alternative label: burin de consécration
alternative label: marteau de consécration
created: 2012-05-16T00:00:00+02:00
scope note: Le marteau et la truelle de consécration peuvent faire partie d'une chapelle de messe.
related: objet commémoratif
definition: Ensemble d'outils de maçonnerie en métal précieux, utilisés pour diverses cérémonies liturgiques : consécration d'un autel, pose de la première pierre d'une église, etc. Le service de consécration comprend un marteau de consécration, une truelle de consécration et éventuellement un burin de consécration et une spatule de consécration.
TermeAssocie: objet commémoratif
status: 1
broad match: cb11982447r
broad match: http://vocab.getty.edu/aat/300133146

brique de la Porte sainte
type: Concept
modified: 2014-11-27T16:01:28+01:00
in scheme: Thésaurus de la désignation des objets mobiliers
preferred label: Porta Santa bricks @en-us
preferred label: mattone di Porta Santa @it
preferred label: tijolo da Porta Santa @pt
broader: objet lié à la consécration des églises, des autels et de la Porte sainte
created: 2012-05-16T00:00:00+02:00
definition: Brique servant à murer la Porte sainte des basiliques jubilaires romaines, lors de la cérémonie de sa fermeture. Ces briques sont estampées de symboles religieux, d'insignes ecclésiastiques (tiare papale avec clefs pendantes, chapeau de cardinal) et d'inscriptions commémoratives de l'année du jubilé. Les briques utilisées lors de la cérémonie conduite par le pape à Saint-Pierre de Rome sont particulièrement décorées et sont dorées ou argentées.
status: 1

oratoire de voyage
type: SimpleNonPreferredTerm
modified: 2014-11-26T16:38:49+01:00
created: 2014-01-15T14:54:24+01:00
status: 1

oratoire portatif
type: PreferredTerm
modified: 2014-11-26T16:38:49+01:00
created: 2014-01-15T14:54:24+01:00
status: 1

boîte de mendiant
type: SimpleNonPreferredTerm
modified: 2014-11-26T16:38:49+01:00
created: 2014-01-15T14:54:24+01:00
status: 1

revolver
type: Concept
modified: 2014-12-12T14:46:41+01:00
in scheme: Thésaurus de la désignation des objets mobiliers
preferred label: revolvers (firearms) @en-us
broader: arme de poing
created: 2012-05-16T00:00:00+02:00
definition: Arme de poing dont les chambres sont disposées dans un barillet rotatif.
status: 1

revolver
type: PreferredTerm
modified: 2014-12-12T14:46:42+01:00
created: 2014-01-15T14:54:24+01:00
status: 1

baldaquin de mariage
type: PreferredTerm
modified: 2014-01-10T00:00:00+01:00
created: 2014-01-15T14:54:24+01:00
status: 1

baldaquin nuptial
type: SimpleNonPreferredTerm
modified: 2014-01-10T00:00:00+01:00
created: 2014-01-15T14:54:24+01:00
status: 1

baldaquin pour pupitre de Torah
type: SimpleNonPreferredTerm
modified: 2014-01-10T00:00:00+01:00
created: 2014-01-15T14:54:24+01:00
status: 1

croix de consécration
type: PreferredTerm
modified: 2015-02-24T12:43:53+01:00
created: 2014-01-15T14:54:24+01:00
status: 1

rouet
type: Concept
modified: 2014-12-10T15:03:09+01:00
in scheme: Thésaurus de la désignation des objets mobiliers
preferred label: spinning wheels @en-us
broader: matériel pour le filage
created: 2012-05-16T00:00:00+02:00
definition: Instrument servant à tordre mécaniquement la filasse de laine, de lin ou de chanvre, la filoselle ou la bourrette de soie, et à embobiner le fil ainsi obtenu. Le travail manuel est réduit à l’étirage de la filasse et au tournage de la roue.
status: 1

rouet
type: PreferredTerm
modified: 2014-12-10T15:03:09+01:00
created: 2014-01-15T14:54:24+01:00
status: 1

coffret aux saintes huiles orthodoxe
type: Concept
modified: 2014-01-10T00:00:00+01:00
in scheme: Thésaurus de la désignation des objets mobiliers
broader: objet du culte orthodoxe
alternative label: boîte à baptême
alternative label: boîte aux saintes huiles orthodoxe
created: 2012-05-16T00:00:00+02:00
scope note: La boîte à baptême contient, outre les saintes huiles, des ciseaux et un pinceau pour le sacrement du baptême.
definition: Coffret contenant deux ampoules, l'une pour l'huile de baptême dite huile d'allégresse, qui sert à l'onction des nouveaux-nés, ou pour l'huile du pénitent, qui sert à l'extrême-onction et l'autre pour le saint Chrême.
status: 1

boîte aux saintes huiles orthodoxe
type: SimpleNonPreferredTerm
modified: 2014-01-10T00:00:00+01:00
created: 2014-01-15T14:54:24+01:00
status: 1

boîte à baptême
type: SimpleNonPreferredTerm
modified: 2014-01-10T00:00:00+01:00
created: 2014-01-15T14:54:24+01:00
status: 1

coffret aux saintes huiles orthodoxe
type: PreferredTerm
modified: 2014-01-10T00:00:00+01:00
created: 2014-01-15T14:54:24+01:00
status: 1

musette de Bresse
type: SimpleNonPreferredTerm
modified: 2014-12-12T16:04:00+01:00
created: 2014-01-15T14:54:24+01:00
status: 1

cornemuse
type: PreferredTerm
modified: 2014-12-12T16:04:00+01:00
created: 2014-01-15T14:54:24+01:00
status: 1

musette de cour
type: SimpleNonPreferredTerm
modified: 2014-12-12T16:04:00+01:00
created: 2014-01-15T14:54:24+01:00
status: 1

chabrette limousine
type: SimpleNonPreferredTerm
modified: 2014-12-12T16:04:00+01:00
created: 2014-01-15T14:54:24+01:00
status: 1

cabrette auvergnate
type: SimpleNonPreferredTerm
modified: 2014-12-12T16:04:00+01:00
created: 2014-01-15T14:54:24+01:00
status: 1

biniou
type: SimpleNonPreferredTerm
modified: 2014-12-12T16:04:00+01:00
created: 2014-01-15T14:54:24+01:00
status: 1

veuze de Vendée
type: SimpleNonPreferredTerm
modified: 2014-12-12T16:04:00+01:00
created: 2014-01-15T14:54:24+01:00
status: 1

moteur éolien
type: Concept
modified: 2015-10-07T17:19:29+02:00
in scheme: Thésaurus de la désignation des objets mobiliers
broader: moteur à énergie mécanique
alternative label: aéromoteur
created: 2012-05-16T00:00:00+02:00
definition: Moteur à énergie mécanique utilisant l'énergie motrice du vent.
status: 1
narrow match: http://data.bnf.fr/ark:/12148/cb119358702

moteur à poids
type: Concept
modified: 2015-08-06T11:31:03+02:00
in scheme: Thésaurus de la désignation des objets mobiliers
broader: moteur à énergie mécanique
created: 2012-05-16T00:00:00+02:00
related: T69-3552
definition: Moteur à énergie mécanique utilisant l'énergie accumulée par l'élévation d'une masse.
TermeAssocie: T69-3552
status: 1

moteur à énergie mécanique
type: PreferredTerm
modified: 2015-08-05T15:56:20+02:00
created: 2014-01-15T14:54:24+01:00
status: 1

moteur à ressort
type: Concept
modified: 2015-08-06T11:33:55+02:00
in scheme: Thésaurus de la désignation des objets mobiliers
broader: moteur à énergie mécanique
created: 2012-05-16T00:00:00+02:00
definition: Moteur à énergie mécanique utilisant l'énergie accumulée par un ressort comprimé.
status: 1

coffre à linge sale
type: SimpleNonPreferredTerm
modified: 2014-12-04T16:22:33+01:00
created: 2014-01-15T14:54:24+01:00
status: 1

coffre
type: PreferredTerm
modified: 2014-12-04T16:22:33+01:00
created: 2014-01-15T14:54:24+01:00
status: 1

coffre garde-manger
type: SimpleNonPreferredTerm
modified: 2014-12-04T16:22:33+01:00
created: 2014-01-15T14:54:24+01:00
status: 1

coffre à vêtements
type: Concept
modified: 2014-12-04T16:04:50+01:00
in scheme: Thésaurus de la désignation des objets mobiliers
preferred label: clothes chests @en-us
broader: coffre
created: 2012-05-16T00:00:00+02:00
definition: Coffre de bois servant au rangement des effets personnels et du linge. Il est de plan rectangulaire, très généralement à serrure, mais ne peut se distinguer que lorsqu'il comporte un coffret (écrin, trésor, chétron), placé au sommet des parois latérales et du dos, fermé par un couvercle.
status: 1
broad match: cb13162914n

coffret à jouets
type: SimpleNonPreferredTerm
modified: 2014-12-04T16:22:33+01:00
created: 2014-01-15T14:54:24+01:00
status: 1

divisions architecturales
type: PreferredTerm
modified: 2014-09-08T14:36:22+02:00
created: 2014-01-15T14:54:24+01:00
status: 1

tambour de porte
type: Concept
modified: 2015-01-16T17:28:20+01:00
in scheme: Thésaurus de la désignation des objets mobiliers
preferred label: entry cubicles @en-us
broader: divisions architecturales
created: 2012-05-16T00:00:00+02:00
definition: Sas, généralement en menuiserie, construit aux dépens de l'espace intérieur, derrière une porte, pour éviter les courants d'air.
status: 1
broad match: cb11948204j

tribune
type: Concept
modified: 2015-01-23T17:00:52+01:00
in scheme: Thésaurus de la désignation des objets mobiliers
preferred label: tribunes (stories) @en-us
narrower: T69-83
broader: divisions architecturales
created: 2012-05-16T00:00:00+02:00
scope note: Ne pas confondre la tribune découverte avec le balcon, ni avec la loggia. Voir aussi le Thesaurus de la désignation des œuvres architecturales et des espaces aménagés.
related: T69-135
definition: Pièce ou galerie placée à l'étage, ouvrant sur l'intérieur d'un vaisseau ou constituant par elle-même un demi-étage s'ouvrant sur l'intérieur d'une pièce.
TermeAssocie: T69-135
status: 1
broad match: http://data.bnf.fr/ark:/12148/cb14447846f

porche
type: Concept
modified: 2015-01-16T17:24:05+01:00
in scheme: Thésaurus de la désignation des objets mobiliers
preferred label: porches @en-us
broader: divisions architecturales
created: 2012-05-16T00:00:00+02:00
scope note: Voir aussi le Thesaurus de la désignation des œuvres architecturales et des espaces aménagés.
definition: Pièce ou galerie commandant l'entrée d'un bâtiment. Formant un avant-corps bas, le porche est généralement hors-œuvre.
status: 1

enveloppe pour les pains azymes
type: Concept
modified: 2014-01-10T00:00:00+01:00
in scheme: Thésaurus de la désignation des objets mobiliers
broader: linge et garniture liés aux fêtes liturgiques et au culte domestique
created: 2012-05-16T00:00:00+02:00
definition: Pièce de tissu ou sac à trois compartiments dans lequel on enveloppe les trois matsot (pains azymes) symboles de la fête ou des icônes représentant le repas de Seder peuvent orner ce linge, ainsi que les noms de Cohen, Levi et Israël.
status: 1

enveloppe pour les pains azymes
type: PreferredTerm
modified: 2014-01-10T00:00:00+01:00
created: 2014-01-15T14:54:24+01:00
status: 1

rasoir
type: PreferredTerm
modified: 2014-12-10T16:29:47+01:00
created: 2014-01-15T14:54:24+01:00
status: 1

coupe-chou
type: SimpleNonPreferredTerm
modified: 2014-12-10T16:29:47+01:00
created: 2014-01-15T14:54:24+01:00
status: 1

rasoir à rabot
type: SimpleNonPreferredTerm
modified: 2014-12-10T16:29:47+01:00
created: 2014-01-15T14:54:24+01:00
status: 1

croix de sacristie
type: PreferredTerm
modified: 2014-11-26T15:59:47+01:00
created: 2014-01-15T14:54:24+01:00
status: 1

chapier-armoire
type: SimpleNonPreferredTerm
modified: 2014-12-01T15:40:50+01:00
created: 2014-01-15T14:54:24+01:00
status: 1

chapier
type: PreferredTerm
modified: 2014-12-01T15:40:50+01:00
created: 2014-01-15T14:54:24+01:00
status: 1

chapier-commode
type: SimpleNonPreferredTerm
modified: 2014-12-01T15:40:50+01:00
created: 2014-01-15T14:54:24+01:00
status: 1

chapier-coffre
type: SimpleNonPreferredTerm
modified: 2014-12-01T15:40:50+01:00
created: 2014-01-15T14:54:24+01:00
status: 1

miroir de toilette
type: Concept
modified: 2014-10-10T15:15:15+02:00
in scheme: Thésaurus de la désignation des objets mobiliers
preferred label: dressing glasses @en-us
broader: glace
created: 2012-05-16T00:00:00+02:00
definition: Miroir de petite taille reposant à l’arrière sur une jambe et servant à la toilette.
status: 1
broad match: cb13162911m

miroir de toilette
type: PreferredTerm
modified: 2014-10-10T15:15:15+02:00
created: 2014-01-15T14:54:24+01:00
status: 1

machine à former
type: Concept
modified: 2015-10-14T10:55:08+02:00
in scheme: Thésaurus de la désignation des objets mobiliers
narrower: machine à former par pliage
narrower: machine à former par moulage
narrower: machine à former par cintrage
narrower: machine à repousser
narrower: machine à emboutir
broader: machine à façonner
alternative label: machine à magnétoformer
alternative label: machine à thermoformer
created: 2012-05-16T00:00:00+02:00
definition: Machine à façonner par déformation permanente un produit plat, pour obtenir un produit volumique creux.
status: 1

machine à former par pliage
type: Concept
modified: 2015-08-13T11:54:17+02:00
in scheme: Thésaurus de la désignation des objets mobiliers
broader: machine à former
alternative label: plieuse
created: 2012-05-16T00:00:00+02:00
scope note: Ne pas confondre avec machine à plier.
related: machine à plier
definition: Machine à former une surface plane par pliure, pour obtenir un produit à arêtes vives.
TermeAssocie: machine à plier
status: 1
narrow match: Plieuse

machine à former par moulage
type: Concept
modified: 2015-08-13T11:34:23+02:00
in scheme: Thésaurus de la désignation des objets mobiliers
broader: machine à former
created: 2012-05-16T00:00:00+02:00
definition: Machine à former une galette de matière pâteuse par sa mise en forme progressive.
status: 1

machine à thermoformer
type: SimpleNonPreferredTerm
modified: 2015-10-14T10:55:08+02:00
created: 2014-01-15T14:54:24+01:00
status: 1

machine à magnétoformer
type: SimpleNonPreferredTerm
modified: 2015-10-14T10:55:08+02:00
created: 2014-01-15T14:54:24+01:00
status: 1

machine à former
type: PreferredTerm
modified: 2015-10-14T10:55:08+02:00
created: 2014-01-15T14:54:24+01:00
status: 1

machine à former par cintrage
type: Concept
modified: 2015-10-14T11:02:18+02:00
in scheme: Thésaurus de la désignation des objets mobiliers
broader: machine à former
alternative label: cintreuse à rouleaux
created: 2012-05-16T00:00:00+02:00
scope note: Ne pas confondre avec machine à cintrer.
definition: Machine à former une surface plane en bois ou en métal par courbure continue.
status: 1
narrow match: Cintreuse

machine à repousser
type: Concept
modified: 2014-01-10T00:00:00+01:00
in scheme: Thésaurus de la désignation des objets mobiliers
broader: machine à former
created: 2012-05-16T00:00:00+02:00
definition: Machine à former une surface plane par repoussage, à l'aide d'un mandrin mobile et d'une molette.
status: 1

machine à emboutir
type: Concept
modified: 2015-08-13T11:23:56+02:00
in scheme: Thésaurus de la désignation des objets mobiliers
broader: machine à former
alternative label: presse hydraulique
alternative label: presse à emboutir
created: 2012-05-16T00:00:00+02:00
definition: Machine à former une surface plane à l'aide d'un poinçon et d'une matrice.
status: 1
narrow match: Presse hydraulique

borne routière
type: Concept
modified: 2015-02-24T11:14:30+01:00
in scheme: Thésaurus de la désignation des objets mobiliers
preferred label: milestones @en-us
broader: borne
created: 2012-05-16T00:00:00+02:00
scope note: Voir aussi le Thesaurus de la désignation des œuvres architecturales et des espaces aménagés.
definition: Borne indiquant les distances sur les routes ou les noms de ces dernières.
status: 1

borne
type: Concept
modified: 2015-02-24T11:12:46+01:00
in scheme: Thésaurus de la désignation des objets mobiliers
preferred label: markers (monuments) @en-us
narrower: borne routière
broader: édicule ou mobilier de l'espace public ou du génie civil
alternative label: borne de juridiction
alternative label: borne de propriété
alternative label: borne kilométrique
alternative label: borne frontalière
created: 2012-05-16T00:00:00+02:00
scope note: Voir aussi le Thesaurus de la désignation des œuvres architecturales et des espaces aménagés.
definition: Pierre ou autre marque signalant la limite d’une propriété, d’un territoire, indiquant les distances ou servant de repère.
status: 1

borne routière
type: PreferredTerm
modified: 2015-02-24T11:14:30+01:00
created: 2014-01-15T14:54:24+01:00
status: 1

machine à pétrir
type: Concept
modified: 2015-10-15T16:26:39+02:00
in scheme: Thésaurus de la désignation des objets mobiliers
broader: machine à changer d'état
alternative label: pétrin industriel
alternative label: pétrin mécanique
created: 2012-05-16T00:00:00+02:00
related: pétrin
definition: Machine à changer d'état un produit en le brassant ou en le malaxant de façon à obtenir une pâte ou une substance pâteuse.
TermeAssocie: pétrin
status: 1

pétrin
type: PreferredTerm
modified: 2014-12-04T12:46:01+01:00
created: 2014-01-15T14:54:24+01:00
status: 1

goupillon domestique
type: Concept
modified: 2014-10-17T13:55:08+02:00
in scheme: Thésaurus de la désignation des objets mobiliers
broader: objet pour l'entretien de la maison
alternative label: goupillon à bouteille
alternative label: goupillon à cheminée de lampe
alternative label: goupillon à meubles
alternative label: écouvillon
created: 2012-05-16T00:00:00+02:00
related: cheminée de lampe
definition: Brosse constituée d’une tige garnie de poils sur sa longueur servant à nettoyer l’intérieur des bouteilles, des verres de lampes, ou encore les endroits difficilement accessible d’un objet.
TermeAssocie: cheminée de lampe
status: 1
broad match: cb11981075n

goupillon à cheminée de lampe
type: SimpleNonPreferredTerm
modified: 2014-10-17T13:55:08+02:00
created: 2014-01-15T14:54:24+01:00
status: 1

goupillon domestique
type: PreferredTerm
modified: 2014-10-17T13:55:08+02:00
created: 2014-01-15T14:54:24+01:00
status: 1

cheminée de lampe
type: Concept
modified: 2014-10-16T12:36:59+02:00
in scheme: Thésaurus de la désignation des objets mobiliers
preferred label: chimneys (lighting device components) @en-us
broader: instrument ou accessoire pour l'éclairage
alternative label: verrine
alternative label: manchon de lampe
alternative label: verre de lampe
created: 2012-05-16T00:00:00+02:00
related: goupillon domestique
definition: Accessoire en verre de forme cylindrique protégeant la flamme d'une lampe.
TermeAssocie: goupillon domestique
status: 1
broad match: cb11978573t
broad match: Lampe

goupillon à meubles
type: SimpleNonPreferredTerm
modified: 2014-10-17T13:55:08+02:00
created: 2014-01-15T14:54:24+01:00
status: 1

écouvillon
type: SimpleNonPreferredTerm
modified: 2014-10-17T13:55:08+02:00
created: 2014-01-15T14:54:24+01:00
status: 1

goupillon à bouteille
type: SimpleNonPreferredTerm
modified: 2014-10-17T13:55:08+02:00
created: 2014-01-15T14:54:24+01:00
status: 1

couteau eucharistique
type: Concept
modified: 2014-11-27T14:59:53+01:00
in scheme: Thésaurus de la désignation des objets mobiliers
preferred label: eucharistic knives @en-us
preferred label: coltello eucaristico @it
preferred label: faca eucarística @pt
broader: objet lié à l'Eucharistie
alternative label: lance eucharistique
alternative label: couteau à pain bénit
alternative label: couteau à hosties
created: 2012-05-16T00:00:00+02:00
definition: Ustensile ayant servi autrefois à couper en morceaux, avant sa consécration, le pain utilisé pour la communion.
status: 1

couteau à hosties
type: SimpleNonPreferredTerm
modified: 2014-11-27T14:59:53+01:00
created: 2014-01-15T14:54:24+01:00
status: 1

couteau eucharistique
type: PreferredTerm
modified: 2014-11-27T14:59:53+01:00
created: 2014-01-15T14:54:24+01:00
status: 1

lance eucharistique
type: SimpleNonPreferredTerm
modified: 2014-11-27T14:59:53+01:00
created: 2014-01-15T14:54:24+01:00
status: 1

couteau à pain bénit
type: SimpleNonPreferredTerm
modified: 2014-11-27T14:59:53+01:00
created: 2014-01-15T14:54:24+01:00
status: 1

assiette à dessert
type: SimpleNonPreferredTerm
modified: 2014-12-08T16:26:39+01:00
created: 2014-01-15T14:54:24+01:00
status: 1

assiette-réchaud
type: SimpleNonPreferredTerm
modified: 2014-12-08T16:26:39+01:00
created: 2014-01-15T14:54:24+01:00
status: 1

assiette à compartiments
type: SimpleNonPreferredTerm
modified: 2014-12-08T16:26:39+01:00
created: 2014-01-15T14:54:24+01:00
status: 1

assiette
type: PreferredTerm
modified: 2014-12-08T16:26:39+01:00
created: 2014-01-15T14:54:24+01:00
status: 1

assiette à bouillie
type: SimpleNonPreferredTerm
modified: 2014-12-08T16:26:39+01:00
created: 2014-01-15T14:54:24+01:00
status: 1

assiette à escargots
type: SimpleNonPreferredTerm
modified: 2014-12-08T16:26:39+01:00
created: 2014-01-15T14:54:24+01:00
status: 1

assiette à coquillages
type: SimpleNonPreferredTerm
modified: 2014-12-08T16:26:39+01:00
created: 2014-01-15T14:54:24+01:00
status: 1

assiette à artichaut
type: SimpleNonPreferredTerm
modified: 2014-12-08T16:26:39+01:00
created: 2014-01-15T14:54:24+01:00
status: 1

assiette à asperges
type: SimpleNonPreferredTerm
modified: 2014-12-08T16:26:39+01:00
created: 2014-01-15T14:54:24+01:00
status: 1

assiette d'accordailles
type: SimpleNonPreferredTerm
modified: 2014-12-08T16:26:39+01:00
created: 2014-01-15T14:54:24+01:00
status: 1

assiette à rôti
type: SimpleNonPreferredTerm
modified: 2014-12-08T16:26:39+01:00
created: 2014-01-15T14:54:24+01:00
status: 1

assiette à œufs
type: SimpleNonPreferredTerm
modified: 2014-12-08T16:26:39+01:00
created: 2014-01-15T14:54:24+01:00
status: 1

assiette à l'italienne
type: SimpleNonPreferredTerm
modified: 2014-12-08T16:26:39+01:00
created: 2014-01-15T14:54:24+01:00
status: 1

assiette à salade
type: SimpleNonPreferredTerm
modified: 2014-12-08T16:26:39+01:00
created: 2014-01-15T14:54:24+01:00
status: 1

assiette creuse
type: SimpleNonPreferredTerm
modified: 2014-12-08T16:26:39+01:00
created: 2014-01-15T14:54:24+01:00
status: 1

assiette plate
type: SimpleNonPreferredTerm
modified: 2014-12-08T16:26:39+01:00
created: 2014-01-15T14:54:24+01:00
status: 1

assiette patronymique
type: SimpleNonPreferredTerm
modified: 2014-12-08T16:26:39+01:00
created: 2014-01-15T14:54:24+01:00
status: 1

assiette calotte
type: SimpleNonPreferredTerm
modified: 2014-12-08T16:26:39+01:00
created: 2014-01-15T14:54:24+01:00
status: 1

assiette de baptême
type: SimpleNonPreferredTerm
modified: 2014-12-08T16:26:39+01:00
created: 2014-01-15T14:54:24+01:00
status: 1

roue à clochettes
type: Concept
modified: 2014-12-15T12:38:13+01:00
in scheme: Thésaurus de la désignation des objets mobiliers
preferred label: wheel bells @en-us
preferred label: ruota di campanelli @it
broader: idiophone à émission par percussion directe
created: 2012-05-16T00:00:00+02:00
definition: Instrument constitué d'une roue simple ou double, sur le pourtour de laquelle sont fixées des clochettes. Elle est actionnée au moyen d'une manivelle, d'un bâton ou d'une corde tendant un ressort, pour marquer certains moments importants d'un office. Elle est fixée au mur près d'un autel.
status: 1
broad match: http://data.bnf.fr/ark:/12148/cb16687544c
broad match: http://vocab.getty.edu/aat/300041659

roue à clochettes
type: PreferredTerm
modified: 2014-12-15T12:38:13+01:00
created: 2014-01-15T14:54:24+01:00
status: 1

pot à eau
type: Concept
modified: 2014-12-08T16:08:49+01:00
in scheme: Thésaurus de la désignation des objets mobiliers
preferred label: water jugs @en-us
broader: récipient pour le service et la consommation des boissons
alternative label: pot à eau de déjeuner
created: 2012-05-16T00:00:00+02:00
definition: Récipient verseur couvert pour le service de l'eau chaude destinée à la consommation du thé. Il comporte un goulot et une anse latérale verticale. Ce pot fait souvent partie d'un service ou d'un déjeuner.
status: 1
broad match: http://vocab.getty.edu/aat/300045685

pot à eau de déjeuner
type: SimpleNonPreferredTerm
modified: 2014-12-08T16:08:49+01:00
created: 2014-01-15T14:54:24+01:00
status: 1

pot à eau
type: PreferredTerm
modified: 2014-12-08T16:08:49+01:00
created: 2014-01-15T14:54:24+01:00
status: 1

statue de procession
type: PreferredTerm
modified: 2014-11-28T13:00:19+01:00
created: 2014-01-15T14:54:24+01:00
status: 1

cire de deuil
type: Concept
modified: 2014-11-27T10:54:31+01:00
in scheme: Thésaurus de la désignation des objets mobiliers
preferred label: mourning candles @en-us
preferred label: cero del lutto @it
preferred label: círio de luto @pt
broader: objet funéraire
alternative label: cire funéraire
created: 2012-05-16T00:00:00+02:00
related: cierge
definition: Fine chandelle mise en forme de façon décorative, déposée et allumée pendant toute la période du deuil à la place qu'occupait un défunt à l'intérieur d'une église. Elle peut être décorée et disposée dans une petite corbeille ou sur un petit plateau.
TermeAssocie: cierge
status: 1
broad match: http://data.bnf.fr/ark:/12148/cb119367105
broad match: http://vocab.getty.edu/aat/300234126

cire de deuil
type: PreferredTerm
modified: 2014-11-27T10:54:31+01:00
created: 2014-01-15T14:54:24+01:00
status: 1

cire funéraire
type: SimpleNonPreferredTerm
modified: 2014-11-27T10:54:31+01:00
created: 2014-01-15T14:54:24+01:00
status: 1

moulin de cuisine
type: PreferredTerm
modified: 2014-12-05T16:22:47+01:00
created: 2014-01-15T14:54:24+01:00
status: 1

moulin à épices
type: SimpleNonPreferredTerm
modified: 2014-12-05T16:22:47+01:00
created: 2014-01-15T14:54:24+01:00
status: 1

moulin à grains
type: SimpleNonPreferredTerm
modified: 2014-12-05T16:22:47+01:00
created: 2014-01-15T14:54:24+01:00
status: 1

moulin à sucre
type: SimpleNonPreferredTerm
modified: 2014-12-05T16:22:47+01:00
created: 2014-01-15T14:54:24+01:00
status: 1

moulin à sel
type: SimpleNonPreferredTerm
modified: 2014-12-05T16:22:47+01:00
created: 2014-01-15T14:54:24+01:00
status: 1

moulin à café
type: SimpleNonPreferredTerm
modified: 2014-12-05T16:22:47+01:00
created: 2014-01-15T14:54:24+01:00
status: 1

moulin à légumes
type: SimpleNonPreferredTerm
modified: 2014-12-05T16:22:47+01:00
created: 2014-01-15T14:54:24+01:00
status: 1

tesson
type: SimpleNonPreferredTerm
modified: 2014-05-27T17:08:00+02:00
created: 2014-01-15T14:54:24+01:00
status: 1

percuteur
type: SimpleNonPreferredTerm
modified: 2014-05-27T17:08:00+02:00
created: 2014-01-15T14:54:24+01:00
status: 1

pierre polie
type: SimpleNonPreferredTerm
modified: 2014-05-27T17:08:00+02:00
created: 2014-01-15T14:54:24+01:00
status: 1

matériel archéologique
type: PreferredTerm
modified: 2014-05-27T17:08:00+02:00
created: 2014-01-15T14:54:24+01:00
status: 1

pierre taillée
type: SimpleNonPreferredTerm
modified: 2014-05-27T17:08:00+02:00
created: 2014-01-15T14:54:24+01:00
status: 1

silex
type: SimpleNonPreferredTerm
modified: 2014-05-27T17:08:00+02:00
created: 2014-01-15T14:54:24+01:00
status: 1

marque d'appartenance ou d'autorité
type: Concept
modified: 2014-10-02T13:50:34+02:00
in scheme: Thésaurus de la désignation des objets mobiliers
narrower: matrice de sceau
narrower: anneau sigillaire
narrower: poinçon d'orfèvre
narrower: empreinte de sceau
narrower: plaque d'insculpation
broader: bijouterie et orfèvrerie civiles, monnaie, médaille
created: 2013-11-29T00:00:00+01:00
definition: <!--[if gte mso 9]> <o:OfficeDocumentSettings> <o:AllowPNG/> </o:OfficeDocumentSettings> <![endif]-->Élément de métal ou de pierre dure, monté sur un anneau ou sur un manche, gravé en creux ou en relief de symboles, initiales, emblèmes ou tout signe propre à une autorité, ou bien empreinte réalisée par cet instrument, destinée à marquer des objets pour en garantir la provenance ou l'authenticité.
status: 1

marque d'appartenance ou d'autorité
type: PreferredTerm
modified: 2014-10-02T13:50:34+02:00
created: 2014-01-15T14:54:24+01:00
status: 1

plaque d'insculpation
type: Concept
modified: 2014-12-30T12:51:28+01:00
in scheme: Thésaurus de la désignation des objets mobiliers
broader: marque d'appartenance ou d'autorité
created: 2013-11-29T00:00:00+01:00
definition: Plaque de cuivre sur laquelle l’administration fiscale de la Garantie consigne le poinçon de chaque orfèvre, son nom et son numéro d’enregistrement afin d’en garantir la validité et l’unicité.
status: 1
broad match: http://data.bnf.fr/ark:/12148/cb119389168
broad match: http://vocab.getty.edu/aat/300028744

pâtissière
type: SimpleNonPreferredTerm
modified: 2014-12-08T12:40:16+01:00
created: 2014-01-15T14:54:24+01:00
status: 1

tourtière
type: PreferredTerm
modified: 2014-12-08T12:40:16+01:00
created: 2014-01-15T14:54:24+01:00
status: 1

tartière
type: SimpleNonPreferredTerm
modified: 2014-12-08T12:40:16+01:00
created: 2014-01-15T14:54:24+01:00
status: 1

trompette naturelle
type: PreferredTerm
modified: 2014-10-10T12:12:56+02:00
created: 2014-01-15T14:54:24+01:00
status: 1

bugle
type: Concept
modified: 2014-12-15T10:52:42+01:00
in scheme: Thésaurus de la désignation des objets mobiliers
preferred label: bugles (valveless aerophones) @en-us
broader: trompette naturelle
alternative label: clairon
created: 2012-05-16T00:00:00+02:00
definition: Instrument en cuivre de forme compacte, à perce large et conique et tuyau enroulé sur lui-même. De fonction essentiellement militaire, il possède quelquefois des pistons ou des clés. Le clairon, sans pistons, est utilisé dans les fanfares militaires.
status: 1

conque marine
type: Concept
modified: 2014-12-15T10:54:41+01:00
in scheme: Thésaurus de la désignation des objets mobiliers
preferred label: conchs (trumpets) @en-us
broader: trompette naturelle
created: 2012-05-16T00:00:00+02:00
definition: Coquille marine aménagée et utilisée par les bergers pour rassembler les troupeaux. Son embouchure est pratiquée dans la spirale du coquillage.
status: 1
broad match: http://vocab.getty.edu/aat/300224127

sonnette d'autel
type: PreferredTerm
modified: 2014-12-15T12:28:59+01:00
created: 2014-01-15T14:54:24+01:00
status: 1

carillon liturgique
type: SimpleNonPreferredTerm
modified: 2014-12-15T12:28:59+01:00
created: 2014-01-15T14:54:24+01:00
status: 1

calice funéraire
type: Concept
modified: 2014-11-27T10:51:58+01:00
in scheme: Thésaurus de la désignation des objets mobiliers
preferred label: calice funerario @it
preferred label: tomb chalices @en-us
preferred label: cálice funerário @pt
broader: objet funéraire
created: 2012-05-16T00:00:00+02:00
related: patène funéraire
definition: Calice non consacré, en matériaux non précieux et sans dorure intérieure, destiné à être déposé dans une tombe d'ecclésiastique et non pas à être utilisé pour l'Eucharistie.
TermeAssocie: patène funéraire
status: 1

objet funéraire
type: PreferredTerm
modified: 2014-11-27T10:43:31+01:00
created: 2014-01-15T14:54:24+01:00
status: 1

lacrymatoire
type: Concept
modified: 2014-11-27T11:05:12+01:00
in scheme: Thésaurus de la désignation des objets mobiliers
preferred label: lachrymatories @en-us
preferred label: lacrimatorio @it
preferred label: lacrimatório @pt
broader: objet funéraire
created: 2012-05-16T00:00:00+02:00
definition: Fiole de verre ou d'albâtre servant à contenir un liquide ou des onguents parfumés que l'on déposait dans les sépultures, à la fin de l'Antiquité et au haut Moyen Age.
status: 1
broad match: http://vocab.getty.edu/aat/300234126
broad match: http://data.bnf.fr/ark:/12148/cb13601651d

fond d'or
type: SimpleNonPreferredTerm
modified: 2014-11-27T10:43:31+01:00
created: 2014-01-15T14:54:24+01:00
status: 1

diptyque commémoratif
type: Concept
modified: 2014-11-27T11:03:47+01:00
in scheme: Thésaurus de la désignation des objets mobiliers
preferred label: commemorative diptychs @en-us
preferred label: dittico commemorativo @it
preferred label: díptico comemorativo @pt
broader: objet funéraire
created: 2012-05-16T00:00:00+02:00
definition: Paire de petits panneaux, généralement en ivoire ou en os, attachés ensemble au moyen de charnières. Il est décoré, à l'extérieur, de scènes ou de figures religieuses, et porte à l'intérieur une liste de noms de personnes à lire pendant la messe, lors de la prière d'intercession pour les vivants et les morts.
status: 1

cierge funéraire
type: Concept
modified: 2014-11-27T10:53:30+01:00
in scheme: Thésaurus de la désignation des objets mobiliers
preferred label: funeral candles @en-us
preferred label: cero funebre @it
preferred label: círio fúnebre @pt
broader: objet funéraire
alternative label: cierge d'honneur
created: 2012-05-16T00:00:00+02:00
related: cierge
definition: Chandelle mise en forme de façon décorative, déposée et allumée sur le cercueil ou portée autour de lui pendant une cérémonie funéraire ou encore allumée sur la tombe après l'inhumation. Le cierge funéraire peut être en forme de croix et porter un crucifix, être peint de motifs aux couleurs funéraires, être entouré d'un ruban noir, des armoiries du défunt, etc.
TermeAssocie: cierge
status: 1
broad match: http://data.bnf.fr/ark:/12148/cb119367105

fond de coupe
type: SimpleNonPreferredTerm
modified: 2014-11-27T10:43:31+01:00
created: 2014-01-15T14:54:24+01:00
status: 1

boîte à crâne
type: Concept
modified: 2014-11-27T10:50:51+01:00
in scheme: Thésaurus de la désignation des objets mobiliers
preferred label: skull urns @en-us
preferred label: urna del teschio @it
preferred label: caixa de crânio @pt
broader: objet funéraire
alternative label: maison à crâne
created: 2012-05-16T00:00:00+02:00
scope note: Ne pas confondre avec le reliquaire de crâne.
definition: Boîte généralement en bois dans laquelle on plaçait le crâne d'un défunt pour le conserver à la vue, au moment où l'on déposait son squelette dans un ossuaire. Elle présente souvent une ouverture à sa partie antérieure pour laisser voir le crâne. Elle est peinte de motifs et de couleurs funéraires et porte une inscription donnant le nom du mort, la date de son décès, parfois son âge et diverses invocations.
status: 1
broad match: http://vocab.getty.edu/aat/300197579

pantalon
type: Concept
modified: 2014-12-11T16:45:05+01:00
in scheme: Thésaurus de la désignation des objets mobiliers
preferred label: trousers @en-us
broader: vêtement d'intérieur ou d'extérieur
alternative label: culotte
created: 2012-05-16T00:00:00+02:00
definition: Vêtement porté sur la partie inférieure du corps, les deux jambes étant couvertes séparément.
status: 1

culotte
type: SimpleNonPreferredTerm
modified: 2014-12-11T16:45:05+01:00
created: 2014-01-15T14:54:24+01:00
status: 1

pantalon
type: PreferredTerm
modified: 2014-12-11T16:45:05+01:00
created: 2014-01-15T14:54:24+01:00
status: 1

meuble à transformation
type: PreferredTerm
modified: 2014-10-10T15:51:34+02:00
created: 2014-01-15T14:54:24+01:00
status: 1

siège à transformations
type: SimpleNonPreferredTerm
modified: 2014-10-10T15:51:34+02:00
created: 2014-01-15T14:54:24+01:00
status: 1

table à transformations
type: SimpleNonPreferredTerm
modified: 2014-10-10T15:51:34+02:00
created: 2014-01-15T14:54:24+01:00
status: 1

banc public
type: Concept
modified: 2015-02-24T11:39:55+01:00
in scheme: Thésaurus de la désignation des objets mobiliers
broader: siège public
created: 2012-05-16T00:00:00+02:00
scope note: Voir aussi le Thesaurus de la désignation des œuvres architecturales et des espaces aménagés.
definition: Siège à plusieurs places, fixé au sol, situé le long d'une allée, d'un trottoir, etc. ou dans un parc, un jardin public, etc.
status: 1

banc public
type: PreferredTerm
modified: 2015-02-24T11:39:55+01:00
created: 2014-01-15T14:54:24+01:00
status: 1

siège public
type: Concept
modified: 2014-10-15T16:54:18+02:00
in scheme: Thésaurus de la désignation des objets mobiliers
narrower: banc public
broader: édicule ou mobilier de l'espace public ou du génie civil
created: 2012-05-16T00:00:00+02:00
definition: Siège installé dans un lieu public : édifice, square, boulevard, jardin, etc.
status: 1
broad match: http://data.bnf.fr/ark:/12148/cb12011170b
broad match: http://vocab.getty.edu/aat/300165810

brassard de la croix rouge
type: SimpleNonPreferredTerm
modified: 2014-12-12T10:29:23+01:00
created: 2014-01-15T14:54:24+01:00
status: 1

vêtement spécifique lié à une fonction civile
type: PreferredTerm
modified: 2014-12-12T10:29:23+01:00
created: 2014-01-15T14:54:24+01:00
status: 1

uniforme civil
type: SimpleNonPreferredTerm
modified: 2014-12-12T10:29:23+01:00
created: 2014-01-15T14:54:24+01:00
status: 1

équipement de pompier
type: SimpleNonPreferredTerm
modified: 2014-12-12T10:29:23+01:00
created: 2014-01-15T14:54:24+01:00
status: 1

tenue d'infirmière
type: SimpleNonPreferredTerm
modified: 2014-12-12T10:29:23+01:00
created: 2014-01-15T14:54:24+01:00
status: 1

tenue de police
type: SimpleNonPreferredTerm
modified: 2014-12-12T10:29:23+01:00
created: 2014-01-15T14:54:24+01:00
status: 1

tablier maçonnique
type: SimpleNonPreferredTerm
modified: 2014-12-12T10:29:23+01:00
created: 2014-01-15T14:54:24+01:00
status: 1

étui à cigares ou cigarettes
type: Concept
modified: 2014-12-10T15:31:23+01:00
in scheme: Thésaurus de la désignation des objets mobiliers
preferred label: cigar or cigarette cases @en-us
broader: objet pour fumer et priser
alternative label: étui à paquet de cigarettes
alternative label: porte-cigares ou cigarettes
created: 2012-05-16T00:00:00+02:00
definition: Étui de poche en matériau rigide, comportant un ou plusieurs compartiments dans lesquels on range des cigares ou des cigarettes.
status: 1

étui à paquet de cigarettes
type: SimpleNonPreferredTerm
modified: 2014-12-10T15:31:23+01:00
created: 2014-01-15T14:54:24+01:00
status: 1

étui à cigares ou cigarettes
type: PreferredTerm
modified: 2014-12-10T15:31:23+01:00
created: 2014-01-15T14:54:24+01:00
status: 1

porte-cigares ou cigarettes
type: SimpleNonPreferredTerm
modified: 2014-12-10T15:31:23+01:00
created: 2014-01-15T14:54:24+01:00
status: 1

poteau
type: Concept
modified: 2014-12-15T16:06:41+01:00
in scheme: Thésaurus de la désignation des objets mobiliers
preferred label: posts (structural elements) @en-us
broader: pièce de charpente
created: 2012-05-16T00:00:00+02:00
definition: Pièce maîtresse verticale d'une charpente.
status: 1

pièce de charpente
type: Concept
modified: 2014-10-15T13:34:31+02:00
in scheme: Thésaurus de la désignation des objets mobiliers
narrower: poteau
narrower: poutre
narrower: sablière
narrower: blochet
narrower: poinçon de charpente
narrower: solive
narrower: entrait
broader: charpente
alternative label: lambourde
created: 2012-05-16T00:00:00+02:00
definition: Elément constitutif de la charpente, horizontal ou vertical, qu'il s'agisse d'un toit, d'un pan-de-bois ou d'un plancher.
status: 1
broad match: http://vocab.getty.edu/aat/300078053
broad match: http://data.bnf.fr/ark:/12148/cb11977467c
broad match: Charpente

poteau
type: PreferredTerm
modified: 2014-12-15T16:06:41+01:00
created: 2014-01-15T14:54:24+01:00
status: 1

grotte de Lourdes
type: Concept
modified: 2015-02-24T12:07:15+01:00
in scheme: Thésaurus de la désignation des objets mobiliers
preferred label: Lourdes grottoes @en-us
broader: édicule religieux chrétien
alternative label: rocher de Lourdes
created: 2012-05-16T00:00:00+02:00
scope note: Voir aussi le Thesaurus de la désignation des œuvres architecturales et des espaces aménagés.
definition: Edicule évoquant la grotte miraculeuse de Lourdes, comprenant un rocher artificiel ou aménagé abritant une statue de l'Immaculée Conception dans une niche et au pied duquel on trouve généralement une seconde statue représentant sainte Bernadette en prière.
status: 1

rocher de Lourdes
type: SimpleNonPreferredTerm
modified: 2015-02-24T12:07:15+01:00
created: 2014-01-15T14:54:24+01:00
status: 1

grotte de Lourdes
type: PreferredTerm
modified: 2015-02-24T12:07:15+01:00
created: 2014-01-15T14:54:24+01:00
status: 1

rouet à envider
type: PreferredTerm
modified: 2014-12-10T14:49:09+01:00
created: 2014-01-15T14:54:24+01:00
status: 1

ciboire des malades
type: Concept
modified: 2014-11-27T14:45:05+01:00
in scheme: Thésaurus de la désignation des objets mobiliers
preferred label: Viaticum pyxes @en-us
preferred label: pisside da viatico @it
preferred label: âmbula @pt
broader: ciboire
alternative label: custode
alternative label: pyxide pédiculée des malades
alternative label: porte-Dieu
alternative label: pyxide des malades
alternative label: ciboire-viatique
created: 2012-05-16T00:00:00+02:00
related: voile huméral
related: pavillon de ciboire
related: bourse du viatique
related: ampoule à huile des malades
related: coffret pour le viatique
definition: Vase sacré servant à porter le viatique (communion des malades). Il a souvent la forme d'un ciboire de plus petites dimensions. Lorsque le pied est absent (ou réduit à une petite base), il prend le nom de pyxide (pédiculée) des malades. Lorsqu’il a la forme d’une boîte plate, il prend le nom de custode.
TermeAssocie: voile huméral
TermeAssocie: pavillon de ciboire
TermeAssocie: bourse du viatique
TermeAssocie: ampoule à huile des malades
TermeAssocie: coffret pour le viatique
status: 1

voile huméral pour un reliquaire de la Vraie Croix
type: SimpleNonPreferredTerm
modified: 2014-12-03T12:01:40+01:00
created: 2014-01-15T14:54:24+01:00
status: 1

voile huméral du sous-diacre
type: SimpleNonPreferredTerm
modified: 2014-12-03T12:01:40+01:00
created: 2014-01-15T14:54:24+01:00
status: 1

voile huméral pour les saintes huiles
type: SimpleNonPreferredTerm
modified: 2014-12-03T12:01:40+01:00
created: 2014-01-15T14:54:24+01:00
status: 1

voile huméral
type: PreferredTerm
modified: 2014-12-03T12:01:40+01:00
created: 2014-01-15T14:54:24+01:00
status: 1

voile de crédence
type: SimpleNonPreferredTerm
modified: 2014-12-03T12:01:40+01:00
created: 2014-01-15T14:54:24+01:00
status: 1

voile huméral du saint sacrement
type: SimpleNonPreferredTerm
modified: 2014-12-03T12:01:40+01:00
created: 2014-01-15T14:54:24+01:00
status: 1

vimpa
type: SimpleNonPreferredTerm
modified: 2014-12-03T12:01:40+01:00
created: 2014-01-15T14:54:24+01:00
status: 1

écharpe pour les saintes huiles
type: SimpleNonPreferredTerm
modified: 2014-12-03T12:01:40+01:00
created: 2014-01-15T14:54:24+01:00
status: 1

voile huméral d'acolyte
type: SimpleNonPreferredTerm
modified: 2014-12-03T12:01:40+01:00
created: 2014-01-15T14:54:24+01:00
status: 1

écharpe d'acolyte
type: SimpleNonPreferredTerm
modified: 2014-12-03T12:01:40+01:00
created: 2014-01-15T14:54:24+01:00
status: 1

véhicule pour le transport des animaux
type: Concept
modified: 2014-10-16T12:01:12+02:00
in scheme: Thésaurus de la désignation des objets mobiliers
broader: véhicule terrestre spécialisé motorisé ou non
alternative label: bétaillère
alternative label: van à chevaux
created: 2013-11-06T00:00:00+01:00
definition: Véhicule destiné au transport des animaux vivants.
status: 1
narrow match: Van (cheval)

véhicule terrestre spécialisé motorisé ou non
type: Concept
modified: 2014-10-16T11:51:39+02:00
in scheme: Thésaurus de la désignation des objets mobiliers
narrower: véhicule de lutte contre l'incendie
narrower: véhicule pour le transport des animaux
narrower: triporteur
narrower: véhicule de commerce ambulant
narrower: véhicule de police
narrower: ambulance
narrower: T69-8994
narrower: T69-8144
broader: matériel de transport terrestre
created: 2013-11-05T00:00:00+01:00
definition: Véhicule motorisé ou non (en fonction de son ancienneté) qui est moins affecté à une mission de transport de marchandises ou de personnes qu'à une tâche spécifique en fonction de son type.
status: 1
broad match: http://data.bnf.fr/ark:/12148/cb11975775b
broad match: Véhicule

véhicule pour le transport des animaux
type: PreferredTerm
modified: 2014-10-16T12:01:12+02:00
created: 2014-01-15T14:54:24+01:00
status: 1

bétaillère
type: SimpleNonPreferredTerm
modified: 2014-10-16T12:01:12+02:00
created: 2014-01-15T14:54:24+01:00
status: 1

van à chevaux
type: SimpleNonPreferredTerm
modified: 2014-10-16T12:01:12+02:00
created: 2014-01-15T14:54:24+01:00
status: 1

orgue mécanique
type: Concept
modified: 2014-12-15T11:21:57+01:00
in scheme: Thésaurus de la désignation des objets mobiliers
preferred label: barrel organs (organs) @en-us
broader: aérophone pouvant combiner plusieurs systèmes d'émission
alternative label: serinette
alternative label: limonaire
alternative label: perroquette
alternative label: orgue de foire
alternative label: orgue de danse
alternative label: orgue de Barbarie
alternative label: merline
created: 2012-05-16T00:00:00+02:00
definition: Instrument à lame vibrante et/ou à tuyauterie, fonctionnant selon les mêmes principes que l'orgue. Il est cependant doté d'un système de reproduction mécanique (à cylindres de métal et/ou cartons perforés) sur lequel est notée la partition et actionné par une manivelle.
status: 1
narrow match: Orgue de Barbarie

orgue de foire
type: SimpleNonPreferredTerm
modified: 2014-12-15T11:21:57+01:00
created: 2014-01-15T14:54:24+01:00
status: 1

orgue de danse
type: SimpleNonPreferredTerm
modified: 2014-12-15T11:21:57+01:00
created: 2014-01-15T14:54:24+01:00
status: 1

perroquette
type: SimpleNonPreferredTerm
modified: 2014-12-15T11:21:57+01:00
created: 2014-01-15T14:54:24+01:00
status: 1

orgue mécanique
type: PreferredTerm
modified: 2014-12-15T11:21:57+01:00
created: 2014-01-15T14:54:24+01:00
status: 1

serinette
type: SimpleNonPreferredTerm
modified: 2014-12-15T11:21:57+01:00
created: 2014-01-15T14:54:24+01:00
status: 1

limonaire
type: SimpleNonPreferredTerm
modified: 2014-12-15T11:21:57+01:00
created: 2014-01-15T14:54:24+01:00
status: 1

orgue de Barbarie
type: SimpleNonPreferredTerm
modified: 2014-12-15T11:21:57+01:00
created: 2014-01-15T14:54:24+01:00
status: 1

merline
type: SimpleNonPreferredTerm
modified: 2014-12-15T11:21:57+01:00
created: 2014-01-15T14:54:24+01:00
status: 1

machine à clouer
type: PreferredTerm
modified: 2015-10-08T11:58:56+02:00
created: 2014-01-15T14:54:24+01:00
status: 1

cuillère à médicament
type: SimpleNonPreferredTerm
modified: 2014-01-10T00:00:00+01:00
created: 2014-01-15T14:54:24+01:00
status: 1

cuiller à médicament
type: PreferredTerm
modified: 2014-01-10T00:00:00+01:00
created: 2014-01-15T14:54:24+01:00
status: 1

collier
type: PreferredTerm
modified: 2014-12-30T12:30:30+01:00
created: 2014-01-15T14:54:24+01:00
status: 1

bugle
type: PreferredTerm
modified: 2014-12-15T10:52:42+01:00
created: 2014-01-15T14:54:24+01:00
status: 1

clairon
type: SimpleNonPreferredTerm
modified: 2014-12-15T10:52:42+01:00
created: 2014-01-15T14:54:24+01:00
status: 1

clavicorde
type: Concept
modified: 2014-12-15T11:53:29+01:00
in scheme: Thésaurus de la désignation des objets mobiliers
preferred label: clavichords @en-us
broader: cithare à clavier
created: 2012-05-16T00:00:00+02:00
definition: Instrument de petites dimensions, à caisse rectangulaire, dont les cordes sont frappées au moyen de dispositifs appelés tangentes. La table d'harmonie occupe la partie droite de l'instrument tandis que le clavier est positionné dans la partie gauche. Le plan de cordes est horizontal, placé au clavier.
status: 1

clavicorde
type: PreferredTerm
modified: 2014-12-15T11:53:29+01:00
created: 2014-01-15T14:54:24+01:00
status: 1

calendrier pour le décompte de l''Omer
type: Concept
modified: 2014-01-10T00:00:00+01:00
in scheme: Thésaurus de la désignation des objets mobiliers
broader: objet lié à la fête de la Pâque
alternative label: tableau pour le décompte de l'Omer
created: 2012-05-16T00:00:00+02:00
definition: Calendrier permettant de compter les jours de l'Omer c'est-à-dire les sept semaines qui s'écoulent entre le deuxième jour de la Pâque et le premier des deux jours de Shavou'ot (Pentecôte), fête commémorant le don de la Torah au mont Sinaï.
status: 1

tableau pour le décompte de l'Omer
type: SimpleNonPreferredTerm
modified: 2014-01-10T00:00:00+01:00
created: 2014-01-15T14:54:24+01:00
status: 1

calendrier pour le décompte de l''Omer
type: PreferredTerm
modified: 2014-01-10T00:00:00+01:00
created: 2014-01-15T14:54:24+01:00
status: 1

bateau polyvalent de très faible tonnage
type: Concept
modified: 2014-10-16T10:06:53+02:00
in scheme: Thésaurus de la désignation des objets mobiliers
narrower: T69-8154
narrower: T69-8152
narrower: T69-8150
broader: bateau
created: 2013-09-18T00:00:00+02:00
definition: Petite embarcation à usage multiple et à propulsion variée.
status: 1
broad match: cb11953087h
broad match: http://vocab.getty.edu/aat/300178749
broad match: Bateau

bateau
type: PreferredTerm
modified: 2015-03-19T12:25:26+01:00
created: 2014-01-15T14:54:24+01:00
status: 1

bateau de commerce pour passagers
type: Concept
modified: 2014-10-16T09:32:00+02:00
in scheme: Thésaurus de la désignation des objets mobiliers
preferred label: passenger vessels @en-us
narrower: paquebot
narrower: bateau-omnibus
narrower: bac-transbordeur
broader: bateau
created: 2012-05-16T00:00:00+02:00
definition: Navire de commerce embarquant prioritairement des passagers qui se rendent d'un point à un autre. Il peut également embarquer des bagages, des sacs postaux, des véhicules, etc.
status: 1
broad match: http://data.bnf.fr/ark:/12148/cb119469269

aumusse
type: PreferredTerm
modified: 2014-12-03T11:29:14+01:00
created: 2014-01-15T14:54:24+01:00
status: 1

tombeau des entrailles
type: Concept
modified: 2015-02-24T15:27:21+01:00
in scheme: Thésaurus de la désignation des objets mobiliers
preferred label: entrails tombs @en-us
preferred label: tomba dei visceri @it
broader: tombeau
created: 2012-05-16T00:00:00+02:00
definition: Tombeau s'élevant sur une tombe contenant uniquement les entrailles du défunt ou monument sépulcral contenant lui-même les entrailles. A l'époque médiévale, ce type de tombeau se distingue par la présence d'une poche ou d'un sac placé sur la poitrine de l'effigie.
status: 1
broad match: http://vocab.getty.edu/aat/300005926
broad match: http://data.bnf.fr/ark:/12148/cb11934475f
broad match: Tombeau (architecture)

tombeau
type: Concept
modified: 2015-02-24T15:22:01+01:00
in scheme: Thésaurus de la désignation des objets mobiliers
preferred label: tomba @it
preferred label: tombs @en-us
narrower: tombeau des entrailles
narrower: tombeau du coeur
broader: monument funéraire
alternative label: colonne funéraire
created: 2012-05-16T00:00:00+02:00
scope note: Voir aussi le Thesaurus de la désignation des œuvres architecturales et des espaces aménagés.
definition: Monument funéraire élevé au-dessus d’une ou plusieurs tombes.
status: 1

tombeau des entrailles
type: PreferredTerm
modified: 2015-02-24T15:27:21+01:00
created: 2014-01-15T14:54:24+01:00
status: 1

commode de sacristie
type: SimpleNonPreferredTerm
modified: 2014-12-01T15:44:29+01:00
created: 2014-01-15T14:54:24+01:00
status: 1

chasublier
type: PreferredTerm
modified: 2014-12-01T15:44:29+01:00
created: 2014-01-15T14:54:24+01:00
status: 1

moteur électrique alternatif
type: Concept
modified: 2015-10-07T17:50:22+02:00
in scheme: Thésaurus de la désignation des objets mobiliers
narrower: moteur électrique alternatif triphasé
narrower: moteur électrique alternatif monophasé
broader: moteur électrique
created: 2012-05-16T00:00:00+02:00
definition: Moteur utilisant une source d'énergie électrique alternative.
status: 1
broad match: Machine électrique

moteur électrique alternatif
type: PreferredTerm
modified: 2015-10-07T17:50:22+02:00
created: 2014-01-15T14:54:24+01:00
status: 1

moteur électrique alternatif triphasé
type: Concept
modified: 2015-10-07T17:52:04+02:00
in scheme: Thésaurus de la désignation des objets mobiliers
broader: moteur électrique alternatif
created: 2012-05-16T00:00:00+02:00
definition: Moteur électrique utilisant une source d'énergie électrique alternative, à trois phases.
status: 1
broad match: http://data.bnf.fr/ark:/12148/cb119445001

moteur électrique alternatif monophasé
type: Concept
modified: 2015-10-07T17:51:19+02:00
in scheme: Thésaurus de la désignation des objets mobiliers
broader: moteur électrique alternatif
created: 2012-05-16T00:00:00+02:00
definition: Moteur électrique utilisant une source d'énergie alternative, à une phase.
status: 1
broad match: http://data.bnf.fr/ark:/12148/cb119445001

fuseau
type: Concept
modified: 2014-12-10T14:59:21+01:00
in scheme: Thésaurus de la désignation des objets mobiliers
preferred label: spindles @en-us
broader: matériel pour le filage
alternative label: fusaïole
alternative label: fuseau à retordre
alternative label: fuseau à dentelle
created: 2012-05-16T00:00:00+02:00
definition: Instrument renflé au milieu et effilé aux deux extrémités, généralement de bois servant à tordre et enrouler le fil lors du filage à la quenouille.
status: 1
broad match: cb14648897x

fuseau à retordre
type: SimpleNonPreferredTerm
modified: 2014-12-10T14:59:21+01:00
created: 2014-01-15T14:54:24+01:00
status: 1

fuseau
type: PreferredTerm
modified: 2014-12-10T14:59:21+01:00
created: 2014-01-15T14:54:24+01:00
status: 1

fuseau à dentelle
type: SimpleNonPreferredTerm
modified: 2014-12-10T14:59:21+01:00
created: 2014-01-15T14:54:24+01:00
status: 1

fusaïole
type: SimpleNonPreferredTerm
modified: 2014-12-10T14:59:21+01:00
created: 2014-01-15T14:54:24+01:00
status: 1

jeu de jardin
type: Concept
modified: 2014-10-15T16:02:59+02:00
in scheme: Thésaurus de la désignation des objets mobiliers
broader: édicule et mobilier de jardin
created: 2012-05-16T00:00:00+02:00
definition: Equipement ou mobilier destiné au divertissement, au jeu d’adresse ou de hasard.
status: 1
broad match: http://vocab.getty.edu/aat/300069657

jeu de jardin
type: PreferredTerm
modified: 2014-10-15T16:02:59+02:00
created: 2014-01-15T14:54:24+01:00
status: 1

chausse-pied
type: PreferredTerm
modified: 2014-10-17T14:31:04+02:00
created: 2014-01-15T14:54:24+01:00
status: 1

ombellino de procession
type: Concept
modified: 2014-11-28T12:52:44+01:00
in scheme: Thésaurus de la désignation des objets mobiliers
preferred label: ombellino processionale @it
preferred label: processional ombellino @en-us
preferred label: umbela processional @pt
broader: objet lié à la procession
alternative label: ombrellino de procession
created: 2013-11-21T00:00:00+01:00
definition: Sorte d'ombrelle portée lors de procession en signe de révérence, pour abriter le saint sacrement ou de hauts dignitaires de l'Eglise. Elle est blanche pour le saint sacrement, blanche ou rouge pour le pape, rouge ou violette pour un cardinal, violette ou verte pour un évêque, parfois bleue pour les autres dignitaires.
status: 1
broad match: cb11949807g

ombrellino de procession
type: SimpleNonPreferredTerm
modified: 2014-11-28T12:52:44+01:00
created: 2014-01-15T14:54:24+01:00
status: 1

ombellino de procession
type: PreferredTerm
modified: 2014-11-28T12:52:44+01:00
created: 2014-01-15T14:54:24+01:00
status: 1

truelle de la Porte sainte
type: SimpleNonPreferredTerm
modified: 2014-11-27T16:04:01+01:00
created: 2014-01-15T14:54:24+01:00
status: 1

plat de la Porte sainte
type: SimpleNonPreferredTerm
modified: 2014-11-27T16:04:01+01:00
created: 2014-01-15T14:54:24+01:00
status: 1

marteau de la Porte sainte
type: SimpleNonPreferredTerm
modified: 2014-11-27T16:04:01+01:00
created: 2014-01-15T14:54:24+01:00
status: 1

service de cérémonie de la Porte sainte
type: PreferredTerm
modified: 2014-11-27T16:04:01+01:00
created: 2014-01-15T14:54:24+01:00
status: 1

presse à coller
type: SimpleNonPreferredTerm
modified: 2015-08-11T11:12:38+02:00
created: 2014-01-15T14:54:24+01:00
status: 1

machine à coller
type: PreferredTerm
modified: 2015-08-11T11:12:38+02:00
created: 2014-01-15T14:54:24+01:00
status: 1

jointeuse
type: SimpleNonPreferredTerm
modified: 2015-08-11T11:12:38+02:00
created: 2014-01-15T14:54:24+01:00
status: 1

niche-crédence
type: Concept
modified: 2014-12-01T12:18:02+01:00
in scheme: Thésaurus de la désignation des objets mobiliers
preferred label: fenestelllas @en-us
broader: crédence
alternative label: crédence en niche
created: 2012-05-16T00:00:00+02:00
scope note: Il ne faut pas la confondre avec la niche (architecture) destinée à recevoir une statue, et qui présente une faible profondeur et une certaine hauteur, ou la console d'architecture.
definition: Petite niche assez profonde et de faible hauteur, placée près de l'autel du côté de l'Epître et destinée à contenir les burettes.
status: 1
broad match: cb11943953g

crédence en niche
type: SimpleNonPreferredTerm
modified: 2014-12-01T12:18:02+01:00
created: 2014-01-15T14:54:24+01:00
status: 1

niche-crédence
type: PreferredTerm
modified: 2014-12-01T12:18:02+01:00
created: 2014-01-15T14:54:24+01:00
status: 1

bateau de pêche aux casiers
type: PreferredTerm
modified: 2014-12-19T11:30:01+01:00
created: 2014-01-15T14:54:24+01:00
status: 1

homardier
type: SimpleNonPreferredTerm
modified: 2014-12-19T11:30:01+01:00
created: 2014-01-15T14:54:24+01:00
status: 1

langoustier
type: SimpleNonPreferredTerm
modified: 2014-12-19T11:30:01+01:00
created: 2014-01-15T14:54:24+01:00
status: 1

caseyeur
type: SimpleNonPreferredTerm
modified: 2014-12-19T11:30:01+01:00
created: 2014-01-15T14:54:24+01:00
status: 1

pelle à suif
type: SimpleNonPreferredTerm
modified: 2014-10-16T12:06:36+02:00
created: 2014-01-15T14:54:24+01:00
status: 1

porte-lampe
type: Concept
modified: 2014-12-05T14:36:49+01:00
in scheme: Thésaurus de la désignation des objets mobiliers
preferred label: lamp holders @en-us
broader: instrument ou accessoire pour l'éclairage
created: 2012-05-16T00:00:00+02:00
definition: Support sur pied, d'applique ou suspendu, sur lequel on pose, fiche ou accroche une ou plusieurs lampes. Le porte-lampe comporte un système pour régler la hauteur des lampes.
status: 1
broad match: cb11978573t
broad match: Lampe

porte-chandelle
type: Concept
modified: 2014-12-05T14:36:09+01:00
in scheme: Thésaurus de la désignation des objets mobiliers
preferred label: candlestands (lighting devices) @en-us
broader: instrument ou accessoire pour l'éclairage
alternative label: porte-résine
alternative label: pince à éclats de bois
alternative label: pince à chandelle
alternative label: porte-éclats
created: 2012-05-16T00:00:00+02:00
definition: Support en fer pour une ou plusieurs sources de lumière (chandelles ou lampes). Le porte-chandelle est sur pied, d'applique, suspendu ou fiché et sa hauteur peut être réglable.
status: 1
broad match: Chandelle (éclairage)

allumoir
type: Concept
modified: 2014-12-05T14:16:40+01:00
in scheme: Thésaurus de la désignation des objets mobiliers
preferred label: candlelighters @en-us
broader: instrument ou accessoire pour l'éclairage
alternative label: allumoir-éteignoir
created: 2012-05-16T00:00:00+02:00
definition: Instrument utilisé pour allumer des bougies placées à une certaine hauteur. Il est composé d'une mèche attachée à un long manche et parfois d'un système d'allumage. Il peut être associé à un éteignoir.
status: 1
broad match: http://data.bnf.fr/ark:/12148/cb11966814f

lanterne
type: Concept
modified: 2014-12-05T14:30:56+01:00
in scheme: Thésaurus de la désignation des objets mobiliers
preferred label: lanterns (lighting devices) @en-us
broader: instrument ou accessoire pour l'éclairage
alternative label: fanal
alternative label: falot
alternative label: lanterne sourde
alternative label: lanterne-lampion
alternative label: lanterne d'applique
alternative label: lanterne-lustre
alternative label: lanterne-veilleuse
created: 2012-05-16T00:00:00+02:00
related: porte-luminaire
related: luminaire d'applique
definition: Ustensile d’éclairage portatif, d'applique, suspendu ou pliant. La source lumineuse provient d’une bougie, d’un combustible gazeux ou liquide ou est électrique. La lanterne est munie d'une poignée, d'une anse ou d'une hampe, ou encore d'un élément d'accrochage sur le dessus ; ses parois sont ajourées ou en matériaux transparents.
TermeAssocie: porte-luminaire
TermeAssocie: luminaire d'applique
status: 1

instrument ou accessoire pour l'éclairage
type: PreferredTerm
modified: 2014-10-16T12:06:36+02:00
created: 2014-01-15T14:54:24+01:00
status: 1

versoir
type: Concept
modified: 2014-12-05T14:39:52+01:00
in scheme: Thésaurus de la désignation des objets mobiliers
broader: instrument ou accessoire pour l'éclairage
alternative label: versoir à huile
alternative label: versoir à essence
alternative label: versoir à pétrole
created: 2012-05-16T00:00:00+02:00
definition: Récipient généralement couvert et à fond plat, contenant le combustible liquide nécessaire au remplissage des lampes. Il est généralement muni d'un long goulot et d'une anse latérale.
status: 1
broad match: cb11978573t

seau à mèche
type: SimpleNonPreferredTerm
modified: 2014-10-16T12:06:36+02:00
created: 2014-01-15T14:54:24+01:00
status: 1

porte-pain de chandelle
type: Concept
modified: 2014-09-18T17:31:26+02:00
in scheme: Thésaurus de la désignation des objets mobiliers
broader: instrument ou accessoire pour l'éclairage
created: 2012-05-16T00:00:00+02:00
definition: Plaque ornée, généralement en bois, autour de laquelle on enroule la chandelle pour former le pain de chandelle que l'on utilise directement en allumant l'extrémité.
status: 1
broad match: http://data.bnf.fr/ark:/12148/cb119375685
broad match: http://vocab.getty.edu/aat/300037583

boîte à bougies
type: Concept
modified: 2014-12-05T14:17:17+01:00
in scheme: Thésaurus de la désignation des objets mobiliers
preferred label: candle boxes @en-us
broader: instrument ou accessoire pour l'éclairage
created: 2012-05-16T00:00:00+02:00
definition: Longue boîte servant à transporter des bougies attachées par leur mèche à une petite barre fixée à l'intérieur.
status: 1

pied de lampe
type: Concept
modified: 2014-12-05T14:35:25+01:00
in scheme: Thésaurus de la désignation des objets mobiliers
preferred label: lamp bases @en-us
broader: instrument ou accessoire pour l'éclairage
created: 2012-05-16T00:00:00+02:00
definition: Support, souvent décoratif, sur lequel on pose une lampe.
status: 1
broad match: cb11978573t
broad match: Lampe

tire-mèche
type: Concept
modified: 2014-12-05T14:39:08+01:00
in scheme: Thésaurus de la désignation des objets mobiliers
broader: instrument ou accessoire pour l'éclairage
created: 2012-05-16T00:00:00+02:00
definition: Petite pince ou aiguille en métal servant à tirer la mèche de la lampe à huile et à nettoyer le bec. Le tire-mèche est suspendu à la lampe par une chaîne.
status: 1
broad match: cb16538831w
broad match: http://vocab.getty.edu/aat/300037630
broad match: Mèche à feu

réflecteur
type: Concept
modified: 2014-12-05T14:38:23+01:00
in scheme: Thésaurus de la désignation des objets mobiliers
preferred label: reflectors @en-us
broader: instrument ou accessoire pour l'éclairage
alternative label: réflecteur de dentellière
alternative label: boule-réflecteur
alternative label: boule de veillée
created: 2012-05-16T00:00:00+02:00
related: guéridon porte-luminaire
related: T69-4546
definition: Élément réfléchissant positionné près d'une source lumineuse pour en diffuser la lumière.
TermeAssocie: guéridon porte-luminaire
TermeAssocie: T69-4546
status: 1

poinçon d'orfèvre
type: PreferredTerm
modified: 2014-12-30T12:54:08+01:00
created: 2014-01-15T14:54:24+01:00
status: 1

paquebot
type: Concept
modified: 2014-12-19T10:55:00+01:00
in scheme: Thésaurus de la désignation des objets mobiliers
preferred label: liners (merchant vessels) @en-us
broader: bateau de commerce pour passagers
alternative label: paquebot de ligne
alternative label: paquebot de croisière
alternative label: traversier
alternative label: car-ferry
created: 2013-09-18T00:00:00+02:00
definition: Bateau maritime affecté à une ligne ou affrété pour des croisières et transportant des passagers, éventuellement des véhicules et du matériel postal.
status: 1

bateau de commerce pour passagers
type: PreferredTerm
modified: 2014-10-16T09:32:00+02:00
created: 2014-01-15T14:54:24+01:00
status: 1

bateau-omnibus
type: Concept
modified: 2014-12-19T10:47:41+01:00
in scheme: Thésaurus de la désignation des objets mobiliers
preferred label: water-buses @en-us
broader: bateau de commerce pour passagers
alternative label: bateau-mouche
alternative label: bateau-bus
alternative label: vedette de voyageurs
alternative label: coche d'eau
alternative label: navette fluviale
alternative label: vedette de liaison
created: 2013-11-04T00:00:00+01:00
definition: Bateau embarquant des passagers pour de courtes distances ou effectuant des arrêts fréquents et réguliers.
status: 1
broad match: http://vocab.getty.edu/aat/300232798

bac-transbordeur
type: Concept
modified: 2014-12-19T10:44:11+01:00
in scheme: Thésaurus de la désignation des objets mobiliers
preferred label: ferries @en-us
broader: bateau de commerce pour passagers
alternative label: bateau transbordeur sans cabine
alternative label: bateau transbordeur à cabines
alternative label: bac à trail
created: 2013-11-04T00:00:00+01:00
definition: Bateau transportant des passagers et des véhicules entre les deux rives d'un cours d'eau.
status: 1

jeu, jouet et sport
type: PreferredTerm
modified: 2014-10-09T13:08:20+02:00
created: 2014-01-15T14:54:24+01:00
status: 1

jouet
type: Concept
modified: 2014-12-30T13:19:27+01:00
in scheme: Thésaurus de la désignation des objets mobiliers
preferred label: toys (recreational artifacts) @en-us
narrower: T69-9437
broader: jeu, jouet et sport
alternative label: jeu de construction
alternative label: jouet d'éveil
alternative label: hochet (jouet)
alternative label: robot (jouet)
alternative label: marionnette
alternative label: jouet d'activité manuelle
alternative label: jouet créatif
alternative label: jeu de patience
created: 2012-05-16T00:00:00+02:00
definition: Objet permettant de s'adonner, individuellement ou collectivement, à des activités ludiques, d'amusement et de divertissement. Si certains sont conçus pour les adultes ou les animaux, les jouets sont essentiellement destinés aux enfants. Ils les accompagnent dans l'apprentissage du monde qui les entoure en stimulant leur capacité d'éveil et de découverte.
status: 1

panoplie, déguisement, tenue de carnaval
type: Concept
modified: 2014-12-30T13:24:01+01:00
in scheme: Thésaurus de la désignation des objets mobiliers
preferred label: costumes (character dress) @en-us
broader: jeu, jouet et sport
alternative label: masque de carnaval
alternative label: mannequin de carnaval
alternative label: tête de carnaval
created: 2013-12-04T00:00:00+01:00
related: costume civil, professionnel ou militaire
definition: <!--[if gte mso 9]> <o:OfficeDocumentSettings> <o:AllowPNG/> </o:OfficeDocumentSettings> <![endif]-->Costume ou accessoire utilisé pour transformer l'apparence d'une personne à des fins de divertissement individuel ou collectif (notamment lors d'un carnaval).
TermeAssocie: costume civil, professionnel ou militaire
status: 1

anneau sigillaire
type: PreferredTerm
modified: 2014-12-30T12:46:29+01:00
created: 2014-01-15T14:54:24+01:00
status: 1

bague sigillaire
type: SimpleNonPreferredTerm
modified: 2014-12-30T12:46:29+01:00
created: 2014-01-15T14:54:24+01:00
status: 1

chevalière
type: SimpleNonPreferredTerm
modified: 2014-12-30T12:46:29+01:00
created: 2014-01-15T14:54:24+01:00
status: 1

bâton de bedeau
type: Concept
modified: 2014-12-03T12:36:34+01:00
in scheme: Thésaurus de la désignation des objets mobiliers
preferred label: verga del cerimoniere @it
preferred label: verger's maces @en-us
preferred label: bastão de mestre de cerimónias @pt
broader: costume de bedeau
alternative label: canne d'huissier de chœur
alternative label: verge de bedeau
alternative label: masse de bedeau
created: 2012-05-16T00:00:00+02:00
definition: Bâton porté comme insigne de sa fonction par un bedeau au cours de cérémonies solennelles. Son extrémité est de forme variable (croix, fleur de lys, etc.). Il peut être décoré et couvert de velours.
status: 1

verge de bedeau
type: SimpleNonPreferredTerm
modified: 2014-12-03T12:36:34+01:00
created: 2014-01-15T14:54:24+01:00
status: 1

bâton de bedeau
type: PreferredTerm
modified: 2014-12-03T12:36:34+01:00
created: 2014-01-15T14:54:24+01:00
status: 1

costume de bedeau
type: Concept
modified: 2014-12-03T12:34:41+01:00
in scheme: Thésaurus de la désignation des objets mobiliers
preferred label: costume del cerimoniere @it
preferred label: verger's uniforms @en-us
preferred label: traje de mestre de cerimónias @pt
narrower: bâton de bedeau
broader: autre vêtement catholique
alternative label: collier d'huissier de chœur
alternative label: costume d'huissier de chœur
alternative label: habit d'huissier de chœur
alternative label: collier de bedeau
alternative label: culotte d'huissier de chœur
alternative label: robe de bedeau
alternative label: souliers d'huissier de chœur
alternative label: barrette de bedeau
created: 2012-05-16T00:00:00+02:00
definition: Tenue réservée au bedeau (laïc chargé de faire régner l'ordre dans l’église). La robe de bedeau comporte une toge noire à parements blancs ou de couleur, un bâton, éventuellement une barrette et un collier. Dans certaines églises, le bedeau prend le nom d'huissier de chœur et porte alors des souliers à boucles, des bas, une culotte à la française, un habit, un collier généralement en argent, et une canne en jonc.
status: 1
broad match: cb12239586h
broad match: http://vocab.getty.edu/aat/300212393

canne d'huissier de chœur
type: SimpleNonPreferredTerm
modified: 2014-12-03T12:36:34+01:00
created: 2014-01-15T14:54:24+01:00
status: 1

masse de bedeau
type: SimpleNonPreferredTerm
modified: 2014-12-03T12:36:34+01:00
created: 2014-01-15T14:54:24+01:00
status: 1

bénitier d'applique
type: PreferredTerm
modified: 2014-11-26T14:44:34+01:00
created: 2014-01-15T14:54:24+01:00
status: 1

bénitier de dévotion
type: SimpleNonPreferredTerm
modified: 2014-11-26T14:44:34+01:00
created: 2014-01-15T14:54:24+01:00
status: 1

bénitier de chevet
type: SimpleNonPreferredTerm
modified: 2014-11-26T14:44:34+01:00
created: 2014-01-15T14:54:24+01:00
status: 1

bénitier domestique
type: SimpleNonPreferredTerm
modified: 2014-11-26T14:44:34+01:00
created: 2014-01-15T14:54:24+01:00
status: 1

bénitier d'objet
type: SimpleNonPreferredTerm
modified: 2014-11-26T14:44:34+01:00
created: 2014-01-15T14:54:24+01:00
status: 1

robe
type: Concept
modified: 2014-12-11T16:46:20+01:00
in scheme: Thésaurus de la désignation des objets mobiliers
preferred label: dresses (garments) @en-us
broader: vêtement d'intérieur ou d'extérieur
created: 2012-05-16T00:00:00+02:00
definition: Vêtement essentiellement féminin, d'un seul tenant, généralement pourvu de manches, descendant jusqu'aux genoux ou jusqu'aux pieds avec une forme et une ampleur variable.
status: 1

robe
type: PreferredTerm
modified: 2014-12-11T16:46:20+01:00
created: 2014-01-15T14:54:24+01:00
status: 1

instrument électroacoustique
type: Concept
modified: 2014-10-10T14:38:35+02:00
in scheme: Thésaurus de la désignation des objets mobiliers
preferred label: electroacoustic instruments @en-us
broader: instrument de musique
alternative label: piano électrique
alternative label: ondes Martenot
alternative label: orgue électrique
alternative label: synthétiseur
alternative label: orgue électronique
alternative label: ondioline
created: 2012-05-16T00:00:00+02:00
definition: Instrument reproduisant par synthèse les sons d'instrument de musique ou tout autre type de son.
status: 1

ondes Martenot
type: SimpleNonPreferredTerm
modified: 2014-10-10T14:38:35+02:00
created: 2014-01-15T14:54:24+01:00
status: 1

synthétiseur
type: SimpleNonPreferredTerm
modified: 2014-10-10T14:38:35+02:00
created: 2014-01-15T14:54:24+01:00
status: 1

instrument électroacoustique
type: PreferredTerm
modified: 2014-10-10T14:38:35+02:00
created: 2014-01-15T14:54:24+01:00
status: 1

orgue électrique
type: SimpleNonPreferredTerm
modified: 2014-10-10T14:38:35+02:00
created: 2014-01-15T14:54:24+01:00
status: 1

ondioline
type: SimpleNonPreferredTerm
modified: 2014-10-10T14:38:35+02:00
created: 2014-01-15T14:54:24+01:00
status: 1

orgue électronique
type: SimpleNonPreferredTerm
modified: 2014-10-10T14:38:35+02:00
created: 2014-01-15T14:54:24+01:00
status: 1

piano électrique
type: SimpleNonPreferredTerm
modified: 2014-10-10T14:38:35+02:00
created: 2014-01-15T14:54:24+01:00
status: 1

poutre
type: Concept
modified: 2014-12-15T16:14:50+01:00
in scheme: Thésaurus de la désignation des objets mobiliers
preferred label: beams (structural elements) @en-us
broader: pièce de charpente
created: 2012-05-16T00:00:00+02:00
definition: Dans un plancher, pièce maîtresse horizontale de gros équarrissage, perpendiculaire aux solives et soulageant celles-ci.
status: 1

poutre
type: PreferredTerm
modified: 2014-12-15T16:14:50+01:00
created: 2014-01-15T14:54:24+01:00
status: 1

abat-jour
type: PreferredTerm
modified: 2014-12-05T14:16:00+01:00
created: 2014-01-15T14:54:24+01:00
status: 1

machine à donner un aspect
type: PreferredTerm
modified: 2014-01-10T00:00:00+01:00
created: 2014-01-15T14:54:24+01:00
status: 1

machine à gaufrer
type: Concept
modified: 2014-01-10T00:00:00+01:00
in scheme: Thésaurus de la désignation des objets mobiliers
broader: machine à donner un aspect
created: 2012-05-16T00:00:00+02:00
definition: Machine à donner à un produit un aspect particulier (motifs en relief et en creux) par déformation à chaud ou à froid du support.
status: 1

dais d'autel
type: Concept
modified: 2014-12-01T12:24:34+01:00
in scheme: Thésaurus de la désignation des objets mobiliers
preferred label: altar canopies @en-us
preferred label: baldacchino d'altare @it
preferred label: dossel de altar @pt
broader: autel et son environnement
created: 2012-05-16T00:00:00+02:00
related: garniture de dais d'autel
definition: Structure suspendue servant à protéger un autel. Elle porte une garniture de dais en tissu (garniture de dais d'autel).
TermeAssocie: garniture de dais d'autel
status: 1

garniture de dais d'autel
type: Concept
modified: 2014-12-02T15:59:57+01:00
in scheme: Thésaurus de la désignation des objets mobiliers
preferred label: guarnizione del baldacchino d'altare @it
preferred label: altar canopy hangings @en-us
preferred label: ornamento de baldaquino de altar @pt
broader: linge ou garniture liés à l'autel
alternative label: rideau de dais d'autel
alternative label: pente de dais d'autel
alternative label: tenture du dais de l'autel
alternative label: ciel de dais d'autel
created: 2012-05-16T00:00:00+02:00
related: dais d'autel
definition: Ensemble des garnitures d'étoffe et des décors d'amortissement, suspendus à un dais d'autel ou portés par lui. Il se compose d'un ciel, de pentes et éventuellement de rideaux.
TermeAssocie: dais d'autel
status: 1
broad match: http://vocab.getty.edu/aat/300298960
broad match: http://data.bnf.fr/ark:/12148/cb12255605d

dais d'autel
type: PreferredTerm
modified: 2014-12-01T12:24:34+01:00
created: 2014-01-15T14:54:24+01:00
status: 1

arme de jet
type: Concept
modified: 2014-12-12T15:15:11+01:00
in scheme: Thésaurus de la désignation des objets mobiliers
preferred label: projectile weapons with non explosive propellant @en-us
broader: arme offensive
alternative label: sagaie
alternative label: fronde
alternative label: harpon
alternative label: arbalète
alternative label: arc (arme)
alternative label: sarbacane
created: 2012-05-16T00:00:00+02:00
definition: Arme qui constitue par elle-même un projectile ou qui lance celui-ci.
status: 1
broad match: http://vocab.getty.edu/aat/300203727

harpon
type: SimpleNonPreferredTerm
modified: 2014-12-12T15:15:11+01:00
created: 2014-01-15T14:54:24+01:00
status: 1

arc (arme)
type: SimpleNonPreferredTerm
modified: 2014-12-12T15:15:11+01:00
created: 2014-01-15T14:54:24+01:00
status: 1

arme de jet
type: PreferredTerm
modified: 2014-12-12T15:15:11+01:00
created: 2014-01-15T14:54:24+01:00
status: 1

fronde
type: SimpleNonPreferredTerm
modified: 2014-12-12T15:15:11+01:00
created: 2014-01-15T14:54:24+01:00
status: 1

sarbacane
type: SimpleNonPreferredTerm
modified: 2014-12-12T15:15:11+01:00
created: 2014-01-15T14:54:24+01:00
status: 1

sagaie
type: SimpleNonPreferredTerm
modified: 2014-12-12T15:15:11+01:00
created: 2014-01-15T14:54:24+01:00
status: 1

arbalète
type: SimpleNonPreferredTerm
modified: 2014-12-12T15:15:11+01:00
created: 2014-01-15T14:54:24+01:00
status: 1

tombeau du coeur
type: Concept
modified: 2015-03-09T10:50:14+01:00
in scheme: Thésaurus de la désignation des objets mobiliers
preferred label: heart monuments @en-us
preferred label: tomba del cuore @it
broader: tombeau
alternative label: tombeau du cœur
created: 2012-05-16T00:00:00+02:00
status: 1

tombeau
type: PreferredTerm
modified: 2015-02-24T15:22:01+01:00
created: 2014-01-15T14:54:24+01:00
status: 1

colonne funéraire
type: SimpleNonPreferredTerm
modified: 2015-02-24T15:22:01+01:00
created: 2014-01-15T14:54:24+01:00
status: 1

boîte de reliquaire
type: Concept
modified: 2014-11-26T12:30:43+01:00
in scheme: Thésaurus de la désignation des objets mobiliers
preferred label: custodia di reliquiario @it
preferred label: reliquary boxes @en-us
preferred label: estojo de relicário @pt
broader: boîte et coffret pour le rangement des objets liturgiques
alternative label: écrin de reliquaire
alternative label: boîte à reliquaire
alternative label: étui de reliquaire
alternative label: boîte à châsse
created: 2012-05-16T00:00:00+02:00
related: reliquaire
definition: Coffret dans lequel est conservé un reliquaire.
TermeAssocie: reliquaire
status: 1
broad match: http://vocab.getty.edu/aat/300187549

boîte à châsse
type: SimpleNonPreferredTerm
modified: 2014-11-26T12:30:43+01:00
created: 2014-01-15T14:54:24+01:00
status: 1

écrin de reliquaire
type: SimpleNonPreferredTerm
modified: 2014-11-26T12:30:43+01:00
created: 2014-01-15T14:54:24+01:00
status: 1

étui de reliquaire
type: SimpleNonPreferredTerm
modified: 2014-11-26T12:30:43+01:00
created: 2014-01-15T14:54:24+01:00
status: 1

boîte de reliquaire
type: PreferredTerm
modified: 2014-11-26T12:30:43+01:00
created: 2014-01-15T14:54:24+01:00
status: 1

boîte à reliquaire
type: SimpleNonPreferredTerm
modified: 2014-11-26T12:30:43+01:00
created: 2014-01-15T14:54:24+01:00
status: 1

boîte à crâne
type: PreferredTerm
modified: 2014-11-27T10:50:51+01:00
created: 2014-01-15T14:54:24+01:00
status: 1

maison à crâne
type: SimpleNonPreferredTerm
modified: 2014-11-27T10:50:51+01:00
created: 2014-01-15T14:54:24+01:00
status: 1

table d'applique
type: PreferredTerm
modified: 2014-12-05T13:32:45+01:00
created: 2014-01-15T14:54:24+01:00
status: 1

console-table
type: SimpleNonPreferredTerm
modified: 2014-12-05T13:32:45+01:00
created: 2014-01-15T14:54:24+01:00
status: 1

conque marine
type: PreferredTerm
modified: 2014-12-15T10:54:41+01:00
created: 2014-01-15T14:54:24+01:00
status: 1

boîte à bougies
type: PreferredTerm
modified: 2014-12-05T14:17:17+01:00
created: 2014-01-15T14:54:24+01:00
status: 1

chaire pastorale
type: Concept
modified: 2014-01-10T00:00:00+01:00
in scheme: Thésaurus de la désignation des objets mobiliers
broader: meuble du culte protestant
created: 2012-05-16T00:00:00+02:00
scope note: Indiquer chaire du désert en PDEN.
definition: Meuble de fonction équivalente à la chaire à prêcher catholique. Elle peut être placée dans le fond de la nef, face aux bancs des fidèles mais aussi sur le côté, comme dans les églises catholiques. La chaire peut être dépourvue d'abat-voix. La chaire du désert, destinée au prêche en plein-air ou dans des lieux secrets, est démontable.
status: 1

chaire pastorale
type: PreferredTerm
modified: 2014-01-10T00:00:00+01:00
created: 2014-01-15T14:54:24+01:00
status: 1

machine à cheviller
type: PreferredTerm
modified: 2014-01-10T00:00:00+01:00
created: 2014-01-15T14:54:24+01:00
status: 1

épinette
type: Concept
modified: 2014-12-15T11:56:18+01:00
in scheme: Thésaurus de la désignation des objets mobiliers
preferred label: spinets @en-us
broader: cithare à clavier
alternative label: virginal
created: 2012-05-16T00:00:00+02:00
definition: Instrument à un seul clavier et à cordes pincées. Il peut être de forme rectangulaire, polygonale ou en aile d'oiseau. Le plan des cordes est horizontal, placé en oblique au clavier.
status: 1

virginal
type: SimpleNonPreferredTerm
modified: 2014-12-15T11:56:18+01:00
created: 2014-01-15T14:54:24+01:00
status: 1

épinette
type: PreferredTerm
modified: 2014-12-15T11:56:18+01:00
created: 2014-01-15T14:54:24+01:00
status: 1

casque
type: Concept
modified: 2014-12-10T18:11:54+01:00
in scheme: Thésaurus de la désignation des objets mobiliers
broader: chapeau ou coiffure
alternative label: helmets @en-us
created: 2013-11-14T00:00:00+01:00
definition: Coiffure rigide destinée à protéger la tête de celui qui la porte. Le casque est souvent muni d'une jugulaire ou d'une mentonnière.
status: 1

casque
type: PreferredTerm
modified: 2014-12-10T18:11:54+01:00
created: 2014-01-15T14:54:24+01:00
status: 1

moteur électrique alternatif monophasé
type: PreferredTerm
modified: 2015-10-07T17:51:19+02:00
created: 2014-01-15T14:54:24+01:00
status: 1

chalutier
type: SimpleNonPreferredTerm
modified: 2014-12-19T11:26:59+01:00
created: 2014-01-15T14:54:24+01:00
status: 1

cordier à ligne traînante
type: SimpleNonPreferredTerm
modified: 2014-12-19T11:26:59+01:00
created: 2014-01-15T14:54:24+01:00
status: 1

bateau de pêche aux lignes
type: SimpleNonPreferredTerm
modified: 2014-12-19T11:26:59+01:00
created: 2014-01-15T14:54:24+01:00
status: 1

palangrier
type: SimpleNonPreferredTerm
modified: 2014-12-19T11:26:59+01:00
created: 2014-01-15T14:54:24+01:00
status: 1

bateau de pêche au filet ou à la traîne
type: PreferredTerm
modified: 2014-12-19T11:26:59+01:00
created: 2014-01-15T14:54:24+01:00
status: 1

manuscrit
type: PreferredTerm
modified: 2014-12-03T15:36:49+01:00
created: 2014-01-15T14:54:24+01:00
status: 1

autographe
type: SimpleNonPreferredTerm
modified: 2014-12-03T15:36:49+01:00
created: 2014-01-15T14:54:24+01:00
status: 1

tapuscrit
type: SimpleNonPreferredTerm
modified: 2014-12-03T15:36:49+01:00
created: 2014-01-15T14:54:24+01:00
status: 1

chaussure
type: Concept
modified: 2014-12-11T15:54:11+01:00
in scheme: Thésaurus de la désignation des objets mobiliers
preferred label: shoes @en-us
broader: pièce chaussée
alternative label: brodequin
alternative label: pantoufle
alternative label: chausson
alternative label: escarpin
alternative label: bottine
alternative label: botte
alternative label: espadrille
alternative label: ballerine
alternative label: soulier
alternative label: sabot
alternative label: mocassin
alternative label: guêtre
alternative label: babouche
alternative label: botillon
alternative label: socque
alternative label: sandale
alternative label: galoche
alternative label: cuissarde
created: 2012-05-16T00:00:00+02:00
definition: Objet fabriqué à partir de divers matériaux souples (cuir, peau, toile, matières synthétiques) et selon différents procédés d'assemblage pour recouvrir et protéger le pied et éventuellement la jambe. La chaussure se trouve au contact du sol.
status: 1

bas
type: Concept
modified: 2014-12-11T15:47:14+01:00
in scheme: Thésaurus de la désignation des objets mobiliers
preferred label: stockings @en-us
broader: pièce chaussée
alternative label: chaussette
alternative label: bande-moletière
alternative label: collant
created: 2012-05-16T00:00:00+02:00
definition: Pièce textile s'enfilant sur la jambe et le pied pour les protéger. Elle se porte sur la peau et dans la chaussure.
status: 1

pièce chaussée
type: PreferredTerm
modified: 2014-10-20T10:30:38+02:00
created: 2014-01-15T14:54:24+01:00
status: 1

machine à recuire
type: Concept
modified: 2015-10-15T17:25:52+02:00
in scheme: Thésaurus de la désignation des objets mobiliers
broader: machine à assouplir
alternative label: four à recuire
alternative label: four de recuit
created: 2012-05-16T00:00:00+02:00
definition: Machine permettant d'assouplir un produit en métal, en verre, ou en cristal, en en réduisant les tensions internes par une opération de recuit.
status: 1

four à recuire
type: SimpleNonPreferredTerm
modified: 2015-10-15T17:25:52+02:00
created: 2014-01-15T14:54:24+01:00
status: 1

machine à recuire
type: PreferredTerm
modified: 2015-10-15T17:25:52+02:00
created: 2014-01-15T14:54:24+01:00
status: 1

machine à assouplir
type: Concept
modified: 2014-01-10T00:00:00+01:00
in scheme: Thésaurus de la désignation des objets mobiliers
narrower: machine à recuire
broader: machine à modifier la malléabilité
alternative label: machine à palissonner
alternative label: dérompeuse
created: 2012-05-16T00:00:00+02:00
definition: Machine à modifier la malléabilité d'un produit en en réduisant la rigidité.
status: 1

four de recuit
type: SimpleNonPreferredTerm
modified: 2015-10-15T17:25:52+02:00
created: 2014-01-15T14:54:24+01:00
status: 1

machine à réaliser des essais
type: Concept
modified: 2015-10-08T16:02:46+02:00
in scheme: Thésaurus de la désignation des objets mobiliers
narrower: machine à réaliser des essais mécaniques
broader: machine à contrôler
alternative label: machine à réaliser des essais physico-chimiques
alternative label: machine à réaliser des essais physiques
created: 2012-05-16T00:00:00+02:00
definition: Machine servant à déterminer les caractéristiques liées à la structure des matériaux, des assemblages, du produit fini, etc.
status: 1

machine à réaliser des essais mécaniques
type: Concept
modified: 2015-10-08T16:13:17+02:00
in scheme: Thésaurus de la désignation des objets mobiliers
broader: machine à réaliser des essais
alternative label: mouton-pendule
alternative label: machine à biller
alternative label: machine d'essai de traction
created: 2012-05-16T00:00:00+02:00
definition: Machine servant à déterminer des caractéristiques liées à la structure des matériaux comme la dureté, la fatigue, le fluage, la résilience, la traction.
status: 1
narrow match: Machine de traction
broad match: http://data.bnf.fr/ark:/12148/cb119619929

machine à réaliser des essais physiques
type: SimpleNonPreferredTerm
modified: 2015-10-08T16:02:46+02:00
created: 2014-01-15T14:54:24+01:00
status: 1

machine à réaliser des essais
type: PreferredTerm
modified: 2015-10-08T16:02:46+02:00
created: 2014-01-15T14:54:24+01:00
status: 1

machine à réaliser des essais physico-chimiques
type: SimpleNonPreferredTerm
modified: 2015-10-08T16:02:46+02:00
created: 2014-01-15T14:54:24+01:00
status: 1

voilette
type: Concept
modified: 2014-10-20T10:23:10+02:00
in scheme: Thésaurus de la désignation des objets mobiliers
preferred label: hat veils @en-us
broader: chapeau ou coiffure
alternative label: mantille
created: 2012-05-16T00:00:00+02:00
definition: Petit voile transparent, le plus souvent en tulle ou en dentelle, que les femmes portent en garniture au bord de leur chapeau et qui recouvre le visage en partie ou en totalité.
status: 1

mantille
type: SimpleNonPreferredTerm
modified: 2014-10-20T10:23:10+02:00
created: 2014-01-15T14:54:24+01:00
status: 1

voilette
type: PreferredTerm
modified: 2014-10-20T10:23:10+02:00
created: 2014-01-15T14:54:24+01:00
status: 1

meuble lié aux sacrements autres que l'Eucharistie
type: Concept
modified: 2014-12-02T12:00:58+01:00
in scheme: Thésaurus de la désignation des objets mobiliers
preferred label: arredi per gli altri sacramenti @it
preferred label: furniture and furnishings for the other sacraments @en-us
preferred label: mobiliário relacionado com os sacramentos @pt
narrower: fonts baptismaux
narrower: retable des fonts baptismaux
narrower: T69-690
narrower: T69-686
narrower: T69-688
narrower: T69-698
broader: meuble du culte catholique
created: 2012-05-16T00:00:00+02:00
definition: Mobilier réservé à l’administration des autres sacrements (baptême, confirmation, réconciliation ou pénitence, onction des malades, mariage, ordre).
status: 1
broad match: http://vocab.getty.edu/aat/300003724
broad match: Mobilier liturgique

retable des fonts baptismaux
type: PreferredTerm
modified: 2014-12-02T12:23:10+01:00
created: 2014-01-15T14:54:24+01:00
status: 1

main de justice
type: Concept
modified: 2014-12-30T12:40:55+01:00
in scheme: Thésaurus de la désignation des objets mobiliers
broader: emblème de pouvoir
created: 2013-11-29T00:00:00+01:00
definition: Sceptre surmonté d'une main en ivoire ou en métal précieux, pouce, index et médius tendus, qui symbolise le pouvoir justicier que le roi tient de Dieu.
status: 1
broad match: http://data.bnf.fr/ark:/12148/cb119782223

emblème de pouvoir
type: PreferredTerm
modified: 2014-10-09T12:52:26+02:00
created: 2014-01-15T14:54:24+01:00
status: 1

marque à pain
type: PreferredTerm
modified: 2014-12-05T16:20:50+01:00
created: 2014-01-15T14:54:24+01:00
status: 1

terrine à tripes
type: PreferredTerm
modified: 2014-10-16T16:49:40+02:00
created: 2014-01-15T14:54:24+01:00
status: 1

tripière
type: SimpleNonPreferredTerm
modified: 2014-10-16T16:49:40+02:00
created: 2014-01-15T14:54:24+01:00
status: 1

pot à tripes
type: SimpleNonPreferredTerm
modified: 2014-10-16T16:49:40+02:00
created: 2014-01-15T14:54:24+01:00
status: 1

plein relief spatial
type: Concept
modified: 2014-10-17T16:14:50+02:00
in scheme: Thésaurus de la désignation des objets mobiliers
broader: sculpture
created: 2012-05-16T00:00:00+02:00
scope note: Ne pas confondre avec une statue d'applique ou un groupe d'applique qui sont rapportés sur un fond.
definition: Figure ou réunion de figures en ronde-bosse, disposées sur la même base, et qui adhèrent matériellement à un fond faisant partie de la composition.
status: 1
broad match: http://data.bnf.fr/ark:/12148/cb11933241b
broad match: http://vocab.getty.edu/aat/300047090
broad match: Sculpture

plein relief spatial
type: PreferredTerm
modified: 2014-10-17T16:14:50+02:00
created: 2014-01-15T14:54:24+01:00
status: 1

triporteur
type: Concept
modified: 2014-10-16T11:55:00+02:00
in scheme: Thésaurus de la désignation des objets mobiliers
preferred label: three-wheelers @en-us
broader: véhicule terrestre spécialisé motorisé ou non
created: 2013-11-06T00:00:00+01:00
definition: Tricycle à pédales ou à moteur muni d'une caisse pour le transport sur de petites distances des marchandises légères.
status: 1
broad match: http://data.bnf.fr/ark:/12148/cb11975775b

triporteur
type: PreferredTerm
modified: 2014-10-16T11:55:00+02:00
created: 2014-01-15T14:54:24+01:00
status: 1

foyer de forge
type: Concept
modified: 2014-01-10T00:00:00+01:00
in scheme: Thésaurus de la désignation des objets mobiliers
broader: machine liée à la production artisanale
created: 2013-12-16T00:00:00+01:00
status: 1

foyer de forge
type: PreferredTerm
modified: 2014-01-10T00:00:00+01:00
created: 2014-01-15T14:54:24+01:00
status: 1

poignard
type: Concept
modified: 2014-12-12T15:00:55+01:00
in scheme: Thésaurus de la désignation des objets mobiliers
preferred label: knives (weapons) @en-us
broader: arme blanche
alternative label: dague
created: 2012-05-16T00:00:00+02:00
definition: Arme blanche à lame courte affilée, assez large et à deux tranchants pourvue d'un manche.
status: 1
broad match: http://vocab.getty.edu/aat/300024668

hache (arme)
type: Concept
modified: 2014-12-12T15:00:11+01:00
in scheme: Thésaurus de la désignation des objets mobiliers
preferred label: axes (weapons) @en-us
broader: arme blanche
alternative label: hache à douille
created: 2012-05-16T00:00:00+02:00
definition: Arme blanche comprenant une lame tranchante généralement de forme triangulaire et curviligne.
status: 1
broad match: http://data.bnf.fr/ark:/12148/cb12000919b

arme blanche
type: PreferredTerm
modified: 2015-03-27T16:54:54+01:00
created: 2014-01-15T14:54:24+01:00
status: 1

sabre
type: Concept
modified: 2014-12-12T15:02:22+01:00
in scheme: Thésaurus de la désignation des objets mobiliers
preferred label: sabers @en-us
broader: arme blanche
alternative label: scramasaxe
created: 2012-05-16T00:00:00+02:00
definition: Arme blanche formée d'une longue lame convexe du côté du seul tranchant. Elle est utilisée à une ou deux mains. A la différence d'une lame droite, lorsque la flèche (courbure) frappe sa cible elle garde sa vitesse.
status: 1

jacquemart
type: Concept
modified: 2014-12-15T12:35:25+01:00
in scheme: Thésaurus de la désignation des objets mobiliers
preferred label: jacks (clock and watch components) @en-us
broader: idiophone à émission par percussion directe
alternative label: jaquemart
created: 2012-05-16T00:00:00+02:00
related: instrument de mesure du temps
related: horloge publique
related: sculpture cinétique
related: automate
definition: Ensemble formé d'un ou plusieurs automates en métal ou bois sculpté muni(s) d'un marteau ; il(s) en frappe(nt) une cloche pour marquer les heures.
TermeAssocie: instrument de mesure du temps
TermeAssocie: horloge publique
TermeAssocie: sculpture cinétique
TermeAssocie: automate
status: 1

horloge publique
type: Concept
modified: 2015-02-24T11:21:12+01:00
in scheme: Thésaurus de la désignation des objets mobiliers
broader: édicule ou mobilier de l'espace public ou du génie civil
alternative label: horloge d'édifice
created: 2012-05-16T00:00:00+02:00
scope note: Voir aussi le Thesaurus de la désignation des œuvres architecturales et des espaces aménagés.
related: horloge
related: instrument de mesure du temps
related: jacquemart
definition: Édicule, panneau ou cadran, de plus ou moins grandes dimensions, muni d’un dispositif indiquant l'heure et placé dans un lieu public.
TermeAssocie: horloge
TermeAssocie: instrument de mesure du temps
TermeAssocie: jacquemart
status: 1
broad match: Horloge

sculpture cinétique
type: Concept
modified: 2014-10-17T16:32:28+02:00
in scheme: Thésaurus de la désignation des objets mobiliers
preferred label: kinetic sculptures @en-us
broader: sculpture
alternative label: stabile
alternative label: mobile
created: 2013-07-19T00:00:00+02:00
related: jacquemart
definition: Œuvre à laquelle on donne le mouvement pour principe, accompagné ou non d'un jeu de lumière, afin d'obtenir un ensemble changeant. Ce mouvement est produit de manière plus ou moins complexe, intervention du spectateur, mécanisme, moteur, courant d'air, etc.
TermeAssocie: jacquemart
status: 1

jacquemart
type: PreferredTerm
modified: 2014-12-15T12:35:25+01:00
created: 2014-01-15T14:54:24+01:00
status: 1

automate
type: Concept
modified: 2014-12-03T16:41:47+01:00
in scheme: Thésaurus de la désignation des objets mobiliers
preferred label: automata @en-us
broader: sculpture
created: 2014-01-10T00:00:00+01:00
related: jacquemart
definition: Figure qui, grâce à des dispositifs mécaniques, est capable d'effectuer des actes imitant ceux des corps animés.
TermeAssocie: jacquemart
status: 1

jaquemart
type: SimpleNonPreferredTerm
modified: 2014-12-15T12:35:25+01:00
created: 2014-01-15T14:54:24+01:00
status: 1

machine à distiller
type: Concept
modified: 2015-08-12T12:18:09+02:00
in scheme: Thésaurus de la désignation des objets mobiliers
broader: machine à extraire des fluides
alternative label: évaporateur
created: 2012-05-16T00:00:00+02:00
related: alambic artisanal
definition: Machine à extraire des fluides de produits naturels par évaporation, puis par condensation.
TermeAssocie: alambic artisanal
status: 1
narrow match: http://data.bnf.fr/ark:/12148/cb135555122
narrow match: Alambic

alambic artisanal
type: Concept
modified: 2014-01-10T00:00:00+01:00
in scheme: Thésaurus de la désignation des objets mobiliers
broader: machine liée à la production artisanale
created: 2013-12-16T00:00:00+01:00
related: machine à distiller
TermeAssocie: machine à distiller
status: 1

évaporateur
type: SimpleNonPreferredTerm
modified: 2015-08-12T12:18:09+02:00
created: 2014-01-15T14:54:24+01:00
status: 1

machine à distiller
type: PreferredTerm
modified: 2015-08-12T12:18:09+02:00
created: 2014-01-15T14:54:24+01:00
status: 1

machine à gaufrer
type: PreferredTerm
modified: 2014-01-10T00:00:00+01:00
created: 2014-01-15T14:54:24+01:00
status: 1

tapis de trône pontifical
type: PreferredTerm
modified: 2014-12-03T11:08:19+01:00
created: 2014-01-15T14:54:24+01:00
status: 1

litre
type: PreferredTerm
modified: 2015-02-24T12:46:00+01:00
created: 2014-01-15T14:54:24+01:00
status: 1

litre funéraire
type: SimpleNonPreferredTerm
modified: 2015-02-24T12:46:00+01:00
created: 2014-01-15T14:54:24+01:00
status: 1

horloge de précision
type: Concept
modified: 2014-12-15T15:27:45+01:00
in scheme: Thésaurus de la désignation des objets mobiliers
preferred label: regulators @en-us
broader: instrument de mesure du temps
alternative label: horloge atomique
alternative label: échappement d'horlogerie
alternative label: régulateur astronomique
created: 2013-12-18T00:00:00+01:00
definition: Instrument indiquant et/ou enregistrant, avec une grande précision, les intervalles de temps, par voie mécanique, électromécanique ou électronique, ou de repérage de phénomènes astronomiques.
status: 1
narrow match: cb11980310n
narrow match: Horloge atomique

horloge atomique
type: SimpleNonPreferredTerm
modified: 2014-12-15T15:27:45+01:00
created: 2014-01-15T14:54:24+01:00
status: 1

horloge de précision
type: PreferredTerm
modified: 2014-12-15T15:27:45+01:00
created: 2014-01-15T14:54:24+01:00
status: 1

régulateur astronomique
type: SimpleNonPreferredTerm
modified: 2014-12-15T15:27:45+01:00
created: 2014-01-15T14:54:24+01:00
status: 1

échappement d'horlogerie
type: SimpleNonPreferredTerm
modified: 2014-12-15T15:27:45+01:00
created: 2014-01-15T14:54:24+01:00
status: 1

lustre
type: PreferredTerm
modified: 2014-12-04T12:00:21+01:00
created: 2014-01-15T14:54:24+01:00
status: 1

couronne de lumières
type: Concept
modified: 2014-12-02T12:42:46+01:00
in scheme: Thésaurus de la désignation des objets mobiliers
preferred label: corona di luci @it
preferred label: coronas (lighting devices) @en-us
preferred label: coroa de luzes @pt
broader: lustre d'église
created: 2012-05-16T00:00:00+02:00
related: lustre de synagogue
related: lustre
definition: Lustre composé d'un ou de plusieurs anneaux concentriques superposés, supportant des lampes à huile, des bougies, etc. Il est souvent décoré de motifs religieux.
TermeAssocie: lustre de synagogue
TermeAssocie: lustre
status: 1
broad match: http://data.bnf.fr/ark:/12148/cb119367105
broad match: Lustre (ameublement)

machine à coudre domestique
type: Concept
modified: 2014-12-10T14:29:51+01:00
in scheme: Thésaurus de la désignation des objets mobiliers
preferred label: household sewing machines @en-us
broader: objet ou matériel pour les ouvrages textiles
created: 2012-05-16T00:00:00+02:00
related: machine à coudre industrielle
definition: Machine à usage privé servant aux travaux de couture.
TermeAssocie: machine à coudre industrielle
status: 1

machine à coudre domestique
type: PreferredTerm
modified: 2014-12-10T14:29:51+01:00
created: 2014-01-15T14:54:24+01:00
status: 1

sablière
type: Concept
modified: 2014-12-15T16:25:05+01:00
in scheme: Thésaurus de la désignation des objets mobiliers
preferred label: wall plates (structural element components) @en-us
broader: pièce de charpente
created: 2012-05-16T00:00:00+02:00
definition: Pièce maîtresse horizontale posée sur l'épaisseur d'un mur dans le même plan que celui-ci.
status: 1

sablière
type: PreferredTerm
modified: 2014-12-15T16:25:05+01:00
created: 2014-01-15T14:54:24+01:00
status: 1

lanterne des morts
type: Concept
modified: 2015-02-24T12:10:54+01:00
in scheme: Thésaurus de la désignation des objets mobiliers
preferred label: lanterns of the dead @en-us
broader: édicule religieux chrétien
created: 2012-05-16T00:00:00+02:00
scope note: Voir aussi le Thesaurus de la désignation des œuvres architecturales et des espaces aménagés.
definition: Édicule servant de fanal dans les cimetières.
status: 1

lanterne des morts
type: PreferredTerm
modified: 2015-02-24T12:10:54+01:00
created: 2014-01-15T14:54:24+01:00
status: 1

linge ou garniture liés à la procession
type: PreferredTerm
modified: 2014-12-03T10:28:25+01:00
created: 2014-01-15T14:54:24+01:00
status: 1

clef de tabernacle
type: PreferredTerm
modified: 2014-11-27T14:54:52+01:00
created: 2014-01-15T14:54:24+01:00
status: 1

cloche à plongeur
type: SimpleNonPreferredTerm
modified: 2014-12-19T16:28:30+01:00
created: 2014-01-15T14:54:24+01:00
status: 1

scaphandre
type: SimpleNonPreferredTerm
modified: 2014-12-19T16:28:30+01:00
created: 2014-01-15T14:54:24+01:00
status: 1

matériel d'exploration sous-marin
type: PreferredTerm
modified: 2014-12-19T16:28:30+01:00
created: 2014-01-15T14:54:24+01:00
status: 1

mouchoir
type: Concept
modified: 2014-12-10T17:57:14+01:00
in scheme: Thésaurus de la désignation des objets mobiliers
preferred label: handkerchiefs @en-us
broader: accessoire de l'habillement
alternative label: mouchoir d'instruction militaire
created: 2012-05-16T00:00:00+02:00
definition: Petite pièce de linge ou de tissu de cellulose portée dans une poche ou dans son sac dont on se sert principalement pour se moucher, éventuellement pour s'essuyer.
status: 1

mouchoir d'instruction militaire
type: SimpleNonPreferredTerm
modified: 2014-12-10T17:57:14+01:00
created: 2014-01-15T14:54:24+01:00
status: 1

mouchoir
type: PreferredTerm
modified: 2014-12-10T17:57:14+01:00
created: 2014-01-15T14:54:24+01:00
status: 1

chasuble
type: PreferredTerm
modified: 2014-12-03T14:36:04+01:00
created: 2014-01-15T14:54:24+01:00
status: 1

chasuble pliée
type: SimpleNonPreferredTerm
modified: 2014-12-03T14:36:04+01:00
created: 2014-01-15T14:54:24+01:00
status: 1

planète
type: SimpleNonPreferredTerm
modified: 2014-12-03T14:36:04+01:00
created: 2014-01-15T14:54:24+01:00
status: 1

chrémeau de baptême
type: Concept
modified: 2014-12-03T10:57:02+01:00
in scheme: Thésaurus de la désignation des objets mobiliers
preferred label: crismale del battesimo @it
preferred label: baptismal chrism cloths @en-us
preferred label: crismal do baptismo @pt
broader: chrémeau
alternative label: bandeau de baptême
alternative label: bonnet de baptême
created: 2012-05-16T00:00:00+02:00
definition: Linge blanc que l'on pose sur la tête du nouveau baptisé après l'onction du saint Chrême. Il est souvent remplacé par un bonnet de baptême.
status: 1
broad match: http://vocab.getty.edu/aat/300391104

bandeau de baptême
type: SimpleNonPreferredTerm
modified: 2014-12-03T10:57:02+01:00
created: 2014-01-15T14:54:24+01:00
status: 1

chrémeau de baptême
type: PreferredTerm
modified: 2014-12-03T10:57:02+01:00
created: 2014-01-15T14:54:24+01:00
status: 1

bonnet de baptême
type: SimpleNonPreferredTerm
modified: 2014-12-03T10:57:02+01:00
created: 2014-01-15T14:54:24+01:00
status: 1

machine à boulonner
type: PreferredTerm
modified: 2015-08-10T16:01:41+02:00
created: 2014-01-15T14:54:24+01:00
status: 1

mannequin de carnaval
type: SimpleNonPreferredTerm
modified: 2014-12-30T13:24:01+01:00
created: 2014-01-15T14:54:24+01:00
status: 1

masque de carnaval
type: SimpleNonPreferredTerm
modified: 2014-12-30T13:24:01+01:00
created: 2014-01-15T14:54:24+01:00
status: 1

panoplie, déguisement, tenue de carnaval
type: PreferredTerm
modified: 2014-12-30T13:24:01+01:00
created: 2014-01-15T14:54:24+01:00
status: 1

tête de carnaval
type: SimpleNonPreferredTerm
modified: 2014-12-30T13:24:01+01:00
created: 2014-01-15T14:54:24+01:00
status: 1

vase-bouquet d'autel
type: PreferredTerm
modified: 2014-11-27T13:29:27+01:00
created: 2014-01-15T14:54:24+01:00
status: 1

clôture de choeur protestante
type: Concept
modified: 2015-03-09T11:04:13+01:00
in scheme: Thésaurus de la désignation des objets mobiliers
broader: meuble du culte protestant
alternative label: clôture de chœur protestante
created: 2012-05-16T00:00:00+02:00
status: 1

clôture de chœur protestante
type: SimpleNonPreferredTerm
modified: 2015-03-09T11:04:13+01:00
created: 2014-01-15T14:54:24+01:00
status: 1

véhicule de commerce ambulant
type: Concept
modified: 2014-10-16T11:56:53+02:00
in scheme: Thésaurus de la désignation des objets mobiliers
broader: véhicule terrestre spécialisé motorisé ou non
created: 2013-11-06T00:00:00+01:00
definition: Véhicule spécialement aménagé pour servir une activité de commerce non sédentaire exercée sur la voie publique (parcs et jardins, marchés, halles, champs de foire, fêtes foraines, etc.).
status: 1

véhicule de commerce ambulant
type: PreferredTerm
modified: 2014-10-16T11:56:53+02:00
created: 2014-01-15T14:54:24+01:00
status: 1

clef d'arc
type: Concept
modified: 2015-01-07T12:00:24+01:00
in scheme: Thésaurus de la désignation des objets mobiliers
preferred label: keystones (arch components) @en-us
broader: claveau
alternative label: clé d'arc
created: 2012-05-16T00:00:00+02:00
definition: Claveau formant le faîte d'un arc.
status: 1

clef d'arc
type: PreferredTerm
modified: 2015-01-07T12:00:24+01:00
created: 2014-01-15T14:54:24+01:00
status: 1

clé d'arc
type: SimpleNonPreferredTerm
modified: 2015-01-07T12:00:24+01:00
created: 2014-01-15T14:54:24+01:00
status: 1

calice funéraire
type: PreferredTerm
modified: 2014-11-27T10:51:58+01:00
created: 2014-01-15T14:54:24+01:00
status: 1

paradis
type: PreferredTerm
modified: 2014-11-26T16:44:58+01:00
created: 2014-01-15T14:54:24+01:00
status: 1

beatilho
type: SimpleNonPreferredTerm
modified: 2014-11-26T16:44:58+01:00
created: 2014-01-15T14:54:24+01:00
status: 1

vase à quêter
type: Concept
modified: 2014-11-27T15:58:57+01:00
in scheme: Thésaurus de la désignation des objets mobiliers
preferred label: vaso per elemosine @it
preferred label: collection cups @en-us
preferred label: vaso de ofertório @pt
broader: objet lié à l'offrande et à la quête
alternative label: coupe de quête
alternative label: récipient de quête
alternative label: timbale à quêter
alternative label: vase de quête
alternative label: tasse à quêter
alternative label: gobelet à quêter
created: 2012-05-16T00:00:00+02:00
definition: Récipient, généralement en métal, utilisé pour faire la quête.. Il peut prendre la forme d’une coupe, d’une tasse ou d’un gobelet et comporter une inscription indiquant sa destination, le donateur ou l'édifice auquel il a été donné.
status: 1

vase de quête
type: SimpleNonPreferredTerm
modified: 2014-11-27T15:58:57+01:00
created: 2014-01-15T14:54:24+01:00
status: 1

vase à quêter
type: PreferredTerm
modified: 2014-11-27T15:58:57+01:00
created: 2014-01-15T14:54:24+01:00
status: 1

tasse à quêter
type: SimpleNonPreferredTerm
modified: 2014-11-27T15:58:57+01:00
created: 2014-01-15T14:54:24+01:00
status: 1

timbale à quêter
type: SimpleNonPreferredTerm
modified: 2014-11-27T15:58:57+01:00
created: 2014-01-15T14:54:24+01:00
status: 1

récipient de quête
type: SimpleNonPreferredTerm
modified: 2014-11-27T15:58:57+01:00
created: 2014-01-15T14:54:24+01:00
status: 1

gobelet à quêter
type: SimpleNonPreferredTerm
modified: 2014-11-27T15:58:57+01:00
created: 2014-01-15T14:54:24+01:00
status: 1

coupe de quête
type: SimpleNonPreferredTerm
modified: 2014-11-27T15:58:57+01:00
created: 2014-01-15T14:54:24+01:00
status: 1

draperie de brancard
type: SimpleNonPreferredTerm
modified: 2014-12-03T10:30:45+01:00
created: 2014-01-15T14:54:24+01:00
status: 1

garniture de brancard de procession
type: SimpleNonPreferredTerm
modified: 2014-12-03T10:30:45+01:00
created: 2014-01-15T14:54:24+01:00
status: 1

draperie de brancard de procession
type: PreferredTerm
modified: 2014-12-03T10:30:45+01:00
created: 2014-01-15T14:54:24+01:00
status: 1

berceau
type: Concept
modified: 2014-12-04T11:16:39+01:00
in scheme: Thésaurus de la désignation des objets mobiliers
preferred label: cradles @en-us
broader: lit d'enfant
alternative label: moïse
created: 2012-05-16T00:00:00+02:00
definition: Meuble constitué d'une caisse ou d'une corbeille destinée à coucher un bébé. Le berceau est sans pieds ou comporte des pieds ordinaires ou des traverses à bascule généralement transversales. Il peut être portatif (moïse), reposer sur un support spécifique ou improvisé, ou encore être suspendu.
status: 1

moïse
type: SimpleNonPreferredTerm
modified: 2014-12-04T11:16:39+01:00
created: 2014-01-15T14:54:24+01:00
status: 1

berceau
type: PreferredTerm
modified: 2014-12-04T11:16:39+01:00
created: 2014-01-15T14:54:24+01:00
status: 1

machine à modifier la malléabilité
type: Concept
modified: 2014-01-10T00:00:00+01:00
in scheme: Thésaurus de la désignation des objets mobiliers
narrower: machine à durcir
narrower: machine à assouplir
broader: machine à modifier l'état physique
created: 2012-05-16T00:00:00+02:00
definition: Machine à modifier l'état physique d'un produit pour le rendre souple ou rigide.
status: 1

machine à durcir
type: PreferredTerm
modified: 2015-10-15T17:29:26+02:00
created: 2014-01-15T14:54:24+01:00
status: 1

brique de la Porte sainte
type: PreferredTerm
modified: 2014-11-27T16:01:28+01:00
created: 2014-01-15T14:54:24+01:00
status: 1

presse à relier
type: Concept
modified: 2014-01-10T00:00:00+01:00
in scheme: Thésaurus de la désignation des objets mobiliers
broader: machine liée à la production artisanale
created: 2013-12-16T00:00:00+01:00
status: 1

presse à relier
type: PreferredTerm
modified: 2014-01-10T00:00:00+01:00
created: 2014-01-15T14:54:24+01:00
status: 1

piano
type: Concept
modified: 2014-12-15T11:58:05+01:00
in scheme: Thésaurus de la désignation des objets mobiliers
preferred label: pianos @en-us
broader: cithare à clavier
alternative label: piano à queue
alternative label: trapaud
alternative label: pianoforte
alternative label: piano quart de queue
alternative label: piano droit
alternative label: piano à demi-queue
created: 2012-05-16T00:00:00+02:00
definition: Instrument à clavier unique et cordes frappées par des marteaux. Le plan des cordes est tantôt vertical (piano droit), tantôt horizontal et parallèle au clavier (piano carré), tantôt horizontal et perpendiculaire au clavier (piano à queue).
status: 1

cithare à clavier
type: PreferredTerm
modified: 2014-10-10T13:03:27+02:00
created: 2014-01-15T14:54:24+01:00
status: 1

clavecin
type: Concept
modified: 2014-12-15T11:52:23+01:00
in scheme: Thésaurus de la désignation des objets mobiliers
preferred label: harpsichords @en-us
broader: cithare à clavier
created: 2012-05-16T00:00:00+02:00
definition: Instrument à un ou deux claviers et à cordes pincées au moyen de dispositifs appelés sautereaux. La forme de sa caisse de résonance est similaire à celle d'un piano à queue. Le plan de cordes est horizontal, placé perpendiculairement au clavier.
status: 1

borne de juridiction
type: SimpleNonPreferredTerm
modified: 2015-02-24T11:12:46+01:00
created: 2014-01-15T14:54:24+01:00
status: 1

montjoie
type: Concept
modified: 2015-02-24T11:16:15+01:00
in scheme: Thésaurus de la désignation des objets mobiliers
broader: borne
created: 2014-05-27T14:02:49+02:00
definition: Édicule ou monticule de pierres élevé sur certains itinéraires, notamment sur les routes de pèlerinage, pour aider à se repérer.
status: 1

borne kilométrique
type: SimpleNonPreferredTerm
modified: 2015-02-24T11:12:46+01:00
created: 2014-01-15T14:54:24+01:00
status: 1

borne de propriété
type: SimpleNonPreferredTerm
modified: 2015-02-24T11:12:46+01:00
created: 2014-01-15T14:54:24+01:00
status: 1

borne frontalière
type: SimpleNonPreferredTerm
modified: 2015-02-24T11:12:46+01:00
created: 2014-01-15T14:54:24+01:00
status: 1

borne
type: PreferredTerm
modified: 2015-02-24T11:12:46+01:00
created: 2014-01-15T14:54:24+01:00
status: 1

montjoie
type: PreferredTerm
modified: 2015-02-24T11:16:15+01:00
created: 2014-01-15T14:54:24+01:00
status: 1

machine à biller
type: SimpleNonPreferredTerm
modified: 2015-10-08T16:13:17+02:00
created: 2014-01-15T14:54:24+01:00
status: 1

mouton-pendule
type: SimpleNonPreferredTerm
modified: 2015-10-08T16:13:17+02:00
created: 2014-01-15T14:54:24+01:00
status: 1

machine d'essai de traction
type: SimpleNonPreferredTerm
modified: 2015-10-08T16:13:17+02:00
created: 2014-01-15T14:54:24+01:00
status: 1

machine à réaliser des essais mécaniques
type: PreferredTerm
modified: 2015-10-08T16:13:17+02:00
created: 2014-01-15T14:54:24+01:00
status: 1

vedette de promenade
type: SimpleNonPreferredTerm
modified: 2014-12-19T12:02:36+01:00
created: 2014-01-15T14:54:24+01:00
status: 1

voilier de promenade
type: SimpleNonPreferredTerm
modified: 2014-12-19T12:02:36+01:00
created: 2014-01-15T14:54:24+01:00
status: 1

bateau de promenade
type: PreferredTerm
modified: 2014-12-19T12:02:36+01:00
created: 2014-01-15T14:54:24+01:00
status: 1

linge domestique
type: Concept
modified: 2014-12-12T12:36:37+01:00
in scheme: Thésaurus de la désignation des objets mobiliers
preferred label: linens (textile works) @en-us
broader: textile, garniture ou vêtement laïcs
alternative label: serviette de table
alternative label: serviette de toilette
alternative label: linge de table
alternative label: taie d'oreiller
alternative label: gant de toilette
alternative label: chemin de table
alternative label: linge de toilette
alternative label: linge de lit
alternative label: nappe
alternative label: linge de cuisine
alternative label: drap
alternative label: bavoir
created: 2013-11-14T00:00:00+01:00
definition: Pièce de tissu nécessaire aux divers moments et besoins de la vie domestique. Il peut s'agir d'un linge de table, d'un linge de lit, d'un linge de toilette, d'un linge de cuisine, etc.
status: 1

textile, garniture ou vêtement laïcs
type: PreferredTerm
modified: 2014-10-17T16:39:44+02:00
created: 2014-01-15T14:54:24+01:00
status: 1

porte-cercueil protestant
type: Concept
modified: 2014-01-10T00:00:00+01:00
in scheme: Thésaurus de la désignation des objets mobiliers
broader: meuble du culte protestant
created: 2012-05-16T00:00:00+02:00
definition: Support rectangulaire plus ou moins élevé, à roulettes ou non, sur lequel est posé le cercueil pendant la cérémonie funéraire.
status: 1

porte-cercueil protestant
type: PreferredTerm
modified: 2014-01-10T00:00:00+01:00
created: 2014-01-15T14:54:24+01:00
status: 1

instrument de paix
type: SimpleNonPreferredTerm
modified: 2015-01-27T11:15:39+01:00
created: 2014-01-15T14:54:24+01:00
status: 1

baiser de paix
type: PreferredTerm
modified: 2015-01-27T11:15:39+01:00
created: 2014-01-15T14:54:24+01:00
status: 1

osculatoire
type: SimpleNonPreferredTerm
modified: 2015-01-27T11:15:39+01:00
created: 2014-01-15T14:54:24+01:00
status: 1

tombeau du cœur
type: SimpleNonPreferredTerm
modified: 2015-03-09T10:50:14+01:00
created: 2014-01-15T14:54:24+01:00
status: 1

boîte à patène
type: SimpleNonPreferredTerm
modified: 2014-11-26T12:29:20+01:00
created: 2014-01-15T14:54:24+01:00
status: 1

boîte de patène
type: PreferredTerm
modified: 2014-11-26T12:29:20+01:00
created: 2014-01-15T14:54:24+01:00
status: 1

étui de patène
type: SimpleNonPreferredTerm
modified: 2014-11-26T12:29:20+01:00
created: 2014-01-15T14:54:24+01:00
status: 1

écrin de patène
type: SimpleNonPreferredTerm
modified: 2014-11-26T12:29:20+01:00
created: 2014-01-15T14:54:24+01:00
status: 1

machine à essorer
type: Concept
modified: 2015-10-09T12:26:45+02:00
in scheme: Thésaurus de la désignation des objets mobiliers
broader: machine à extraire des fluides
alternative label: essoreuse centrifugeuse
alternative label: essoreuse
created: 2012-05-16T00:00:00+02:00
related: essoreuse domestique
definition: Machine à extraire des fluides de produits imprégnés soit par pression ou par centrifugation, soit par les deux procédés.
TermeAssocie: essoreuse domestique
status: 1
narrow match: Centrifugeuse

machine à essorer
type: PreferredTerm
modified: 2015-10-09T12:26:45+02:00
created: 2014-01-15T14:54:24+01:00
status: 1

essoreuse
type: SimpleNonPreferredTerm
modified: 2015-10-09T12:26:45+02:00
created: 2014-01-15T14:54:24+01:00
status: 1

essoreuse centrifugeuse
type: SimpleNonPreferredTerm
modified: 2015-10-09T12:26:45+02:00
created: 2014-01-15T14:54:24+01:00
status: 1

essoreuse domestique
type: Concept
modified: 2014-09-12T10:41:46+02:00
in scheme: Thésaurus de la désignation des objets mobiliers
broader: meuble pour l'entretien du linge
created: 2012-05-16T00:00:00+02:00
related: machine à essorer
definition: Machine servant à extraire l'eau du linge que l'on a lavé. Elle est constituée de deux rouleaux horizontaux éventuellement caoutchoutés ou d'une cuve centrifugeuse.
TermeAssocie: machine à essorer
status: 1
broad match: http://vocab.getty.edu/aat/300024728

objet lié à la vie sociale
type: PreferredTerm
modified: 2014-01-10T00:00:00+01:00
created: 2014-01-15T14:54:24+01:00
status: 1

amulette de la religion juive
type: Concept
modified: 2014-01-10T00:00:00+01:00
in scheme: Thésaurus de la désignation des objets mobiliers
broader: objet lié à la vie sociale
alternative label: shmirah
alternative label: hamsah
alternative label: shiwiti
alternative label: amulette
alternative label: qame'a
created: 2012-05-16T00:00:00+02:00
definition: L'amulette à laquelle on attribue des pouvoirs protecteurs peut prendre la forme d'une médaille de formes variées (main pointée vers le haut ou hamsah, cœur marqué Shadday), en matériaux précieux ou non, d'un fragment de texte rédigé sur parchemin et enfermé dans un étui à amulette ou encore d'un texte manuscrit ou imprimé sur un papier pendu au mur (shivviti).
status: 1

véhicule de police
type: Concept
modified: 2014-12-30T12:18:24+01:00
in scheme: Thésaurus de la désignation des objets mobiliers
preferred label: police cars @en-us
broader: véhicule terrestre spécialisé motorisé ou non
alternative label: véhicule d'intervention
alternative label: fourgon de police
alternative label: voiture de police
created: 2013-11-06T00:00:00+01:00
definition: Véhicule destiné aux policiers pour mener à bien leur mission de maintien de l'ordre public. Il peut servir à effectuer des patrouilles, poursuivre des fugitifs, transporter des justiciables ou servir d'escorte, ou encore assurer des opérations de maintien de l'ordre, etc. Il possède généralement un système d'avertissement afin de faciliter sa circulation.
status: 1

véhicule d'intervention
type: SimpleNonPreferredTerm
modified: 2014-12-30T12:18:24+01:00
created: 2014-01-15T14:54:24+01:00
status: 1

fourgon de police
type: SimpleNonPreferredTerm
modified: 2014-12-30T12:18:24+01:00
created: 2014-01-15T14:54:24+01:00
status: 1

voiture de police
type: SimpleNonPreferredTerm
modified: 2014-12-30T12:18:24+01:00
created: 2014-01-15T14:54:24+01:00
status: 1

véhicule de police
type: PreferredTerm
modified: 2014-12-30T12:18:24+01:00
created: 2014-01-15T14:54:24+01:00
status: 1

meule à aiguiser
type: Concept
modified: 2014-01-10T00:00:00+01:00
in scheme: Thésaurus de la désignation des objets mobiliers
broader: machine liée à la production artisanale
created: 2013-12-16T00:00:00+01:00
status: 1

meule à aiguiser
type: PreferredTerm
modified: 2014-01-10T00:00:00+01:00
created: 2014-01-15T14:54:24+01:00
status: 1

édicule et mobilier de jardin
type: PreferredTerm
modified: 2015-02-24T10:47:33+01:00
created: 2014-01-15T14:54:24+01:00
status: 1

monument aux morts
type: PreferredTerm
modified: 2015-02-24T13:02:57+01:00
created: 2014-01-15T14:54:24+01:00
status: 1

porte-berceau
type: Concept
modified: 2014-12-04T11:17:45+01:00
in scheme: Thésaurus de la désignation des objets mobiliers
broader: lit d'enfant
alternative label: chariot porte-berceau
alternative label: table porte-berceau
alternative label: pied porte-berceau
created: 2012-05-16T00:00:00+02:00
definition: Support fixe ou mobile sur lequel on pose un berceau ou auquel on le suspend. Il peut adopter des formes diverses.
status: 1
broad match: http://vocab.getty.edu/aat/300038847
broad match: http://data.bnf.fr/ark:/12148/cb119534659
broad match: Berceau

pied porte-berceau
type: SimpleNonPreferredTerm
modified: 2014-12-04T11:17:45+01:00
created: 2014-01-15T14:54:24+01:00
status: 1

porte-berceau
type: PreferredTerm
modified: 2014-12-04T11:17:45+01:00
created: 2014-01-15T14:54:24+01:00
status: 1

chariot porte-berceau
type: SimpleNonPreferredTerm
modified: 2014-12-04T11:17:45+01:00
created: 2014-01-15T14:54:24+01:00
status: 1

table porte-berceau
type: SimpleNonPreferredTerm
modified: 2014-12-04T11:17:45+01:00
created: 2014-01-15T14:54:24+01:00
status: 1

objet non identifié
type: Concept
modified: 2014-05-07T13:18:12+02:00
in scheme: Thésaurus de la désignation des objets mobiliers
broader: dénomination provisoire
created: 2014-05-07T13:18:12+02:00
status: 1

dénomination provisoire
type: PreferredTerm
modified: 2014-01-10T00:00:00+01:00
created: 2014-01-15T14:54:24+01:00
status: 1

clavecin
type: PreferredTerm
modified: 2014-12-15T11:52:23+01:00
created: 2014-01-15T14:54:24+01:00
status: 1

moteur électrique continu
type: Concept
modified: 2015-10-07T17:55:30+02:00
in scheme: Thésaurus de la désignation des objets mobiliers
broader: moteur électrique
created: 2012-05-16T00:00:00+02:00
definition: Moteur électrique utilisant une source d'énergie électrique continue.
status: 1

moteur électrique
type: PreferredTerm
modified: 2015-08-06T16:20:22+02:00
created: 2014-01-15T14:54:24+01:00
status: 1

miroir d'applique
type: Concept
modified: 2014-12-04T11:04:19+01:00
in scheme: Thésaurus de la désignation des objets mobiliers
preferred label: wall mirrors @en-us
broader: glace
created: 2012-05-16T00:00:00+02:00
definition: Glace accrochée provisoirement à un mur. Le miroir peut comporter des luminaires.
status: 1
broad match: http://data.bnf.fr/ark:/12148/cb159721071

miroir d'applique
type: PreferredTerm
modified: 2014-12-04T11:04:19+01:00
created: 2014-01-15T14:54:24+01:00
status: 1

placard de sacristie
type: SimpleNonPreferredTerm
modified: 2014-12-01T15:47:57+01:00
created: 2014-01-15T14:54:24+01:00
status: 1

armoire de sacristie-chasublier
type: SimpleNonPreferredTerm
modified: 2014-12-01T15:47:57+01:00
created: 2014-01-15T14:54:24+01:00
status: 1

armoire de sacristie-chapier
type: SimpleNonPreferredTerm
modified: 2014-12-01T15:47:57+01:00
created: 2014-01-15T14:54:24+01:00
status: 1

armoire de sacristie
type: SimpleNonPreferredTerm
modified: 2014-12-01T15:47:57+01:00
created: 2014-01-15T14:54:24+01:00
status: 1

meuble de sacristie
type: PreferredTerm
modified: 2014-12-01T15:47:57+01:00
created: 2014-01-15T14:54:24+01:00
status: 1

table de sacristie
type: SimpleNonPreferredTerm
modified: 2014-12-01T15:47:57+01:00
created: 2014-01-15T14:54:24+01:00
status: 1

coffre de sacristie
type: SimpleNonPreferredTerm
modified: 2014-12-01T15:47:57+01:00
created: 2014-01-15T14:54:24+01:00
status: 1

fonts baptismaux protestants
type: Concept
modified: 2014-01-10T00:00:00+01:00
in scheme: Thésaurus de la désignation des objets mobiliers
broader: meuble du culte protestant
created: 2012-05-16T00:00:00+02:00
definition: Rares dans les temples protestants, ils sont en général récents et peut-être à relier à l'influence presbytérienne. On les trouve plutôt à l'entrée du chœur.
status: 1

fonts baptismaux protestants
type: PreferredTerm
modified: 2014-01-10T00:00:00+01:00
created: 2014-01-15T14:54:24+01:00
status: 1

machine à agrafer
type: PreferredTerm
modified: 2015-08-10T15:57:48+02:00
created: 2014-01-15T14:54:24+01:00
status: 1

agrafeuse
type: SimpleNonPreferredTerm
modified: 2015-08-10T15:57:48+02:00
created: 2014-01-15T14:54:24+01:00
status: 1

coquille de mollusque
type: Concept
modified: 2014-12-15T16:03:24+01:00
in scheme: Thésaurus de la désignation des objets mobiliers
preferred label: shell (animal material) @en-us
broader: élément animal
alternative label: coquillage
created: 2013-12-24T00:00:00+01:00
definition: Squelette externe d'un mollusque. La coquille peut revêtir des formes plus variées pour les univalves - plate, en cône, en spirale (gastéropode), cloisonné (nautile) - que pour les bivalves.
status: 1

coquillage
type: SimpleNonPreferredTerm
modified: 2014-12-15T16:03:24+01:00
created: 2014-01-15T14:54:24+01:00
status: 1

coquille de mollusque
type: PreferredTerm
modified: 2014-12-15T16:03:24+01:00
created: 2014-01-15T14:54:24+01:00
status: 1

plaque d'insculpation
type: PreferredTerm
modified: 2014-12-30T12:51:28+01:00
created: 2014-01-15T14:54:24+01:00
status: 1

crédence
type: PreferredTerm
modified: 2014-12-01T12:15:38+01:00
created: 2014-01-15T14:54:24+01:00
status: 1

cierge funéraire
type: PreferredTerm
modified: 2014-11-27T10:53:30+01:00
created: 2014-01-15T14:54:24+01:00
status: 1

cierge d'honneur
type: SimpleNonPreferredTerm
modified: 2014-11-27T10:53:30+01:00
created: 2014-01-15T14:54:24+01:00
status: 1

véhicule de lutte contre l'incendie
type: PreferredTerm
modified: 2014-12-30T12:12:21+01:00
created: 2014-01-15T14:54:24+01:00
status: 1

camion de pompier
type: SimpleNonPreferredTerm
modified: 2014-12-30T12:12:21+01:00
created: 2014-01-15T14:54:24+01:00
status: 1

pompe à incendie
type: SimpleNonPreferredTerm
modified: 2014-12-30T12:12:21+01:00
created: 2014-01-15T14:54:24+01:00
status: 1

véhicule échelle
type: SimpleNonPreferredTerm
modified: 2014-12-30T12:12:21+01:00
created: 2014-01-15T14:54:24+01:00
status: 1

véhicule moto-pompe
type: SimpleNonPreferredTerm
modified: 2014-12-30T12:12:21+01:00
created: 2014-01-15T14:54:24+01:00
status: 1

volette
type: SimpleNonPreferredTerm
modified: 2014-12-04T16:02:27+01:00
created: 2014-01-15T14:54:24+01:00
status: 1

claie à fruits
type: SimpleNonPreferredTerm
modified: 2014-12-04T16:02:27+01:00
created: 2014-01-15T14:54:24+01:00
status: 1

claie
type: PreferredTerm
modified: 2014-12-04T16:02:27+01:00
created: 2014-01-15T14:54:24+01:00
status: 1

plat décoratif
type: Concept
modified: 2014-12-05T15:27:39+01:00
in scheme: Thésaurus de la désignation des objets mobiliers
preferred label: decorative dishes @en-us
broader: objet décoratif ou de rangement ou pour les plantes et les fleurs
alternative label: plat de montre
created: 2012-05-16T00:00:00+02:00
definition: Plat que ses grandes dimensions ou son décor destinent uniquement à l'usage décoratif.
status: 1

plat décoratif
type: PreferredTerm
modified: 2014-12-05T15:27:39+01:00
created: 2014-01-15T14:54:24+01:00
status: 1

plat de montre
type: SimpleNonPreferredTerm
modified: 2014-12-05T15:27:39+01:00
created: 2014-01-15T14:54:24+01:00
status: 1

glockenspiel
type: SimpleNonPreferredTerm
modified: 2014-10-10T13:36:14+02:00
created: 2014-01-15T14:54:24+01:00
status: 1

jeu de timbres
type: PreferredTerm
modified: 2014-10-10T13:36:14+02:00
created: 2014-01-15T14:54:24+01:00
status: 1

lyre militaire
type: SimpleNonPreferredTerm
modified: 2014-10-10T13:36:14+02:00
created: 2014-01-15T14:54:24+01:00
status: 1

jeu de timbre à clavier
type: SimpleNonPreferredTerm
modified: 2014-10-10T13:36:14+02:00
created: 2014-01-15T14:54:24+01:00
status: 1

carillon portable à lames
type: SimpleNonPreferredTerm
modified: 2014-10-10T13:36:14+02:00
created: 2014-01-15T14:54:24+01:00
status: 1

qame'a
type: SimpleNonPreferredTerm
modified: 2014-01-10T00:00:00+01:00
created: 2014-01-15T14:54:24+01:00
status: 1

amulette
type: SimpleNonPreferredTerm
modified: 2014-01-10T00:00:00+01:00
created: 2014-01-15T14:54:24+01:00
status: 1

shmirah
type: SimpleNonPreferredTerm
modified: 2014-01-10T00:00:00+01:00
created: 2014-01-15T14:54:24+01:00
status: 1

amulette de la religion juive
type: PreferredTerm
modified: 2014-01-10T00:00:00+01:00
created: 2014-01-15T14:54:24+01:00
status: 1

shiwiti
type: SimpleNonPreferredTerm
modified: 2014-01-10T00:00:00+01:00
created: 2014-01-15T14:54:24+01:00
status: 1

hamsah
type: SimpleNonPreferredTerm
modified: 2014-01-10T00:00:00+01:00
created: 2014-01-15T14:54:24+01:00
status: 1

torse
type: Concept
modified: 2014-12-04T10:50:04+01:00
in scheme: Thésaurus de la désignation des objets mobiliers
preferred label: torsos @en-us
broader: ronde-bosse
created: 2012-05-16T00:00:00+02:00
definition: Représentation en ronde-bosse d'un corps humain sans tête, sans bras et sans jambes.
status: 1
broad match: http://data.bnf.fr/ark:/12148/cb16745166f

torse
type: PreferredTerm
modified: 2014-12-04T10:50:04+01:00
created: 2014-01-15T14:54:24+01:00
status: 1

porte-pain de chandelle
type: PreferredTerm
modified: 2014-09-18T17:31:26+02:00
created: 2014-01-15T14:54:24+01:00
status: 1

chandelier de consécration
type: PreferredTerm
modified: 2014-11-27T16:02:32+01:00
created: 2014-01-15T14:54:24+01:00
status: 1

machine à braser
type: PreferredTerm
modified: 2015-10-08T14:21:52+02:00
created: 2014-01-15T14:54:24+01:00
status: 1

meule à broyer
type: Concept
modified: 2014-05-27T14:17:11+02:00
in scheme: Thésaurus de la désignation des objets mobiliers
narrower: dégorgeoir
broader: machine liée à la production artisanale
alternative label: meule à farine
alternative label: meule à huile
created: 2013-12-16T00:00:00+01:00
related: machine à meuler
related: machine à broyer
TermeAssocie: machine à meuler
TermeAssocie: machine à broyer
status: 1

machine à meuler
type: Concept
modified: 2015-09-01T10:50:40+02:00
in scheme: Thésaurus de la désignation des objets mobiliers
broader: machine à usiner par abrasion
alternative label: meuleuse
alternative label: poste d'émoulage
alternative label: affûteuse
created: 2012-05-16T00:00:00+02:00
scope note: Ne pas confondre avec meule à aiguiser.
related: meule à broyer
definition: Machine à usiner un produit par abrasion à l'aide d'une meule.
TermeAssocie: meule à broyer
status: 1
narrow match: http://vocab.getty.edu/aat/300023263
narrow match: Meuleuse

dégorgeoir
type: Concept
modified: 2014-01-10T00:00:00+01:00
in scheme: Thésaurus de la désignation des objets mobiliers
broader: meule à broyer
alternative label: dégorgeoir de moulin
created: 2013-12-16T00:00:00+01:00
status: 1

meule à huile
type: SimpleNonPreferredTerm
modified: 2014-05-27T14:17:11+02:00
created: 2014-01-15T14:54:24+01:00
status: 1

meule à broyer
type: PreferredTerm
modified: 2014-05-27T14:17:11+02:00
created: 2014-01-15T14:54:24+01:00
status: 1

machine à broyer
type: Concept
modified: 2015-10-09T11:55:47+02:00
in scheme: Thésaurus de la désignation des objets mobiliers
broader: machine à écraser
alternative label: broyeur à cylindres
alternative label: broyeur à galets
alternative label: broyeur
created: 2012-05-16T00:00:00+02:00
related: meule à broyer
definition: Machine à écraser des matériaux pour obtenir des produits en grains ou en poudre.
TermeAssocie: meule à broyer
status: 1
narrow match: Broyeur

meule à farine
type: SimpleNonPreferredTerm
modified: 2014-05-27T14:17:11+02:00
created: 2014-01-15T14:54:24+01:00
status: 1

bateau usine
type: PreferredTerm
modified: 2014-10-16T09:41:55+02:00
created: 2014-01-15T14:54:24+01:00
status: 1

ready-made
type: Concept
modified: 2014-10-17T16:16:15+02:00
in scheme: Thésaurus de la désignation des objets mobiliers
preferred label: ready-mades @en-us
broader: sculpture
created: 2013-07-19T00:00:00+02:00
definition: Objet manufacturé et utilitaire promu "objet d'art" par le choix de l'artiste et exposé comme tel.
status: 1

ready-made
type: PreferredTerm
modified: 2014-10-17T16:16:15+02:00
created: 2014-01-15T14:54:24+01:00
status: 1

plaque pour le pain azyme
type: Concept
modified: 2014-01-10T00:00:00+01:00
in scheme: Thésaurus de la désignation des objets mobiliers
broader: objet pour le pain azyme
alternative label: marque de pain azyme
created: 2012-05-16T00:00:00+02:00
definition: Plaque avec décor en creux servant à imprimer un décor particulier sur les pains azymes.
status: 1

plaque pour le pain azyme
type: PreferredTerm
modified: 2014-01-10T00:00:00+01:00
created: 2014-01-15T14:54:24+01:00
status: 1

marque de pain azyme
type: SimpleNonPreferredTerm
modified: 2014-01-10T00:00:00+01:00
created: 2014-01-15T14:54:24+01:00
status: 1

objet pour le pain azyme
type: Concept
modified: 2014-01-10T00:00:00+01:00
in scheme: Thésaurus de la désignation des objets mobiliers
narrower: plaque pour le pain azyme
narrower: T69-2085
narrower: T69-2080
broader: objet lié à la vie communautaire
created: 2012-05-16T00:00:00+02:00
status: 1

panneau de dévotion
type: PreferredTerm
modified: 2014-11-26T16:41:35+01:00
created: 2014-01-15T14:54:24+01:00
status: 1

tableau de dévotion
type: SimpleNonPreferredTerm
modified: 2014-11-26T16:41:35+01:00
created: 2014-01-15T14:54:24+01:00
status: 1

objet lié à la fête de la Pâque
type: PreferredTerm
modified: 2014-01-10T00:00:00+01:00
created: 2014-01-15T14:54:24+01:00
status: 1

aiguière et bassin de la Pâque
type: Concept
modified: 2014-01-10T00:00:00+01:00
in scheme: Thésaurus de la désignation des objets mobiliers
broader: objet lié à la fête de la Pâque
alternative label: aiguière et bassin de Pâque
created: 2012-05-16T00:00:00+02:00
related: aiguière
definition: Aiguière et bassin servant uniquement aux ablutions rituelles accompagnées d'une prière de bénédiction que l'on fait avant et pendant le repas de Pâque ou Seder.
TermeAssocie: aiguière
status: 1

coupe de sanctification de la Pâque
type: Concept
modified: 2014-01-10T00:00:00+01:00
in scheme: Thésaurus de la désignation des objets mobiliers
broader: objet lié à la fête de la Pâque
alternative label: coupe de sanctification pour la Pâque
created: 2012-05-16T00:00:00+02:00
definition: Coupe au-dessus de laquelle le père de famille prononce les paroles de bénédiction lors du repas de Pâque ; cette coupe se distingue des autres coupes de qiddoush par l'inscription du mot Pessah (Pâque). Elle est vidée quatre fois au cours du repas pour commémorer les quatre étapes de la délivrance du peuple juif.
status: 1

plat de la Pâque
type: Concept
modified: 2014-01-10T00:00:00+01:00
in scheme: Thésaurus de la désignation des objets mobiliers
broader: objet lié à la fête de la Pâque
alternative label: assiette de la Pâque
alternative label: assiette du Seder
alternative label: plat du Seder
alternative label: plat de Pâque
created: 2012-05-16T00:00:00+02:00
definition: Plat destiné à la célébration de la fête de Pâque. Il peut porter en son centre une étoile de David et diverses inscriptions touchant au repas rituel du Seder et concernant l'Agneau pascal (Pessah), le pain azyme (Matsah), l'œuf dur (beitsah) et l'herbe amère ou raifort (Maror), aliments symboliques de la veillée de Pâque.
status: 1

objet lié à Pessa'h
type: SimpleNonPreferredTerm
modified: 2014-01-10T00:00:00+01:00
created: 2014-01-15T14:54:24+01:00
status: 1

coupe du prophète Elie
type: Concept
modified: 2014-01-10T00:00:00+01:00
in scheme: Thésaurus de la désignation des objets mobiliers
broader: objet lié à la fête de la Pâque
created: 2012-05-16T00:00:00+02:00
definition: Coupe commémorative, symbole du retour du prophète Elie, placée sur la table du repas du Seder ; elle est plus grande que la coupe de Qiddoush et peut être munie d'un couvercle. Elle comporte un décor en relation avec Elie.
status: 1

instrument de mesure de phénomènes ondulatoires
type: Concept
modified: 2014-12-15T14:34:08+01:00
in scheme: Thésaurus de la désignation des objets mobiliers
narrower: instrument de mesure des phénomènes ondulatoires électromagnétiques
narrower: instrument de mesure des phénomènes ondulatoires mécaniques
broader: instrument de mesure
alternative label: oscilloscope
alternative label: oscillomètre
alternative label: fréquencemètre
created: 2012-05-16T00:00:00+02:00
definition: Instrument de mesure des caractéristiques (amplitude ; fréquence, exprimée en Hertz ; spectre ; durée) d'un signal, phénomène ondulatoire mécanique ou électromagnétique, par comparaison, au moyen de générateurs, à un signal de référence, ou par représentation graphique du seul signal à étudier.
status: 1
narrow match: Fréquencemètre
broad match: http://data.bnf.fr/ark:/12148/cb119324889

fréquencemètre
type: SimpleNonPreferredTerm
modified: 2014-12-15T14:34:08+01:00
created: 2014-01-15T14:54:24+01:00
status: 1

oscillomètre
type: SimpleNonPreferredTerm
modified: 2014-12-15T14:34:08+01:00
created: 2014-01-15T14:54:24+01:00
status: 1

oscilloscope
type: SimpleNonPreferredTerm
modified: 2014-12-15T14:34:08+01:00
created: 2014-01-15T14:54:24+01:00
status: 1

instrument de mesure de phénomènes ondulatoires
type: PreferredTerm
modified: 2014-12-15T14:34:08+01:00
created: 2014-01-15T14:54:24+01:00
status: 1

guéridon porte-luminaire
type: Concept
modified: 2014-12-04T12:01:54+01:00
in scheme: Thésaurus de la désignation des objets mobiliers
preferred label: guéridons @en-us
broader: porte-luminaire
created: 2012-05-16T00:00:00+02:00
related: réflecteur
definition: Support monopode à petit plateau servant à surélever un luminaire portatif. Il est constitué d'une tige de bois reposant le plus souvent sur un patin circulaire et massif, lui-même monté sur pieds en boule. Il est de hauteur fixe ou réglable.
TermeAssocie: réflecteur
status: 1

guéridon porte-luminaire
type: PreferredTerm
modified: 2014-12-04T12:01:54+01:00
created: 2014-01-15T14:54:24+01:00
status: 1

poivrière saupoudreuse
type: PreferredTerm
modified: 2014-10-17T11:23:58+02:00
created: 2014-01-15T14:54:24+01:00
status: 1

saupoudreuse à poivre
type: SimpleNonPreferredTerm
modified: 2014-10-17T11:23:58+02:00
created: 2014-01-15T14:54:24+01:00
status: 1

pétrin industriel
type: SimpleNonPreferredTerm
modified: 2015-10-15T16:26:39+02:00
created: 2014-01-15T14:54:24+01:00
status: 1

machine à pétrir
type: PreferredTerm
modified: 2015-10-15T16:26:39+02:00
created: 2014-01-15T14:54:24+01:00
status: 1

pétrin mécanique
type: SimpleNonPreferredTerm
modified: 2015-10-15T16:26:39+02:00
created: 2014-01-15T14:54:24+01:00
status: 1

porte-lunule
type: Concept
modified: 2014-11-27T15:36:35+01:00
in scheme: Thésaurus de la désignation des objets mobiliers
preferred label: lunette stands @en-us
preferred label: portalunetta @it
preferred label: porta-lúnula @pt
broader: objet lié à l'Eucharistie
alternative label: porte-croissant
created: 2012-05-16T00:00:00+02:00
definition: Support sur lequel est posée la lunule ou le croissant eucharistique permettant de ranger ou exposer l'hostie à l'adoration des fidèles lors d'une cérémonie non solennelle.
status: 1
broad match: cb11936841q
broad match: http://vocab.getty.edu/aat/300039767
broad match: Lunule (liturgie)

porte-lunule
type: PreferredTerm
modified: 2014-11-27T15:36:35+01:00
created: 2014-01-15T14:54:24+01:00
status: 1

porte-croissant
type: SimpleNonPreferredTerm
modified: 2014-11-27T15:36:35+01:00
created: 2014-01-15T14:54:24+01:00
status: 1

armoire garde-manger
type: PreferredTerm
modified: 2014-12-04T15:34:45+01:00
created: 2014-01-15T14:54:24+01:00
status: 1

cuisinière
type: Concept
modified: 2014-12-05T10:50:31+01:00
in scheme: Thésaurus de la désignation des objets mobiliers
preferred label: stoves (cooking equipment) @en-us
broader: meuble pour le feu ou le réchauffage
alternative label: fourneau
created: 2012-05-16T00:00:00+02:00
definition: Immeuble maçonné ou meuble de métal (rarement de bois et pierre) bas ou à hauteur d'appui, comportant une ou plusieurs sources de chaleur permettant la cuisson des aliments sur le dessus et au four (fourneau). La cuisinière peut être à bois, à charbon ou à gaz (gazinière), à résistances électriques ou mixte (bois et charbon, charbon et gaz, etc.).
status: 1

fourneau
type: SimpleNonPreferredTerm
modified: 2014-12-05T10:50:31+01:00
created: 2014-01-15T14:54:24+01:00
status: 1

cuisinière
type: PreferredTerm
modified: 2014-12-05T10:50:31+01:00
created: 2014-01-15T14:54:24+01:00
status: 1

signal
type: Concept
modified: 2015-02-24T11:41:10+01:00
in scheme: Thésaurus de la désignation des objets mobiliers
preferred label: signaling equipment @en-us
broader: édicule ou mobilier de l'espace public ou du génie civil
alternative label: signal lumineux
alternative label: signal mécanique
alternative label: lampe de phare
alternative label: signal sonore
alternative label: panneau de signalisation
alternative label: signal à main
alternative label: feu tricolore
alternative label: lentille de Fresnel
created: 2014-01-10T00:00:00+01:00
definition: Appareil, panneau, avertisseur sonore ou visuel donnant au conducteur des instructions ou des renseignements.
status: 1

signal à main
type: SimpleNonPreferredTerm
modified: 2015-02-24T11:41:10+01:00
created: 2014-01-15T14:54:24+01:00
status: 1

signal mécanique
type: SimpleNonPreferredTerm
modified: 2015-02-24T11:41:10+01:00
created: 2014-01-15T14:54:24+01:00
status: 1

lentille de Fresnel
type: SimpleNonPreferredTerm
modified: 2015-02-24T11:41:10+01:00
created: 2014-01-15T14:54:24+01:00
status: 1

signal sonore
type: SimpleNonPreferredTerm
modified: 2015-02-24T11:41:10+01:00
created: 2014-01-15T14:54:24+01:00
status: 1

feu tricolore
type: SimpleNonPreferredTerm
modified: 2015-02-24T11:41:10+01:00
created: 2014-01-15T14:54:24+01:00
status: 1

lampe de phare
type: SimpleNonPreferredTerm
modified: 2015-02-24T11:41:10+01:00
created: 2014-01-15T14:54:24+01:00
status: 1

signal
type: PreferredTerm
modified: 2015-02-24T11:41:10+01:00
created: 2014-01-15T14:54:24+01:00
status: 1

panneau de signalisation
type: SimpleNonPreferredTerm
modified: 2015-02-24T11:41:10+01:00
created: 2014-01-15T14:54:24+01:00
status: 1

signal lumineux
type: SimpleNonPreferredTerm
modified: 2015-02-24T11:41:10+01:00
created: 2014-01-15T14:54:24+01:00
status: 1

équerre
type: Concept
modified: 2014-01-10T00:00:00+01:00
in scheme: Thésaurus de la désignation des objets mobiliers
broader: outil servant à mesurer ou dessiner
alternative label: équerre mobile
alternative label: équerre réglable
alternative label: fausse équerre
created: 2013-12-16T00:00:00+01:00
status: 1

équerre
type: PreferredTerm
modified: 2014-01-10T00:00:00+01:00
created: 2014-01-15T14:54:24+01:00
status: 1

fausse équerre
type: SimpleNonPreferredTerm
modified: 2014-01-10T00:00:00+01:00
created: 2014-01-15T14:54:24+01:00
status: 1

équerre réglable
type: SimpleNonPreferredTerm
modified: 2014-01-10T00:00:00+01:00
created: 2014-01-15T14:54:24+01:00
status: 1

équerre mobile
type: SimpleNonPreferredTerm
modified: 2014-01-10T00:00:00+01:00
created: 2014-01-15T14:54:24+01:00
status: 1

plaque à beurre
type: SimpleNonPreferredTerm
modified: 2014-12-05T16:18:08+01:00
created: 2014-01-15T14:54:24+01:00
status: 1

marque à beurre
type: PreferredTerm
modified: 2014-12-05T16:18:08+01:00
created: 2014-01-15T14:54:24+01:00
status: 1

rouleau à beurre
type: SimpleNonPreferredTerm
modified: 2014-12-05T16:18:08+01:00
created: 2014-01-15T14:54:24+01:00
status: 1

meuble à clystère
type: Concept
modified: 2014-12-04T12:33:29+01:00
in scheme: Thésaurus de la désignation des objets mobiliers
broader: meuble d'hygiène
created: 2012-05-16T00:00:00+02:00
related: clystère
definition: Meuble comportant une seringue (tube, corps de pompe et canule) permettant de s'administrer soi-même un lavement, en position assise.
TermeAssocie: clystère
status: 1
broad match: http://vocab.getty.edu/aat/300037680

clystère
type: Concept
modified: 2014-01-10T00:00:00+01:00
in scheme: Thésaurus de la désignation des objets mobiliers
broader: T69-4332
alternative label: clystère soi-même
created: 2013-12-10T00:00:00+01:00
related: meuble à clystère
TermeAssocie: meuble à clystère
status: 1

meuble à clystère
type: PreferredTerm
modified: 2014-12-04T12:33:29+01:00
created: 2014-01-15T14:54:24+01:00
status: 1

flacon à astringent
type: Concept
modified: 2014-01-10T00:00:00+01:00
in scheme: Thésaurus de la désignation des objets mobiliers
broader: nécessaire de circoncision
created: 2012-05-16T00:00:00+02:00
definition: Petit flacon contenant de la poudre ou du liquide astringent utilisé après la circoncision.
status: 1

nécessaire de circoncision
type: Concept
modified: 2014-01-10T00:00:00+01:00
in scheme: Thésaurus de la désignation des objets mobiliers
narrower: flacon à astringent
narrower: pince de circoncision
narrower: T69-2041
narrower: T69-2040
broader: objet lié à la naissance et à la circoncision
created: 2012-05-16T00:00:00+02:00
scope note: La circoncision se pratique huit jours après la naissance et marque l'entrée de tout mâle juif dans l'alliance entre Dieu et Israël.
definition: Ensemble composé d'une pince pour maintenir le prépuce, d'un couteau et/ou d'une paire de ciseaux et d'un ou deux flacons à astringent, utilisés par le circonciseur (mohèl).
status: 1

flacon à astringent
type: PreferredTerm
modified: 2014-01-10T00:00:00+01:00
created: 2014-01-15T14:54:24+01:00
status: 1

machine à palissonner
type: SimpleNonPreferredTerm
modified: 2014-01-10T00:00:00+01:00
created: 2014-01-15T14:54:24+01:00
status: 1

machine à assouplir
type: PreferredTerm
modified: 2014-01-10T00:00:00+01:00
created: 2014-01-15T14:54:24+01:00
status: 1

dérompeuse
type: SimpleNonPreferredTerm
modified: 2014-01-10T00:00:00+01:00
created: 2014-01-15T14:54:24+01:00
status: 1

bronze d'ameublement
type: SimpleNonPreferredTerm
modified: 2014-10-10T14:55:41+02:00
created: 2014-01-15T14:54:24+01:00
status: 1

battant
type: SimpleNonPreferredTerm
modified: 2014-10-10T14:55:41+02:00
created: 2014-01-15T14:54:24+01:00
status: 1

élément de meuble
type: PreferredTerm
modified: 2014-10-10T14:55:41+02:00
created: 2014-01-15T14:54:24+01:00
status: 1

tiroir
type: SimpleNonPreferredTerm
modified: 2014-10-10T14:55:41+02:00
created: 2014-01-15T14:54:24+01:00
status: 1

véhicule de la recherche spatiale
type: Concept
modified: 2014-12-17T14:39:52+01:00
in scheme: Thésaurus de la désignation des objets mobiliers
preferred label: spacecraft @en-us
broader: matériel de transport aéronautique
alternative label: astronef
alternative label: satellite artificiel
alternative label: spationef
alternative label: fusée spatiale
alternative label: navette spatiale
alternative label: sonde spatiale
alternative label: station spatiale
alternative label: capsule spatiale
created: 2013-11-06T00:00:00+01:00
definition: Véhicule, habité ou inhabité, permettant de se déplacer, de résider dans l'espace ou d'y accéder depuis la surface d'un corps céleste.
status: 1

spationef
type: SimpleNonPreferredTerm
modified: 2014-12-17T14:39:52+01:00
created: 2014-01-15T14:54:24+01:00
status: 1

fusée spatiale
type: SimpleNonPreferredTerm
modified: 2014-12-17T14:39:52+01:00
created: 2014-01-15T14:54:24+01:00
status: 1

capsule spatiale
type: SimpleNonPreferredTerm
modified: 2014-12-17T14:39:52+01:00
created: 2014-01-15T14:54:24+01:00
status: 1

astronef
type: SimpleNonPreferredTerm
modified: 2014-12-17T14:39:52+01:00
created: 2014-01-15T14:54:24+01:00
status: 1

satellite artificiel
type: SimpleNonPreferredTerm
modified: 2014-12-17T14:39:52+01:00
created: 2014-01-15T14:54:24+01:00
status: 1

station spatiale
type: SimpleNonPreferredTerm
modified: 2014-12-17T14:39:52+01:00
created: 2014-01-15T14:54:24+01:00
status: 1

sonde spatiale
type: SimpleNonPreferredTerm
modified: 2014-12-17T14:39:52+01:00
created: 2014-01-15T14:54:24+01:00
status: 1

navette spatiale
type: SimpleNonPreferredTerm
modified: 2014-12-17T14:39:52+01:00
created: 2014-01-15T14:54:24+01:00
status: 1

véhicule de la recherche spatiale
type: PreferredTerm
modified: 2014-12-17T14:39:52+01:00
created: 2014-01-15T14:54:24+01:00
status: 1

graffiti
type: PreferredTerm
modified: 2014-12-03T15:17:12+01:00
created: 2014-01-15T14:54:24+01:00
status: 1

réflecteur de chaleur
type: Concept
modified: 2014-09-19T11:03:01+02:00
in scheme: Thésaurus de la désignation des objets mobiliers
broader: objet d'âtre pour la cuisson
alternative label: coquille-réflecteur
created: 2012-05-16T00:00:00+02:00
definition: Large coquille, posée verticalement devant le feu, servant à réfléchir la chaleur dans la cuisson à la broche.
status: 1
broad match: cb11931172v
broad match: http://vocab.getty.edu/aat/300200422

coquille-réflecteur
type: SimpleNonPreferredTerm
modified: 2014-09-19T11:03:01+02:00
created: 2014-01-15T14:54:24+01:00
status: 1

réflecteur de chaleur
type: PreferredTerm
modified: 2014-09-19T11:03:01+02:00
created: 2014-01-15T14:54:24+01:00
status: 1

aiguiseur à trousser
type: SimpleNonPreferredTerm
modified: 2014-10-16T15:26:54+02:00
created: 2014-01-15T14:54:24+01:00
status: 1

aiguille à brider
type: PreferredTerm
modified: 2014-10-16T15:26:54+02:00
created: 2014-01-15T14:54:24+01:00
status: 1

réserve à saint chrême
type: PreferredTerm
modified: 2014-12-01T10:55:48+01:00
created: 2014-01-15T14:54:24+01:00
status: 1

installation
type: Concept
modified: 2014-10-17T16:13:56+02:00
in scheme: Thésaurus de la désignation des objets mobiliers
preferred label: installations (visual works) @en-us
broader: sculpture
created: 2013-07-19T00:00:00+02:00
related: oeuvre multimédia
definition: Œuvre, souvent monumentale, composée d'objets placés dans un espace spécifique et destinés à transformer la perception de celui-ci lorsqu'on le parcourt. On parle de land art lorsque l'installation est placée en extérieur.
TermeAssocie: oeuvre multimédia
status: 1

installation
type: PreferredTerm
modified: 2014-10-17T16:13:56+02:00
created: 2014-01-15T14:54:24+01:00
status: 1

chrémeau d'autel
type: Concept
modified: 2014-12-02T15:55:14+01:00
in scheme: Thésaurus de la désignation des objets mobiliers
preferred label: tovaglia crismale @it
preferred label: chrismales (altar cloths) @en-us
preferred label: toalha crismal @pt
broader: linge ou garniture liés à l'autel
created: 2012-05-16T00:00:00+02:00
scope note: Ne pas le confondre avec le chrémeau d'ordination, le chrémeau de confirmation et le chrémeau de baptême.
related: T69-581
definition: Pièce de tissu enduite de cire, mise en place à la fin de la cérémonie de la consécration d'un autel pour conserver le saint Chrême utilisé lors de cette cérémonie et éviter de tacher les nappes d'autel. Le chrémeau d'autel reste ensuite étendu sur la partie consacrée, soit sur la table d'autel lorsqu'il est consacré dans son ensemble, soit sur la pierre d'autel qu'il enveloppe généralement.
TermeAssocie: T69-581
status: 1
broad match: http://data.bnf.fr/ark:/12148/cb12255605d

coussin d'autel
type: Concept
modified: 2014-12-02T15:57:02+01:00
in scheme: Thésaurus de la désignation des objets mobiliers
preferred label: altar cushions @en-us
preferred label: cuscino per libro liturgico @it
preferred label: almofada de missal @pt
broader: linge ou garniture liés à l'autel
alternative label: coussin de livre liturgique
alternative label: coussin de missel
alternative label: coussin de l'évangéliaire
created: 2012-05-16T00:00:00+02:00
definition: Coussin utilisé pour poser les livres liturgiques sur une table d'autel et en protéger la reliure. Il peut être de la couleur du temps liturgique.
status: 1

tapis de choeur
type: Concept
modified: 2015-03-09T10:46:43+01:00
in scheme: Thésaurus de la désignation des objets mobiliers
preferred label: tappeto del coro @it
preferred label: chancel carpets @en-us
preferred label: tapete de coro @pt
broader: linge ou garniture liés à l'autel
alternative label: tapis de chœur
created: 2012-05-16T00:00:00+02:00
scope note: Tapis recouvrant l'ensemble du sanctuaire à l'exception de la partie que recouvre le tapis d'autel. Il peut épouser la forme du sanctuaire.
status: 1

linge ou garniture liés à l'autel
type: PreferredTerm
modified: 2014-12-02T15:54:08+01:00
created: 2014-01-15T14:54:24+01:00
status: 1

tapis de dessus d'autel
type: Concept
modified: 2014-12-02T16:09:07+01:00
in scheme: Thésaurus de la désignation des objets mobiliers
preferred label: altar covers @en-us
preferred label: vesperale @it
preferred label: vesperal @pt
broader: linge ou garniture liés à l'autel
alternative label: tapis de la table d'autel
alternative label: housse d'autel
alternative label: dessus d'autel
alternative label: couverture d'autel
created: 2012-05-16T00:00:00+02:00
definition: Pièce de tissu épais, recouvrant les nappes d'autel pour les protéger entre les offices. Plus grand que la table d'autel, ce tapis, souvent de couleur rouge ou verte, peut être bordé de franges et porter un décor sur ses parties tombantes.
status: 1

tour d'autel
type: Concept
modified: 2014-12-02T16:12:00+01:00
in scheme: Thésaurus de la désignation des objets mobiliers
preferred label: guarnizione d'altare @it
preferred label: superfrontals @en-us
preferred label: pano de altar @pt
broader: linge ou garniture liés à l'autel
created: 2012-05-16T00:00:00+02:00
scope note: Ne pas confondre avec l'antependium.
related: T69-618
definition: Bande de tissu rectangulaire, suspendue ou attachée au bord de la table d'autel, comportant un décor et souvent une frange sur son bord inférieur.
TermeAssocie: T69-618
status: 1
broad match: http://data.bnf.fr/ark:/12148/cb12255605d
broad match: Autel (christianisme)

couverture de livre liturgique
type: Concept
modified: 2014-12-02T15:57:59+01:00
in scheme: Thésaurus de la désignation des objets mobiliers
preferred label: velo per libro liturgico @it
preferred label: litugical book veils @en-us
preferred label: suprevangélia @pt
broader: linge ou garniture liés à l'autel
alternative label: couverture d'évangéliaire
alternative label: couverture de missel
alternative label: housse de missel
alternative label: housse de livre liturgique
created: 2012-05-16T00:00:00+02:00
related: couverture de Torah
related: livre liturgique
definition: Pièce de tissu, de la couleur du temps liturgique, utilisée, lors des offices solennels, pour envelopper et protéger un livre liturgique.
TermeAssocie: couverture de Torah
TermeAssocie: livre liturgique
status: 1
broad match: http://vocab.getty.edu/aat/300215113

portail
type: Concept
modified: 2014-12-15T15:15:29+01:00
in scheme: Thésaurus de la désignation des objets mobiliers
preferred label: portals @en-us
broader: porte
created: 2012-05-16T00:00:00+02:00
scope note: Ne pas appeler portail chacune des portes de cette composition. Voir aussi le Thesaurus de la désignation des œuvres architecturales et des espaces aménagés.
definition: Composition monumentale à une ou plusieurs portes extérieures.
status: 1

porte
type: Concept
modified: 2014-12-15T15:02:15+01:00
in scheme: Thésaurus de la désignation des objets mobiliers
preferred label: doors @en-us
narrower: portail
broader: baie
created: 2012-05-16T00:00:00+02:00
scope note: Voir aussi le Thesaurus de la désignation des œuvres architecturales et des espaces aménagés.
definition: Baie de communication fermée par un vantail ou des vantaux. La porte se distingue des autres baies formant communication, comme certaines arcades, par sa fonction précise dans la distribution.
status: 1

portail
type: PreferredTerm
modified: 2014-12-15T15:15:29+01:00
created: 2014-01-15T14:54:24+01:00
status: 1

véhicule à énergie animale pour le transport des personnes
type: Concept
modified: 2014-12-30T11:35:38+01:00
in scheme: Thésaurus de la désignation des objets mobiliers
preferred label: carriages (vehicles) @en-us
broader: véhicule à énergie animale
alternative label: milord
alternative label: break hippomobile
alternative label: drag
alternative label: buggy
alternative label: calèche
alternative label: carrosse
alternative label: coupé hippomobile
alternative label: fiacre
alternative label: cabriolet hippomobile
alternative label: landau
alternative label: berline hippomobile
alternative label: coche
alternative label: omnibus à impériale
alternative label: carrick
alternative label: coach
alternative label: dormeuse
alternative label: omnibus
created: 2013-11-05T00:00:00+01:00
definition: Véhicule terrestre à énergie animale destiné au transport de passagers.
status: 1

omnibus
type: SimpleNonPreferredTerm
modified: 2014-12-30T11:35:38+01:00
created: 2014-01-15T14:54:24+01:00
status: 1

coach
type: SimpleNonPreferredTerm
modified: 2014-12-30T11:35:38+01:00
created: 2014-01-15T14:54:24+01:00
status: 1

buggy
type: SimpleNonPreferredTerm
modified: 2014-12-30T11:35:38+01:00
created: 2014-01-15T14:54:24+01:00
status: 1

coche
type: SimpleNonPreferredTerm
modified: 2014-12-30T11:35:38+01:00
created: 2014-01-15T14:54:24+01:00
status: 1

carrosse
type: SimpleNonPreferredTerm
modified: 2014-12-30T11:35:38+01:00
created: 2014-01-15T14:54:24+01:00
status: 1

dormeuse
type: SimpleNonPreferredTerm
modified: 2014-12-30T11:35:38+01:00
created: 2014-01-15T14:54:24+01:00
status: 1

calèche
type: SimpleNonPreferredTerm
modified: 2014-12-30T11:35:38+01:00
created: 2014-01-15T14:54:24+01:00
status: 1

berline hippomobile
type: SimpleNonPreferredTerm
modified: 2014-12-30T11:35:38+01:00
created: 2014-01-15T14:54:24+01:00
status: 1

landau
type: SimpleNonPreferredTerm
modified: 2014-12-30T11:35:38+01:00
created: 2014-01-15T14:54:24+01:00
status: 1

carrick
type: SimpleNonPreferredTerm
modified: 2014-12-30T11:35:38+01:00
created: 2014-01-15T14:54:24+01:00
status: 1

fiacre
type: SimpleNonPreferredTerm
modified: 2014-12-30T11:35:38+01:00
created: 2014-01-15T14:54:24+01:00
status: 1

milord
type: SimpleNonPreferredTerm
modified: 2014-12-30T11:35:38+01:00
created: 2014-01-15T14:54:24+01:00
status: 1

drag
type: SimpleNonPreferredTerm
modified: 2014-12-30T11:35:38+01:00
created: 2014-01-15T14:54:24+01:00
status: 1

cabriolet hippomobile
type: SimpleNonPreferredTerm
modified: 2014-12-30T11:35:38+01:00
created: 2014-01-15T14:54:24+01:00
status: 1

omnibus à impériale
type: SimpleNonPreferredTerm
modified: 2014-12-30T11:35:38+01:00
created: 2014-01-15T14:54:24+01:00
status: 1

véhicule à énergie animale pour le transport des personnes
type: PreferredTerm
modified: 2014-12-30T11:35:38+01:00
created: 2014-01-15T14:54:24+01:00
status: 1

coupé hippomobile
type: SimpleNonPreferredTerm
modified: 2014-12-30T11:35:38+01:00
created: 2014-01-15T14:54:24+01:00
status: 1

break hippomobile
type: SimpleNonPreferredTerm
modified: 2014-12-30T11:35:38+01:00
created: 2014-01-15T14:54:24+01:00
status: 1

table à égoutter le cochon
type: SimpleNonPreferredTerm
modified: 2014-12-04T15:10:58+01:00
created: 2014-01-15T14:54:24+01:00
status: 1

échelle à vider le cochon
type: SimpleNonPreferredTerm
modified: 2014-12-04T15:10:58+01:00
created: 2014-01-15T14:54:24+01:00
status: 1

table à tuer le cochon
type: SimpleNonPreferredTerm
modified: 2014-12-04T15:10:58+01:00
created: 2014-01-15T14:54:24+01:00
status: 1

auge à boudin
type: SimpleNonPreferredTerm
modified: 2014-12-04T15:10:58+01:00
created: 2014-01-15T14:54:24+01:00
status: 1

auge à ébouillanter le cochon
type: SimpleNonPreferredTerm
modified: 2014-12-04T15:10:58+01:00
created: 2014-01-15T14:54:24+01:00
status: 1

treuil à cochon
type: SimpleNonPreferredTerm
modified: 2014-12-04T15:10:58+01:00
created: 2014-01-15T14:54:24+01:00
status: 1

meuble pour préparer le cochon
type: PreferredTerm
modified: 2014-12-04T15:10:58+01:00
created: 2014-01-15T14:54:24+01:00
status: 1

tronc à quêter
type: Concept
modified: 2014-11-27T15:56:36+01:00
in scheme: Thésaurus de la désignation des objets mobiliers
preferred label: bussolotto per elemosine @it
preferred label: collection boxes @en-us
preferred label: caixa de orfertório @pt
broader: objet lié à l'offrande et à la quête
alternative label: tronc de quête
created: 2012-05-16T00:00:00+02:00
definition: Boîte, parfois munie d'une anse, percée d’une fente destinée à recevoir l’argent des aumônes et offrandes.
status: 1
broad match: http://data.bnf.fr/ark:/12148/cb119668311

tronc à quêter
type: PreferredTerm
modified: 2014-11-27T15:56:36+01:00
created: 2014-01-15T14:54:24+01:00
status: 1

tronc de quête
type: SimpleNonPreferredTerm
modified: 2014-11-27T15:56:36+01:00
created: 2014-01-15T14:54:24+01:00
status: 1

machine à pelotonner
type: Concept
modified: 2015-10-15T14:52:12+02:00
in scheme: Thésaurus de la désignation des objets mobiliers
broader: machine à arranger
alternative label: pelotonneuse à une tête
alternative label: pelotonneuse
alternative label: pelotonneuse à ailettes
created: 2012-05-16T00:00:00+02:00
definition: Machine à arranger en pelote, du fil, de la ficelle, des cordelettes, etc.
status: 1

pelotonneuse à ailettes
type: SimpleNonPreferredTerm
modified: 2015-10-15T14:52:12+02:00
created: 2014-01-15T14:54:24+01:00
status: 1

machine à pelotonner
type: PreferredTerm
modified: 2015-10-15T14:52:12+02:00
created: 2014-01-15T14:54:24+01:00
status: 1

pelotonneuse
type: SimpleNonPreferredTerm
modified: 2015-10-15T14:52:12+02:00
created: 2014-01-15T14:54:24+01:00
status: 1

pelotonneuse à une tête
type: SimpleNonPreferredTerm
modified: 2015-10-15T14:52:12+02:00
created: 2014-01-15T14:54:24+01:00
status: 1

machine à usiner par abrasion
type: Concept
modified: 2015-10-14T14:10:33+02:00
in scheme: Thésaurus de la désignation des objets mobiliers
narrower: machine à meuler
broader: machine à usiner
alternative label: débruteuse
alternative label: ponceuse à bandes
alternative label: banc de diamantaire
created: 2012-05-16T00:00:00+02:00
definition: Machine à usiner un produit en l'usant par frottement à l'aide d'un abrasif.
status: 1
narrow match: http://vocab.getty.edu/aat/300163618
narrow match: Ponceuse à bande
narrow match: cb14429648n

banc de diamantaire
type: SimpleNonPreferredTerm
modified: 2015-10-14T14:10:33+02:00
created: 2014-01-15T14:54:24+01:00
status: 1

ponceuse à bandes
type: SimpleNonPreferredTerm
modified: 2015-10-14T14:10:33+02:00
created: 2014-01-15T14:54:24+01:00
status: 1

débruteuse
type: SimpleNonPreferredTerm
modified: 2015-10-14T14:10:33+02:00
created: 2014-01-15T14:54:24+01:00
status: 1

machine à usiner par abrasion
type: PreferredTerm
modified: 2015-10-14T14:10:33+02:00
created: 2014-01-15T14:54:24+01:00
status: 1

faux tabernacle
type: Concept
modified: 2014-10-20T12:28:51+02:00
in scheme: Thésaurus de la désignation des objets mobiliers
broader: meuble lié à l'Eucharistie
created: 2012-05-16T00:00:00+02:00
definition: Imitation de tabernacle sans porte et ne contenant donc aucun vase sacré. Il a une fonction décorative et peut servir de socle à une statue.
status: 1
broad match: http://data.bnf.fr/ark:/12148/cb121654992
broad match: http://vocab.getty.edu/aat/300207778

faux tabernacle
type: PreferredTerm
modified: 2014-10-20T12:28:51+02:00
created: 2014-01-15T14:54:24+01:00
status: 1

navette à encens
type: PreferredTerm
modified: 2014-11-27T11:49:31+01:00
created: 2014-01-15T14:54:24+01:00
status: 1

porte-burettes
type: Concept
modified: 2014-11-27T15:33:02+01:00
in scheme: Thésaurus de la désignation des objets mobiliers
preferred label: ampolliera @it
preferred label: altar cruets stands @en-us
preferred label: porta-galhetas @pt
broader: objet lié à l'Eucharistie
created: 2012-05-16T00:00:00+02:00
related: chapelle de messe
definition: Support comportant des armatures servant de réceptacles pour maintenir les burettes.
TermeAssocie: chapelle de messe
status: 1
broad match: cb15093831x
broad match: Burettes

porte-burettes
type: PreferredTerm
modified: 2014-11-27T15:33:02+01:00
created: 2014-01-15T14:54:24+01:00
status: 1

table à pains bénits
type: Concept
modified: 2014-12-01T17:05:34+01:00
in scheme: Thésaurus de la désignation des objets mobiliers
preferred label: holy bread tables @en-us
preferred label: tavola per i pani benedetti @it
preferred label: mesa de pães bentos @pt
broader: meuble lié à l'offrande
created: 2012-05-16T00:00:00+02:00
definition: Petite table servant dans certaines régions de France à déposer des morceaux de pains bénits que l'on distribue à la fin de la messe, généralement en échange d'une offrande.
status: 1

table à pains bénits
type: PreferredTerm
modified: 2014-12-01T17:05:34+01:00
created: 2014-01-15T14:54:24+01:00
status: 1

écharpe
type: Concept
modified: 2014-12-11T16:20:04+01:00
in scheme: Thésaurus de la désignation des objets mobiliers
preferred label: scarves (costume accessories) @en-us
broader: vêtement d'extérieur
created: 2013-11-14T00:00:00+01:00
related: étole de clerc
definition: Pièce d'étoffe rectangulaire portée sur le manteau ou la veste ou dans l'encolure de ceux-ci permettant de se protéger du froid et servant d'ornement.
TermeAssocie: étole de clerc
status: 1

vêtement d'extérieur
type: Concept
modified: 2014-10-20T10:41:13+02:00
in scheme: Thésaurus de la désignation des objets mobiliers
preferred label: outerwear @en-us
narrower: écharpe
narrower: T69-6465
narrower: T69-6463
broader: costume civil, professionnel ou militaire
created: 2012-05-16T00:00:00+02:00
definition: Vêtement qui se porte exclusivement à l'extérieur de la maison, essentiellement dehors ou dans certains lieux abrités.
status: 1
broad match: cb11963612g

écharpe
type: PreferredTerm
modified: 2014-12-11T16:20:04+01:00
created: 2014-01-15T14:54:24+01:00
status: 1

fontaine de sacristie
type: PreferredTerm
modified: 2014-12-01T16:12:25+01:00
created: 2014-01-15T14:54:24+01:00
status: 1

meuble lié à l'ablution, à l'aspersion et à l'encensement
type: Concept
modified: 2014-12-01T15:54:15+01:00
in scheme: Thésaurus de la désignation des objets mobiliers
preferred label: furniture and furnishings for ablution and aspersion @en-us
preferred label: arredi per l'abluzione e l'aspersione @it
preferred label: mobiliário relacionado com a ablução e a aspersão @pt
narrower: fontaine de sacristie
narrower: lavabo de sacristie
narrower: bénitier
narrower: porte-seau à eau bénite
narrower: lavabo d'église
broader: meuble du culte catholique
created: 2012-05-16T00:00:00+02:00
definition: Elément pouvant contenir l’eau nécessaire aux ablutions ou à l’aspersion.
status: 1
broad match: http://vocab.getty.edu/aat/300003724

grémial
type: Concept
modified: 2014-12-03T11:07:24+01:00
in scheme: Thésaurus de la désignation des objets mobiliers
preferred label: gremiale @it
preferred label: gremials @en-us
preferred label: gremial @pt
broader: linge ou garniture liés aux sièges
created: 2012-05-16T00:00:00+02:00
definition: Etoffe souvent carrée que l'on place sur les genoux d'un évêque, d'un cardinal ou parfois d'un prêtre. Pour les messes pontificales, le grémial en soie et de la couleur du temps liturgique peut porter des cordons ou des rubans et être bordé de dentelles. Il est en toile blanche pendant les cérémonies où le clerc risque de salir sa chasuble
status: 1
broad match: http://data.bnf.fr/ark:/12148/cb119669330

grémial
type: PreferredTerm
modified: 2014-12-03T11:07:24+01:00
created: 2014-01-15T14:54:24+01:00
status: 1

régulateur
type: PreferredTerm
modified: 2015-08-06T17:03:22+02:00
created: 2014-01-15T14:54:24+01:00
status: 1

piège
type: Concept
modified: 2014-12-12T15:16:42+01:00
in scheme: Thésaurus de la désignation des objets mobiliers
preferred label: traps (trapping equipment) @en-us
broader: armement
created: 2013-11-13T00:00:00+01:00
definition: Dispositif destiné à capturer, détruire, blesser, tuer un adversaire ou un animal.
status: 1
narrow match: http://data.bnf.fr/ark:/12148/cb120106698
narrow match: http://vocab.getty.edu/aat/300247420

piège
type: PreferredTerm
modified: 2014-12-12T15:16:42+01:00
created: 2014-01-15T14:54:24+01:00
status: 1

linge et garniture liés aux fêtes liturgiques et au culte domestique
type: PreferredTerm
modified: 2014-01-10T00:00:00+01:00
created: 2014-01-15T14:54:24+01:00
status: 1

élément de couvrement
type: PreferredTerm
modified: 2014-09-08T11:21:30+02:00
created: 2014-01-15T14:54:24+01:00
status: 1

vaisselier
type: PreferredTerm
modified: 2014-12-04T16:49:46+01:00
created: 2014-01-15T14:54:24+01:00
status: 1

croix encadrée
type: PreferredTerm
modified: 2014-11-26T16:03:54+01:00
created: 2014-01-15T14:54:24+01:00
status: 1

microtome
type: SimpleNonPreferredTerm
modified: 2014-12-15T15:45:59+01:00
created: 2014-01-15T14:54:24+01:00
status: 1

banc d'optique
type: SimpleNonPreferredTerm
modified: 2014-12-15T15:45:59+01:00
created: 2014-01-15T14:54:24+01:00
status: 1

sidérostat
type: SimpleNonPreferredTerm
modified: 2014-12-15T15:45:59+01:00
created: 2014-01-15T14:54:24+01:00
status: 1

instrument de mise en condition ou de préparation
type: PreferredTerm
modified: 2014-12-15T15:45:59+01:00
created: 2014-01-15T14:54:24+01:00
status: 1

centrifugeuse
type: SimpleNonPreferredTerm
modified: 2014-12-15T15:45:59+01:00
created: 2014-01-15T14:54:24+01:00
status: 1

héliostat
type: SimpleNonPreferredTerm
modified: 2014-12-15T15:45:59+01:00
created: 2014-01-15T14:54:24+01:00
status: 1

collimateur
type: SimpleNonPreferredTerm
modified: 2014-12-15T15:45:59+01:00
created: 2014-01-15T14:54:24+01:00
status: 1

spectroscope
type: SimpleNonPreferredTerm
modified: 2014-12-15T15:45:59+01:00
created: 2014-01-15T14:54:24+01:00
status: 1

horizon artificiel
type: SimpleNonPreferredTerm
modified: 2014-12-15T15:45:59+01:00
created: 2014-01-15T14:54:24+01:00
status: 1

ambulance
type: Concept
modified: 2014-12-30T12:05:26+01:00
in scheme: Thésaurus de la désignation des objets mobiliers
preferred label: ambulances @en-us
broader: véhicule terrestre spécialisé motorisé ou non
created: 2013-11-06T00:00:00+01:00
definition: Véhicule destiné au transport des malades ou des blessés possédant le matériel nécessaire à la surveillance et aux premiers soins. Il est généralement équipé d'un système d'avertissement (cloche, sirène, gyrophare) afin de faciliter sa circulation.
status: 1

ambulance
type: PreferredTerm
modified: 2014-12-30T12:05:26+01:00
created: 2014-01-15T14:54:24+01:00
status: 1

expansion
type: Concept
modified: 2014-10-17T16:13:11+02:00
in scheme: Thésaurus de la désignation des objets mobiliers
broader: sculpture
created: 2013-07-19T00:00:00+02:00
definition: Œuvre qui résulte du développement en volume de résine polyuréthanne.
status: 1
broad match: http://data.bnf.fr/ark:/12148/cb11933241b
broad match: http://vocab.getty.edu/aat/300054119

expansion
type: PreferredTerm
modified: 2014-10-17T16:13:11+02:00
created: 2014-01-15T14:54:24+01:00
status: 1

linge lié aux insignes pontificaux
type: Concept
modified: 2014-12-02T15:52:43+01:00
in scheme: Thésaurus de la désignation des objets mobiliers
preferred label: lini e coperture per le insegne pontificali @it
preferred label: linen for pontifical insignia @en-us
preferred label: linhos e guarnições relacionados com insígnias pontificais @pt
broader: linge ou garniture du culte catholique
alternative label: mouchoir d'évêque
alternative label: substratoire
alternative label: doigtier
alternative label: sudarium
alternative label: suaire
alternative label: voile des ornements pontificaux
alternative label: subcinctorium
alternative label: voile de crosse
created: 2012-05-16T00:00:00+02:00
definition: Pièce textile liée aux insignes pontificaux ou aux marques de dignité ecclésiastique.
status: 1
broad match: http://vocab.getty.edu/aat/300209275

linge lié aux ablutions
type: Concept
modified: 2014-12-02T15:50:05+01:00
in scheme: Thésaurus de la désignation des objets mobiliers
preferred label: linen for ablution @en-us
preferred label: lini per l'abluzione @it
preferred label: linhos relacionados com as abluções @pt
narrower: T69-2284
narrower: T69-2282
broader: linge ou garniture du culte catholique
created: 2012-05-16T00:00:00+02:00
definition: Pièce textile servant lors de la préparation ou pour la pratique des rites de l’ablution.
status: 1

linge ou garniture liés à la prédication, à la lecture et au chant
type: Concept
modified: 2014-12-02T17:05:12+01:00
in scheme: Thésaurus de la désignation des objets mobiliers
preferred label: lini e coperture per la predicazione, la lettura e il canto @it
preferred label: linen and ornaments for preaching, reading and singing @en-us
preferred label: guarnições relacionadas com a pregação, a leitura e o canto @pt
narrower: T69-2290
narrower: T69-2287
broader: linge ou garniture du culte catholique
created: 2012-05-16T00:00:00+02:00
definition: Pièce textile destinée à garnir le mobilier lié à la prédication, à la lecture de textes ou au chant, durant la messe.
status: 1
broad match: http://vocab.getty.edu/aat/300204862

linge ou garniture du culte catholique
type: PreferredTerm
modified: 2014-12-02T15:45:32+01:00
created: 2014-01-15T14:54:24+01:00
status: 1

bannière d'église
type: Concept
modified: 2014-10-21T15:53:01+02:00
in scheme: Thésaurus de la désignation des objets mobiliers
broader: linge ou garniture du culte catholique
created: 2013-11-12T00:00:00+01:00
definition: Pièce textile ornée d'un décor et souvent d'inscriptions, placée dans l’église. De forme rectangulaire en général, elle est suspendue à un support horizontal et peut comporter des cordons latéraux.
status: 1

lessiveuse
type: Concept
modified: 2014-12-10T16:09:43+01:00
in scheme: Thésaurus de la désignation des objets mobiliers
preferred label: washboilers @en-us
broader: objet pour l'entretien du linge
created: 2012-05-16T00:00:00+02:00
definition: Grand récipient en métal que l'on place au-dessus du feu, servant à laver le linge dans de l'eau bouillante à laquelle sont ajoutés des agents nettoyants. L'eau bouillante remonte du double fond percé de trous par la cheminée centrale, terminée en haut par un champignon perforé permettant à l'eau de retomber sur le linge.
status: 1
broad match: cb11977219z

lessiveuse
type: PreferredTerm
modified: 2014-12-10T16:09:43+01:00
created: 2014-01-15T14:54:24+01:00
status: 1

dégorgeoir
type: PreferredTerm
modified: 2014-01-10T00:00:00+01:00
created: 2014-01-15T14:54:24+01:00
status: 1

dégorgeoir de moulin
type: SimpleNonPreferredTerm
modified: 2014-01-10T00:00:00+01:00
created: 2014-01-15T14:54:24+01:00
status: 1

écuelle des champs
type: SimpleNonPreferredTerm
modified: 2014-12-08T16:57:19+01:00
created: 2014-01-15T14:54:24+01:00
status: 1

porte-manger
type: SimpleNonPreferredTerm
modified: 2014-12-08T16:57:19+01:00
created: 2014-01-15T14:54:24+01:00
status: 1

boîte des champs
type: SimpleNonPreferredTerm
modified: 2014-12-08T16:57:19+01:00
created: 2014-01-15T14:54:24+01:00
status: 1

porte-dîner
type: PreferredTerm
modified: 2014-12-08T16:57:19+01:00
created: 2014-01-15T14:54:24+01:00
status: 1

porte-soupe
type: SimpleNonPreferredTerm
modified: 2014-12-08T16:57:19+01:00
created: 2014-01-15T14:54:24+01:00
status: 1

pot des champs
type: SimpleNonPreferredTerm
modified: 2014-12-08T16:57:19+01:00
created: 2014-01-15T14:54:24+01:00
status: 1

marque-page
type: Concept
modified: 2014-10-17T12:27:32+02:00
in scheme: Thésaurus de la désignation des objets mobiliers
preferred label: bookmarks @en-us
broader: objet pour écrire ou de bureau
alternative label: liseuse
created: 2012-05-16T00:00:00+02:00
definition: Instrument souple ou rigide, en forme de lame très plate et fine munie parfois d'un crochet, servant à marquer la page d'un livre.
status: 1

liseuse
type: SimpleNonPreferredTerm
modified: 2014-10-17T12:27:32+02:00
created: 2014-01-15T14:54:24+01:00
status: 1

marque-page
type: PreferredTerm
modified: 2014-10-17T12:27:32+02:00
created: 2014-01-15T14:54:24+01:00
status: 1

aiguière et bassin de la Pâque
type: PreferredTerm
modified: 2014-01-10T00:00:00+01:00
created: 2014-01-15T14:54:24+01:00
status: 1

aiguière et bassin de Pâque
type: SimpleNonPreferredTerm
modified: 2014-01-10T00:00:00+01:00
created: 2014-01-15T14:54:24+01:00
status: 1

porte-luminaire
type: PreferredTerm
modified: 2014-12-04T12:00:44+01:00
created: 2014-01-15T14:54:24+01:00
status: 1

bassin de lit
type: PreferredTerm
modified: 2014-01-10T00:00:00+01:00
created: 2014-01-15T14:54:24+01:00
status: 1

bassin d'accouchée
type: SimpleNonPreferredTerm
modified: 2014-01-10T00:00:00+01:00
created: 2014-01-15T14:54:24+01:00
status: 1

accessoire d'aide au malade
type: Concept
modified: 2014-01-10T00:00:00+01:00
in scheme: Thésaurus de la désignation des objets mobiliers
narrower: bassin de lit
narrower: T69-4313
narrower: T69-4336
narrower: T69-9551
broader: matériel médical
created: 2013-12-10T00:00:00+01:00
status: 1

exposition
type: Concept
modified: 2014-12-01T16:36:33+01:00
in scheme: Thésaurus de la désignation des objets mobiliers
preferred label: tronetto per esposizione eucaristia @it
preferred label: exposition thrones @en-us
preferred label: expositório eucarístico @pt
broader: meuble lié à l'Eucharistie
alternative label: trône d'exposition
created: 2012-05-16T00:00:00+02:00
definition: Structure placée sur un autel comportant un support sur lequel est exposé l'ostensoir lors de la cérémonie de l'adoration du saint sacrement. Elle peut être mobile ou fixée sur le tabernacle et comporte souvent un panneau de fond ou une gloire, et un dais.
status: 1
broad match: http://data.bnf.fr/ark:/12148/cb119489917
broad match: Mobilier liturgique

exposition
type: PreferredTerm
modified: 2014-12-01T16:36:33+01:00
created: 2014-01-15T14:54:24+01:00
status: 1

trône d'exposition
type: SimpleNonPreferredTerm
modified: 2014-12-01T16:36:33+01:00
created: 2014-01-15T14:54:24+01:00
status: 1

gilet pare-éclat
type: SimpleNonPreferredTerm
modified: 2014-09-02T17:44:30+02:00
created: 2014-01-15T14:54:24+01:00
status: 1

masque balistique
type: SimpleNonPreferredTerm
modified: 2014-09-02T17:44:30+02:00
created: 2014-01-15T14:54:24+01:00
status: 1

arme défensive
type: PreferredTerm
modified: 2014-09-02T17:44:30+02:00
created: 2014-01-15T14:54:24+01:00
status: 1

gilet pare-balle
type: SimpleNonPreferredTerm
modified: 2014-09-02T17:44:30+02:00
created: 2014-01-15T14:54:24+01:00
status: 1

protection NBC
type: Concept
modified: 2014-12-12T14:13:27+01:00
in scheme: Thésaurus de la désignation des objets mobiliers
preferred label: NBC suits @en-us
broader: arme défensive
alternative label: combinaison de protection NBC
alternative label: masque à gaz
alternative label: masque anti-gaz
alternative label: tenue de protection à port permanent
created: 2013-11-13T00:00:00+01:00
related: vêtement spécifique de militaire
definition: Pièce de protection (combinaison, masque, etc.) contre les attaques nucléaire, bactériologique ou chimique.
TermeAssocie: vêtement spécifique de militaire
status: 1
broad match: http://data.bnf.fr/ark:/12148/cb119377212
broad match: http://vocab.getty.edu/aat/300209266

marque à biscuits
type: PreferredTerm
modified: 2014-10-16T15:46:22+02:00
created: 2014-01-15T14:54:24+01:00
status: 1

baromètre
type: Concept
modified: 2014-12-15T15:10:34+01:00
in scheme: Thésaurus de la désignation des objets mobiliers
preferred label: barometers @en-us
broader: instrument de mesure des forces des poids ou des pressions
alternative label: instrument de mesure de la pression atmosphérique
created: 2012-05-16T00:00:00+02:00
definition: Instrument de mesure de la force exercée par le poids de l’air par déplacement d’une colonne liquide, ou déformation de membranes ou de capsules (baromètres, barographes), exprimée en fractions et multiples de bar ou Pascal, ou en kg/cm².
status: 1

piézomètre
type: SimpleNonPreferredTerm
modified: 2014-12-15T15:08:03+01:00
created: 2014-01-15T14:54:24+01:00
status: 1

instrument de mesure de vitesse
type: Concept
modified: 2014-12-15T15:11:41+01:00
in scheme: Thésaurus de la désignation des objets mobiliers
broader: instrument de mesure des forces des poids ou des pressions
alternative label: loch
alternative label: tachymètre
alternative label: stroboscope
alternative label: anémomètre
created: 2012-05-16T00:00:00+02:00
definition: Instrument de mesure et/ou d'enregistrement de la vitesse de déplacement ou de rotation d'un mobile quelconque, de la vitesse d'écoulement (ou débit) d'un fluide, de la célérité d'ondes électromagnétiques.
status: 1
narrow match: Tachymètre
broad match: http://vocab.getty.edu/aat/300207870

dynamomètre
type: SimpleNonPreferredTerm
modified: 2014-12-15T15:08:02+01:00
created: 2014-01-15T14:54:24+01:00
status: 1

manomètre
type: SimpleNonPreferredTerm
modified: 2014-12-15T15:08:02+01:00
created: 2014-01-15T14:54:24+01:00
status: 1

peson
type: SimpleNonPreferredTerm
modified: 2014-12-15T15:08:03+01:00
created: 2014-01-15T14:54:24+01:00
status: 1

machine à mesurer des paramètres mécaniques
type: Concept
modified: 2015-08-11T15:41:09+02:00
in scheme: Thésaurus de la désignation des objets mobiliers
broader: machine à contrôler
alternative label: débitmètre
created: 2012-05-16T00:00:00+02:00
related: instrument de mesure des forces des poids ou des pressions
definition: Machine à contrôler le niveau ou la valeur d'un ou de plusieurs paramètres mécaniques d'un composant ou d'un élément, tant du point de vue dynamique (accélération, débit, moment d'inertie, puissance, vitesse) que statique (couple, force, pression).
TermeAssocie: instrument de mesure des forces des poids ou des pressions
status: 1
narrow match: http://data.bnf.fr/ark:/12148/cb11973515f
narrow match: Débitmètre
narrow match: http://vocab.getty.edu/aat/300196144

instrument de mesure des forces des poids ou des pressions
type: PreferredTerm
modified: 2014-12-15T15:08:03+01:00
created: 2014-01-15T14:54:24+01:00
status: 1

blochet
type: Concept
modified: 2014-10-15T13:35:22+02:00
in scheme: Thésaurus de la désignation des objets mobiliers
broader: pièce de charpente
created: 2012-05-16T00:00:00+02:00
definition: Petite pièce horizontale d'une ferme de charpente, de position semblable à celle de l'entrait, mais coupée et arrêtée à peu de distance de l'arbalétrier. Le blochet peut être saillant et orné.
status: 1
broad match: http://data.bnf.fr/ark:/12148/cb11977467c

poinçon de charpente
type: Concept
modified: 2014-12-15T15:56:12+01:00
in scheme: Thésaurus de la désignation des objets mobiliers
preferred label: queen posts @en-us
broader: pièce de charpente
created: 2012-05-16T00:00:00+02:00
related: épi de faîtage
definition: Poteau d'une ferme de charpente joignant le milieu de l'entrait à la rencontre des arbalétriers.
TermeAssocie: épi de faîtage
status: 1
broad match: http://data.bnf.fr/ark:/12148/cb11977467c

solive
type: Concept
modified: 2014-12-15T16:35:29+01:00
in scheme: Thésaurus de la désignation des objets mobiliers
preferred label: joists @en-us
broader: pièce de charpente
created: 2012-05-16T00:00:00+02:00
definition: Pièces horizontales d'un plancher posées à distances régulières les unes des autres, sur lesquelles on établit l'aire du parquet, du carrelage, etc.
status: 1
broad match: http://data.bnf.fr/ark:/12148/cb11977467c

entrait
type: Concept
modified: 2014-12-15T15:48:19+01:00
in scheme: Thésaurus de la désignation des objets mobiliers
preferred label: tie beams @en-us
broader: pièce de charpente
created: 2012-05-16T00:00:00+02:00
definition: Pièce maîtresse horizontale d'une ferme de charpente dans laquelle sont assemblés les pieds des arbalétriers, des chevrons-arbalétriers ou des jambes de force. Les extrémités des entraits sont parfois sculptées en forme de gueules grimaçantes et appelées engoulants.
status: 1
broad match: http://data.bnf.fr/ark:/12148/cb11977467c

lambourde
type: SimpleNonPreferredTerm
modified: 2014-10-15T13:34:31+02:00
created: 2014-01-15T14:54:24+01:00
status: 1

pièce de charpente
type: PreferredTerm
modified: 2014-10-15T13:34:31+02:00
created: 2014-01-15T14:54:24+01:00
status: 1

meuble d'imprimerie
type: Concept
modified: 2014-01-10T00:00:00+01:00
in scheme: Thésaurus de la désignation des objets mobiliers
broader: meuble ou aménagement professionnel
alternative label: meuble à galées
created: 2013-12-19T00:00:00+01:00
status: 1

meuble d'imprimerie
type: PreferredTerm
modified: 2014-01-10T00:00:00+01:00
created: 2014-01-15T14:54:24+01:00
status: 1

meuble à galées
type: SimpleNonPreferredTerm
modified: 2014-01-10T00:00:00+01:00
created: 2014-01-15T14:54:24+01:00
status: 1

machine à remplier
type: SimpleNonPreferredTerm
modified: 2015-09-24T17:28:19+02:00
created: 2014-01-15T14:54:24+01:00
status: 1

machine à plier
type: PreferredTerm
modified: 2015-09-24T17:28:19+02:00
created: 2014-01-15T14:54:24+01:00
status: 1

plieuse de rotative
type: SimpleNonPreferredTerm
modified: 2015-09-24T17:28:19+02:00
created: 2014-01-15T14:54:24+01:00
status: 1

plieuse à couteau
type: SimpleNonPreferredTerm
modified: 2015-09-24T17:28:19+02:00
created: 2014-01-15T14:54:24+01:00
status: 1

plieuse à poches
type: SimpleNonPreferredTerm
modified: 2015-09-24T17:28:19+02:00
created: 2014-01-15T14:54:24+01:00
status: 1

lavabo de sacristie
type: Concept
modified: 2014-12-01T16:18:43+01:00
in scheme: Thésaurus de la désignation des objets mobiliers
preferred label: sacristy piscinae @en-us
preferred label: lavabo da sacrestia @it
preferred label: lavabo de sacristia @pt
broader: meuble lié à l'ablution, à l'aspersion et à l'encensement
created: 2012-05-16T00:00:00+02:00
definition: Vasque placée dans la sacristie réservée aux ablutions du célébrant avant et après la messe. On y verse les eaux des purifications ainsi que les résidus de substances bénites après les avoir réduites en cendres.
status: 1

bénitier
type: Concept
modified: 2014-12-01T16:08:19+01:00
in scheme: Thésaurus de la désignation des objets mobiliers
preferred label: holy water stoups @en-us
preferred label: acquasantiera @it
preferred label: pia de água benta @pt
broader: meuble lié à l'ablution, à l'aspersion et à l'encensement
created: 2012-05-16T00:00:00+02:00
related: fonts baptismaux
related: seau à eau bénite
definition: Vasque située, selon les prescriptions liturgiques, près d'une entrée d'église et remplie d'eau bénite avec laquelle les fidèles se signent.
TermeAssocie: fonts baptismaux
TermeAssocie: seau à eau bénite
status: 1

meuble lié à l'ablution, à l'aspersion et à l'encensement
type: PreferredTerm
modified: 2014-12-01T15:54:15+01:00
created: 2014-01-15T14:54:24+01:00
status: 1

porte-seau à eau bénite
type: Concept
modified: 2014-12-01T16:20:25+01:00
in scheme: Thésaurus de la désignation des objets mobiliers
preferred label: holy water bucket stands @en-us
preferred label: portasecchellio per l'acqua benedetta @it
preferred label: suporte para o hissope e caldeirinha de água benta @pt
broader: meuble lié à l'ablution, à l'aspersion et à l'encensement
created: 2012-05-16T00:00:00+02:00
definition: Petit support bas destiné à poser le seau à eau bénite et le goupillon pendant les cérémonies funéraires. Le porte-seau à eau bénite est souvent aux couleurs et à décor funéraires.
status: 1
broad match: Mobilier liturgique

lavabo d'église
type: Concept
modified: 2014-12-01T16:13:50+01:00
in scheme: Thésaurus de la désignation des objets mobiliers
preferred label: piscinae (Christian fixtures) @en-us
preferred label: piscina @it
narrower: T69-711
broader: meuble lié à l'ablution, à l'aspersion et à l'encensement
alternative label: crédence lavabo
alternative label: lavabo à crédence
created: 2012-05-16T00:00:00+02:00
definition: Vasque située près d'un autel, qui servait autrefois aux ablutions du célébrant et à la purification des vases sacrés pendant la messe. Le lavabo comporte une évacuation dans le sol.
status: 1

machine à solidifier
type: Concept
modified: 2014-01-10T00:00:00+01:00
in scheme: Thésaurus de la désignation des objets mobiliers
broader: machine à changer d'état
created: 2012-05-16T00:00:00+02:00
definition: Machine à changer d'état un produit en le faisant passer de l'état liquide ou pâteux à l'état solide.
status: 1

machine à solidifier
type: PreferredTerm
modified: 2014-01-10T00:00:00+01:00
created: 2014-01-15T14:54:24+01:00
status: 1

chandelier pour la clôture du Shabbat
type: SimpleNonPreferredTerm
modified: 2014-01-10T00:00:00+01:00
created: 2014-01-15T14:54:24+01:00
status: 1

bougeoir de Havdalah
type: SimpleNonPreferredTerm
modified: 2014-01-10T00:00:00+01:00
created: 2014-01-15T14:54:24+01:00
status: 1

bougeoir pour la clôture du Shabbat
type: PreferredTerm
modified: 2014-01-10T00:00:00+01:00
created: 2014-01-15T14:54:24+01:00
status: 1

cuissarde
type: SimpleNonPreferredTerm
modified: 2014-12-11T15:54:12+01:00
created: 2014-01-15T14:54:24+01:00
status: 1

ballerine
type: SimpleNonPreferredTerm
modified: 2014-12-11T15:54:11+01:00
created: 2014-01-15T14:54:24+01:00
status: 1

brodequin
type: SimpleNonPreferredTerm
modified: 2014-12-11T15:54:11+01:00
created: 2014-01-15T14:54:24+01:00
status: 1

chaussure
type: PreferredTerm
modified: 2014-12-11T15:54:11+01:00
created: 2014-01-15T14:54:24+01:00
status: 1

espadrille
type: SimpleNonPreferredTerm
modified: 2014-12-11T15:54:12+01:00
created: 2014-01-15T14:54:24+01:00
status: 1

bottine
type: SimpleNonPreferredTerm
modified: 2014-12-11T15:54:12+01:00
created: 2014-01-15T14:54:24+01:00
status: 1

socque
type: SimpleNonPreferredTerm
modified: 2014-12-11T15:54:11+01:00
created: 2014-01-15T14:54:24+01:00
status: 1

galoche
type: SimpleNonPreferredTerm
modified: 2014-12-11T15:54:12+01:00
created: 2014-01-15T14:54:24+01:00
status: 1

guêtre
type: SimpleNonPreferredTerm
modified: 2014-12-11T15:54:11+01:00
created: 2014-01-15T14:54:24+01:00
status: 1

sandale
type: SimpleNonPreferredTerm
modified: 2014-12-11T15:54:11+01:00
created: 2014-01-15T14:54:24+01:00
status: 1

soulier
type: SimpleNonPreferredTerm
modified: 2014-12-11T15:54:11+01:00
created: 2014-01-15T14:54:24+01:00
status: 1

sabot
type: SimpleNonPreferredTerm
modified: 2014-12-11T15:54:11+01:00
created: 2014-01-15T14:54:24+01:00
status: 1

mocassin
type: SimpleNonPreferredTerm
modified: 2014-12-11T15:54:12+01:00
created: 2014-01-15T14:54:24+01:00
status: 1

escarpin
type: SimpleNonPreferredTerm
modified: 2014-12-11T15:54:12+01:00
created: 2014-01-15T14:54:24+01:00
status: 1

babouche
type: SimpleNonPreferredTerm
modified: 2014-12-11T15:54:11+01:00
created: 2014-01-15T14:54:24+01:00
status: 1

chausson
type: SimpleNonPreferredTerm
modified: 2014-12-11T15:54:11+01:00
created: 2014-01-15T14:54:24+01:00
status: 1

pantoufle
type: SimpleNonPreferredTerm
modified: 2014-12-11T15:54:11+01:00
created: 2014-01-15T14:54:24+01:00
status: 1

botte
type: SimpleNonPreferredTerm
modified: 2014-12-11T15:54:11+01:00
created: 2014-01-15T14:54:24+01:00
status: 1

botillon
type: SimpleNonPreferredTerm
modified: 2014-12-11T15:54:11+01:00
created: 2014-01-15T14:54:24+01:00
status: 1

objet commémoratif
type: PreferredTerm
modified: 2014-01-10T00:00:00+01:00
created: 2014-01-15T14:54:24+01:00
status: 1

objet de cérémonie
type: SimpleNonPreferredTerm
modified: 2014-01-10T00:00:00+01:00
created: 2014-01-15T14:54:24+01:00
status: 1

objet de représentation d'élément mécanique
type: Concept
modified: 2014-12-15T16:17:16+01:00
in scheme: Thésaurus de la désignation des objets mobiliers
broader: objet de représentation scientifique et pédagogique
created: 2012-05-16T00:00:00+02:00
definition: Objet de représentation de tout ou partie des pièces mobiles dans un appareil mécanique, machine ou horloge.
status: 1
broad match: http://vocab.getty.edu/aat/300047753
broad match: http://data.bnf.fr/ark:/12148/cb11932446c

objet de représentation d'élément mécanique
type: PreferredTerm
modified: 2014-12-15T16:17:16+01:00
created: 2014-01-15T14:54:24+01:00
status: 1

meuble brûle-parfum
type: PreferredTerm
modified: 2014-10-10T16:16:53+02:00
created: 2014-01-15T14:54:24+01:00
status: 1

album
type: SimpleNonPreferredTerm
modified: 2014-12-03T15:22:28+01:00
created: 2014-01-15T14:54:24+01:00
status: 1

codex
type: SimpleNonPreferredTerm
modified: 2014-12-03T15:22:28+01:00
created: 2014-01-15T14:54:24+01:00
status: 1

brochure
type: SimpleNonPreferredTerm
modified: 2014-12-03T15:22:28+01:00
created: 2014-01-15T14:54:24+01:00
status: 1

livre liturgique
type: Concept
modified: 2014-12-03T15:25:55+01:00
in scheme: Thésaurus de la désignation des objets mobiliers
preferred label: liturgical books @en-us
narrower: T69-8048
narrower: T69-8049
broader: livre
alternative label: antiphonaire
alternative label: évangéliaire
alternative label: psautier
alternative label: bréviaire
created: 2013-07-22T00:00:00+02:00
related: plat de livre liturgique
related: couverture de livre liturgique
definition: Recueil de textes qui contiennent les prières, les rituels, les actions, les cérémonies et qui sont utilisés dans un culte religieux officiels public ou privé.
TermeAssocie: plat de livre liturgique
TermeAssocie: couverture de livre liturgique
status: 1

livre manuscrit
type: SimpleNonPreferredTerm
modified: 2014-12-03T15:22:28+01:00
created: 2014-01-15T14:54:24+01:00
status: 1

reliure
type: Concept
modified: 2014-12-03T15:33:09+01:00
in scheme: Thésaurus de la désignation des objets mobiliers
preferred label: bindings @en-us
broader: livre
created: 2013-07-22T00:00:00+02:00
related: plat de livre liturgique
definition: Couverture d'un livre en ivoire, étoffe, peau, métal, bois, ou carton. Les plats et le dos peuvent être sculptés ou être recouverts de tissu, de peau ou de métal, plus ou moins ornés. La reliure peut être fermée par des liens noués ou des fermoirs.
TermeAssocie: plat de livre liturgique
status: 1

almanach
type: SimpleNonPreferredTerm
modified: 2014-12-03T15:22:28+01:00
created: 2014-01-15T14:54:24+01:00
status: 1

catalogue
type: SimpleNonPreferredTerm
modified: 2014-12-03T15:22:28+01:00
created: 2014-01-15T14:54:24+01:00
status: 1

livre sacré
type: Concept
modified: 2014-10-17T15:48:02+02:00
in scheme: Thésaurus de la désignation des objets mobiliers
broader: livre
alternative label: bible
alternative label: talmud
alternative label: coran
created: 2013-07-22T00:00:00+02:00
definition: Textes religieux qui font autorité et possèdent un caractère sacré du fait qu'ils sont anciens, qu'ils sont réputés avoir été donnés par des divinités ou bien écrits sous inspiration divine. On assimile aux livres sacrés les livres apocryphes qui se rattachent aux corpus considérés comme canoniques.
status: 1

livre
type: PreferredTerm
modified: 2014-12-03T15:22:28+01:00
created: 2014-01-15T14:54:24+01:00
status: 1

pince de circoncision
type: Concept
modified: 2014-01-10T00:00:00+01:00
in scheme: Thésaurus de la désignation des objets mobiliers
broader: nécessaire de circoncision
created: 2012-05-16T00:00:00+02:00
definition: Pince destinée à saisir et maintenir le prépuce pendant la cérémonie de circoncision afin d'éviter une blessure du gland.
status: 1

pince de circoncision
type: PreferredTerm
modified: 2014-01-10T00:00:00+01:00
created: 2014-01-15T14:54:24+01:00
status: 1

textile du culte protestant
type: Concept
modified: 2014-01-10T00:00:00+01:00
in scheme: Thésaurus de la désignation des objets mobiliers
broader: textile religieux
alternative label: robe de pasteur
created: 2013-11-12T00:00:00+01:00
status: 1