ensemble concerté
created: 2013-05-27T15:03:25+02:00
modified: 2016-03-25T12:26:48+01:00
status: 1
type: Concept
definition: Ensemble dans lequel les liaisons ont été crées par les décisions simultanées ou successives d'une ou de plusieurs personnes suivant un programme.
in scheme: T7
narrower: T7-25