ensemble de plan orthogonal
created: 2013-05-27T15:03:25+02:00
modified: 2016-06-01T17:24:04+02:00
status: 1
type: Concept
alternative label: plan orthogonal
broader: T7-25
definition: Plan d'un ensemble formé d'îlots ou de bâtiments carrés ou rectangulaires séparés par des voies qui se croisent en angle droit.
in scheme: T7
narrower: T7-27
preferred label: grid plan @en