ensemble de plan radioconcentrique
created: 2013-05-27T15:03:25+02:00
modified: 2016-06-01T17:31:05+02:00
status: 1
type: Concept
alternative label: plan radioconcentrique
broad match: http://vocab.getty.edu/aat/300166381
broader: T7-28
definition: Plan rayonnant dans lequel un ou plusieurs cercles sont centrés sur le point de convergence de ces lignes.
in scheme: T7