jardin régulier
created: 2013-05-27T15:03:25+02:00
modified: 2016-03-25T14:45:45+01:00
status: 1
type: Concept
definition: Jardin dans lequel dominent les tracés rectilignes et orthogonaux. Il comporte un ou plusieurs axes de composition et de symétrie ainsi que des parties constituantes traitées en surface ou en volume selon des formes géométriques simples.
in scheme: T7
preferred label: formal garden @en