verrière à losanges
created: 2013-06-03T14:15:23+02:00
modified: 2016-06-08T15:34:18+02:00
status: 1
type: Concept
alternative label: verrière en losanges
broader: T92-68
definition: Verrière géométrique composée de losanges.
in scheme: T92