oculus de réseau
created: 2013-06-03T14:15:23+02:00
modified: 2016-06-08T14:38:33+02:00
status: 1
type: Concept
broader: T92-76
definition: Jour circulaire ou ovale, constituant l'élément central d'un réseau.
in scheme: T92