bois fruitier
created: 2013-06-03T14:50:54+02:00
modified: 2013-05-27T00:00:00+02:00
status: 1
type: Concept
broader: T94-167
in scheme: T94
narrower: T94-169
narrower: T94-171
narrower: T94-173
narrower: T94-174
narrower: T94-175
narrower: T94-176
scope note: Le noyer n'est pas pris en compte dans les bois fruitiers car il n'est pas homogène, le citronnier car il est considéré comme un bois exotique.