verre transparent
created: 2013-06-03T14:50:54+02:00
modified: 2013-05-27T00:00:00+02:00
status: 1
type: Concept
broader: T94-281
in scheme: T94
narrower: T94-288
narrower: T94-289
scope note: Pour le vitrail, on utilise par convention le descripteur verre transparent seul, lorsqu'il y a emploi simultané de verre transparent coloré et incolore. Lorsqu'il y a emploi exclusif de verre incolore ou de verre coloré, on écrit : verre transparent (coloré) ou verre transparent (incolore). Coloré et incolore sont des affixes du matériau.