emploi du matériau
created: 2013-06-03T14:50:54+02:00
modified: 2013-05-27T00:00:00+02:00
status: 1
type: Concept
broader: T94-307
in scheme: T94
narrower: T94-310
narrower: T94-311
narrower: T94-312
narrower: T94-313
narrower: T94-314
narrower: T94-315
narrower: T94-316
narrower: T94-317
narrower: T94-318
narrower: T94-319
narrower: T94-320
narrower: T94-321
narrower: T94-322
narrower: T94-323
narrower: T94-324
narrower: T94-325
narrower: T94-326
scope note: Les matériaux très secondaires ne sont notés que dans le champ DESC. Les affixes intérieur et extérieur ne sont généralement employés qu'en complément d'un autre affixe.