couleurs naturelles du matériau
created: 2013-06-03T14:50:54+02:00
modified: 2013-05-27T00:00:00+02:00
status: 1
type: Concept
broader: T94-307
in scheme: T94
narrower: T94-341
narrower: T94-342
narrower: T94-344
narrower: T94-346
narrower: T94-347
narrower: T94-349
narrower: T94-350
narrower: T94-352
narrower: T94-353
narrower: T94-354
narrower: T94-356
narrower: T94-358
narrower: T94-359
narrower: T94-360
narrower: T94-361
scope note: A n'utiliser que si les couleurs apportent une précision utile sur la nature du matériau. Les adjectifs peuvent s'accorder en genre et en nombre selon les règles habituelles des adjectifs de couleur. MATR : marbre veiné (vert) : décor en demi relief, décor dans la masse.