marbre
created: 2013-06-03T14:50:54+02:00
modified: 2013-05-27T00:00:00+02:00
status: 1
type: Concept
broader: T94-81
in scheme: T94
narrower: T94-85
narrower: T94-86
narrower: T94-87
narrower: T94-88
scope note: Les appellations liées à la provenance sont indiquées dans le commentaire DESC. On peut indiquer la couleur : MATR : marbre veiné (vert : poli, décor en demi relief, décor dans la masse).