aqueduc
terme associe: T96-1082
created: 2011-09-01T00:00:00+02:00
modified: 2014-12-01T12:49:56+01:00
status: 1
type: Concept
broader: T96-1003
definition: Conduite d'amenée d'eau. L'aqueduc peut être souterrain ou porté au-dessus du sol par une suite d'arcades.
in scheme: T96
preferred label: aqueducts @en-us
related: T96-1082
scope note: Ne pas appeler aqueduc mais pont-aqueduc les sections aériennes de la conduite d'eau.