canal d'irrigation
terme associe: T96-560
created: 2011-09-01T00:00:00+02:00
modified: 2014-12-01T12:57:28+01:00
status: 1
type: Concept
broader: T96-1007
definition: Canal ayant pour but d’acheminer de l’eau d’un cours d’eau, d’un réservoir, etc. afin d’irriguer des terres. Il est équipé d’ouvrages hydrauliques (vannes, etc.) afin de garantir le débit, distribuer et gérer la ressource.
in scheme: T96
preferred label: Irrigation systems @en-us
related: T96-560