canal de navigation
terme associe: T96-1018
created: 2011-09-01T00:00:00+02:00
modified: 2014-12-01T13:07:15+01:00
status: 1
type: Concept
alternative label: canal de dérivation
alternative label: canal latéral
alternative label: canal à point de partage
broad match: cb11937681n
broad match: Canal (voie d'eau)
broad match: http://vocab.getty.edu/aat/300006075
broader: T96-1007
definition: Canal créé pour le transport des biens et des personnes sur des bateaux. On distingue : - le canal latéral qui est une simple doublure, prenant l’eau dans un cours d’eau en amont et la lui restituant en aval ; - le canal de dérivation qui permet de passer d’un cours d’eau plus élevé dans un autre plus bas ; - le canal à point de partage, c’est-à-dire à deux pentes, reliant deux bassins versants, deux cours d’eau séparés par un relief.
in scheme: T96
related: T96-1018