gare de triage
created: 2011-09-01T00:00:00+02:00
modified: 2014-12-01T13:12:36+01:00
status: 1
type: Concept
alternative label: triage
broader: T96-1003
definition: Ensemble des installations de chemin de fer, de plusieurs kilomètres de long, spécialisées dans le traitement du trafic du fret, où les wagons de marchandises détachés de leur rame initiale sont triés pour être incorporés dans de nouveaux trains. L'ensemble se compose généralement d'un faisceau de voies de réception, d'une butte de triage, d'un faisceau de voies de débranchement ou de triage et d'un faisceau de départ.
in scheme: T96
preferred label: marshalling yards @en-us