site d'écluse
terme associe: T96-1066
created: 2011-09-01T00:00:00+02:00
modified: 2014-12-01T13:33:27+01:00
status: 1
type: Concept
broader: T96-1003
definition: Ensemble constitué de l'écluse et des constructions qui lui sont liées (maison d'éclusier, remise, ouvrage de franchissement, etc.).
in scheme: T96
related: T96-1066
scope note: Ne pas confondre avec chaîne d’écluses, ni avec échelle d’écluses.