voie ferrée
terme associe: T96-1032
terme associe: T96-995
created: 2011-09-01T00:00:00+02:00
modified: 2014-12-01T13:47:49+01:00
status: 1
type: Concept
alternative label: chemin de fer
broader: T96-1003
definition: Ensemble constitué par les rails d'une ligne de chemin de fer, avec ses ouvrages d'art, ses stations, etc.
in scheme: T96
preferred label: railroads @en-us
related: T96-1032
related: T96-995
scope note: La voie ferrée peut être dite normale (écartement des rails de 1,435 m), étroite (écartement inférieur à 1,435 m), métrique (écartement de 1 m), à double écartement (trois rails parallèles permettant la circulation de matériels à plusieurs écartements sur une même plate-forme), à crémaillière (deux rails parallèles, complétés par un troisième rail denté pour assurer la montée de dénivelés importants), à troisième rail (un rail supplémentaire pour l’alimentation électrique).