bief
created: 2011-09-01T00:00:00+02:00
modified: 2014-12-01T13:52:09+01:00
status: 1
type: Concept
alternative label: bief de navigation
broad match: cb11935887s
broader: T96-1018
definition: Fraction d'une voie navigable entre deux chutes (entre deux écluses à sas, entre une écluse à sas et un barrage, etc.).
in scheme: T96
narrower: T96-1020
preferred label: sections of watercourse @en-us
scope note: Ne pas confondre avec bief de dérivation.