gare d'eau
created: 2011-09-01T00:00:00+02:00
modified: 2014-12-01T13:53:41+01:00
status: 1
type: Concept
broad match: Bief
broader: T96-1019
definition: Bief ou partie de bief assez large pour permettre à deux bateaux de se croiser ou de se doubler ; il permet en outre aux bateaux de stationner ou d'attendre leur tour pour franchir une dénivelée sans gêner la navigation. Il peut abriter des fonctions portuaires (chargement, déchargement, stockage).
in scheme: T96