établissement portuaire
terme associe: T96-1013
terme associe: T96-1051
created: 2011-09-01T00:00:00+02:00
modified: 2014-11-28T16:51:57+01:00
status: 1
type: Concept
broader: T96-1022
definition: Édifice lié à la gestion d'un port ou de ses équipements et dépendances.
in scheme: T96
related: T96-1013
related: T96-1051