gare
terme associe: T96-1017
terme associe: T96-1105
terme associe: T96-995
created: 2011-09-01T00:00:00+02:00
modified: 2014-11-28T16:55:48+01:00
status: 1
type: Concept
alternative label: gare de chemin de fer
broader: T96-1022
definition: Édifice ou édicule où s'arrêtent les trains pour l'embarquement, le débarquement et la répartition des voyageurs et des marchandises. Outre un bâtiment de voyageurs, il peut abriter quelques commerces, des bâtiments de stockage et de réparation.
in scheme: T96
narrower: T96-1033
narrower: T96-1034
narrower: T96-1035
narrower: T96-1036
preferred label: railroad stations @en-us
related: T96-1017
related: T96-1105
related: T96-995