halte ferroviaire
created: 2011-09-01T00:00:00+02:00
modified: 2014-10-16T14:04:36+02:00
status: 1
type: Concept
broad match: http://data.bnf.fr/ark:/12148/cb119470471
broad match: http://vocab.getty.edu/aat/300007783
broader: T96-1032
definition: Point d'arrêt dépourvu de bâtiment de voyageurs et de présence permanente de personnel ; les infrastructures ferroviaires y sont généralement très réduites.
in scheme: T96