station de tramway
created: 2011-09-01T00:00:00+02:00
modified: 2014-10-16T14:06:57+02:00
status: 1
type: Concept
broader: T96-1032
definition: Édicule ou édifice destiné à servir d'abri aux voyageurs attendant un tramway.
in scheme: T96
preferred label: streetcar stations @en-us