appontement
terme associe: T96-1106
created: 2011-09-01T00:00:00+02:00
modified: 2014-10-16T14:33:02+02:00
status: 1
type: Concept
alternative label: wharf
broad match: http://data.bnf.fr/ark:/12148/cb119494913
broader: T96-1045
definition: Plate-forme avec tablier généralement sur pilotis fondés dans l’eau, contre laquelle peuvent accoster les bateaux. Le wharf est un appontement construit perpendiculairement à la rive auquel les navires peuvent accoster des deux côtés.
in scheme: T96
preferred label: wharves @en-us
related: T96-1106
scope note: Ne pas confondre avec jetée.