aménagement de bac
created: 2011-09-01T00:00:00+02:00
modified: 2014-10-23T12:36:05+02:00
status: 1
type: Concept
broader: T96-1045
definition: Aménagement établi sur les deux rives d'un cours d'eau, sur le rivage d'un lac, etc., permettant à un bateau traversier, d'accoster, d’embarquer et débarquer personnes, animaux ou véhicules. Dans un bac à traille, l’aménagement comprend également un câble ou traille assurant le guidage du bateau. La traille est généralement soutenue par des chevalets en maçonnerie ou en charpente.
in scheme: T96