bassin de port
terme associe: T96-1013
terme associe: T96-1031
created: 2011-09-01T00:00:00+02:00
modified: 2014-12-01T14:05:20+01:00
status: 1
type: Concept
broader: T96-1045
definition: Partie d'un port réservée à l'ancrage des bateaux, limitée par des quais ou des digues.
in scheme: T96
narrower: T96-1052
narrower: T96-1053
narrower: T96-1054
narrower: T96-1055
preferred label: docks @en-us
related: T96-1013
related: T96-1031