berge aménagée
terme associe: T96-1105
terme associe: T96-405
created: 2011-09-01T00:00:00+02:00
modified: 2014-10-16T14:40:42+02:00
status: 1
type: Concept
broader: T96-1045
definition: Rive d’un plan d’eau ou d’un cours d’eau, modifiée pour la stabiliser et pour faciliter l’accès à l’eau.
in scheme: T96
related: T96-1105
related: T96-405