déversoir de fond
created: 2011-09-01T00:00:00+02:00
modified: 2014-09-23T16:51:29+02:00
status: 1
type: Concept
alternative label: déchargeoir
broad match: cb11979887k
broader: T96-1045
definition: Dans un bief de canal de navigation, ouvrage composé d’une ouverture de fond permettant en cas de crue de suppléer aux insuffisances des déversoirs de superficie pour l’évacuation des eaux excédentaires. Cet ouvrage permet également de vider complètement le bief afin d’en assurer le curage et l’entretien.
in scheme: T96
scope note: Ne pas confondre avec vanne.