déversoir de superficie
created: 2011-09-01T00:00:00+02:00
modified: 2014-12-01T14:24:18+01:00
status: 1
type: Concept
alternative label: déversoir de crue
alternative label: reversoir
alternative label: épanchoir
broad match: cb11979887k
broader: T96-1045
definition: Partie d’un barrage, d’un réservoir ou ouvrage placé sur la berge du bief d’un canal pour évacuer les eaux excédentaires. Dans le cas d’un canal de navigation, un pont peut être construit au-dessus de l’ouvrage pour assurer la continuité du chemin de halage.
in scheme: T96
preferred label: spillways @en-us
scope note: Ne pas confondre avec barrage.