échelle d'écluses
created: 2011-09-01T00:00:00+02:00
modified: 2014-10-23T12:55:36+02:00
status: 1
type: Concept
broad match: Écluse
broader: T96-1066
definition: Succession d'écluses échelonnées qui se touchent, de sorte que les portes aval de la première servent de portes amont à la seconde, etc.
in scheme: T96
scope note: Ne pas confondre avec site d’écluse, ni avec chaîne d’écluses.