égout
created: 2011-09-01T00:00:00+02:00
modified: 2014-12-02T12:04:39+01:00
status: 1
type: Concept
alternative label: émissaire
broader: T96-1045
definition: Conduite généralement souterraine destinée à recueillir les eaux usées et les eaux de pluie.
in scheme: T96
preferred label: égouts @en-us