entrée de port
terme associe: T96-1013
created: 2011-09-01T00:00:00+02:00
modified: 2013-04-23T00:00:00+02:00
status: 1
type: Concept
broader: T96-1045
definition: Ouvrage destiné à marquer l’accès d’un port par une signalisation ou à en assurer la sécurité et la défense.
in scheme: T96
related: T96-1013