ouvrage lié à l'alimentation en eau
created: 2011-09-01T00:00:00+02:00
modified: 2013-04-23T00:00:00+02:00
status: 1
type: Concept
broader: T96-1045
definition: Ouvrage, appartenant le plus souvent à un réseau, permettant à l’aide d’un dispositif de recueillir, puiser, pomper, acheminer, distribuer, etc. de l’eau.
in scheme: T96
narrower: T96-1077
narrower: T96-1078
narrower: T96-1080
narrower: T96-1082
narrower: T96-1083
narrower: T96-1084
narrower: T96-1085
narrower: T96-1088
narrower: T96-1089
narrower: T96-1090
narrower: T96-1091
narrower: T96-1092