conduite forcée
created: 2011-09-01T00:00:00+02:00
modified: 2014-12-02T12:27:04+01:00
status: 1
type: Concept
broader: T96-1076
definition: Conduite en béton armé ou en métal qui amène l'eau sous pression depuis un réservoir jusqu'aux machines de l'usine d'utilisation.
in scheme: T96
narrower: T96-1079
preferred label: penstocks @en-us