réservoir
created: 2011-09-01T00:00:00+02:00
modified: 2014-12-02T12:41:41+01:00
status: 1
type: Concept
broader: T96-1076
definition: Ouvrage dans lequel l'eau peut s'accumuler et être gardée en réserve.
in scheme: T96
narrower: T96-1086
narrower: T96-1087
preferred label: reservoirs @en-us
scope note: Ne pas confondre avec bassin de retenue.